Organisation Name,NACS Code,Organisation Type,Address1,Address2,Address3,Address4,Address5,PostCode,Telephone Number,Opening time,Value  (Opening time),Banding Classification  (Opening time),NHS.UK users rating,Value  (NHS.UK users rating),Banding Classification  (NHS.UK users rating),Car parking (Is there car parking at this organisation?)
Pople & Broad Opticians,OP_5P7_13327__000002_TN218JB,OPT,50 High Street,,Heathfield,East Sussex,,TN21 8JB,Tel: 01435 863232, - ,,,No ratings yet Rate it yourself - /Services/opticians/LeaveReview/DefaultView.aspx?id=OP_5P7_13327__000002_TN218JB,0,0,
Mark Soper Opticians,OP_5LR_13726__000001_BN271AU,OPT,The Grove,72 High Street,Hailsham,East Sussex,,BN27 1AU,Tel: 01323 841699, - ,,,No ratings yet Rate it yourself - /Services/opticians/LeaveReview/DefaultView.aspx?id=OP_5LR_13726__000001_BN271AU,0,0,
Specsavers Opticians,OPT_BN271DP_1,OPT,,16 The Quintins,,Hailsham,East Sussex,BN27 1DP,Tel: 01323 840526, - ,,,No ratings yet Rate it yourself - /Services/opticians/LeaveReview/DefaultView.aspx?id=OPT_BN271DP_1,0,0,
Focus Medical Centre,OP_5LR_5090__000001_BN271BJ,OPT,18 High Street,,Hailsham,East Sussex,,BN27 1BJ,Tel: 01323 442062, - ,,,No ratings yet Rate it yourself - /Services/opticians/LeaveReview/DefaultView.aspx?id=OP_5LR_5090__000001_BN271BJ,0,0,
The Spectacle Showroom Ltd,OP_5P7_1234__000001_BN271AF,OPT,1 St Mary's Walk,High Street,Hailsham,East Sussex,,BN27 1AF,Tel: 01323 440394, - ,,,No ratings yet Rate it yourself - /Services/opticians/LeaveReview/DefaultView.aspx?id=OP_5P7_1234__000001_BN271AF,0,0,
The Spectacle Showroom,TP5AP,OPT,,A3 Ropemaker Park,Diplocks Way,Hailsham,East Sussex,BN27 3GU,Tel: 01323 440394, - ,,,No ratings yet Rate it yourself - /Services/opticians/LeaveReview/DefaultView.aspx?id=TP5AP,0,0,
Specsavers Opticians,OP_5P7_17109__000002_TN221BJ,OPT,100 High Street,,,Uckfield,,TN22 1PX,Tel: 01825 746750, - ,,,No ratings yet Rate it yourself - /Services/opticians/LeaveReview/DefaultView.aspx?id=OP_5P7_17109__000002_TN221BJ,0,0,
Vision Express,OP_5LT_8800__000002_TN221AG,OPT,27 High Street,,Uckfield,,,TN22 1AG,Tel: 01825 767846, - ,,,No ratings yet Rate it yourself - /Services/opticians/LeaveReview/DefaultView.aspx?id=OP_5LT_8800__000002_TN221AG,0,0,
Barracloughs the Opticians,OPT_TN221AP_1,OPT,,53 High Street,,Uckfield,,TN22 1AP,, - ,,,No ratings yet Rate it yourself - /Services/opticians/LeaveReview/DefaultView.aspx?id=OPT_TN221AP_1,0,0,
Barracloughs the Opticians,OP_5LR_1890__000001_BN266AD,OPT,58a High Street,,Polegate,East Sussex,,BN26 6AD,Tel: 01323 487122, - ,,,No ratings yet Rate it yourself - /Services/opticians/LeaveReview/DefaultView.aspx?id=OP_5LR_1890__000001_BN266AD,0,0,
Arthur Hayes Opticians,OP_5LT_2866__000001_TN61DR,OPT,Campbell House,Croft Road,,Crowborough,,TN6 1DR,Tel: 01892 664826, - ,,,1 rating Rate it yourself - /Services/opticians/LeaveReview/DefaultView.aspx?id=OP_5LT_2866__000001_TN61DR,,,
Vision Express,OP_5LT_9107__000001_TN61DA,OPT,The Broadway,,Crowborough,East Sussex,,TN6 1DA,Tel: 01892 661487, - ,,,No ratings yet Rate it yourself - /Services/opticians/LeaveReview/DefaultView.aspx?id=OP_5LT_9107__000001_TN61DA,0,0,
Specsavers Opticians,Q1V1O,OPT,,9A High Street,Crowborough,East Sussex,,TN6 2QA,Tel: 01892 362091, - ,,,No ratings yet Rate it yourself - /Services/opticians/LeaveReview/DefaultView.aspx?id=Q1V1O,0,0,
Wadhurst Opticians,OP_5LT_12442__000001_TN56AA,OPT,The Old Bakery,High Street,Wadhurst,East Sussex,,TN5 6AA,Tel: 01892 782674, - ,,,No ratings yet Rate it yourself - /Services/opticians/LeaveReview/DefaultView.aspx?id=OP_5LT_12442__000001_TN56AA,0,0,
Green & Elliott Optometrists,OP_5FH_1292__000001_TN330EG,OPT,,28 Mount Street,,Battle,,TN33 0EG,Tel: 01424 773487, - ,,,No ratings yet Rate it yourself - /Services/opticians/LeaveReview/DefaultView.aspx?id=OP_5FH_1292__000001_TN330EG,0,0,
Barracloughs the Opticians,OP_5FH_3721__000001_TN330AG,OPT,,64A High Street,,Battle,,TN33 0AG,Tel: 01424 772725, - ,,,No ratings yet Rate it yourself - /Services/opticians/LeaveReview/DefaultView.aspx?id=OP_5FH_3721__000001_TN330AG,0,0,
Simply Vision Opticians,X5N3G,OPT,,26 Cooden Sea Road,,Bexhill-on-Sea,,TN39 4SJ,, - ,,,No ratings yet Rate it yourself - /Services/opticians/LeaveReview/DefaultView.aspx?id=X5N3G,0,0,
Asda Opticians,OP_5P7_2058__000003_BN236JH,OPT,The Crumbles,Pevensey Bay Road,Eastbourne,East Sussex,,BN23 6JH,Tel: 01323 471873, - ,,,No ratings yet Rate it yourself - /Services/opticians/LeaveReview/DefaultView.aspx?id=OP_5P7_2058__000003_BN236JH,0,0,
Spectrum Eyecare,OP_5LT_7843__000001_BN72AH,OPT,,24-25 Cliffe High Street,,Lewes,East Sussex,BN7 2AH,Tel: 01273 480303, - ,,,No ratings yet Rate it yourself - /Services/opticians/LeaveReview/DefaultView.aspx?id=OP_5LT_7843__000001_BN72AH,0,0,
Specsavers Opticians,OP_5P7_17089__000002_BN72AF,OPT,218 High Street,,Lewes,East Sussex,,BN7 2AF,Tel: 01273 407690, - ,,,No ratings yet Rate it yourself - /Services/opticians/LeaveReview/DefaultView.aspx?id=OP_5P7_17089__000002_BN72AF,0,0,
"Wilson, Wilson & Hancock",OP_5LT_2563__000001_BN72AF,OPT,223a High Street,Lewes,,East Sussex,,BN7 2AF,Tel: 01273 472360, - ,,,No ratings yet Rate it yourself - /Services/opticians/LeaveReview/DefaultView.aspx?id=OP_5LT_2563__000001_BN72AF,0,0,
Green & Elliott Optometrists,OP_5LR_1291__000002_BN211SD,OPT,10 Albert Parade,Green Street,,Eastbourne,,BN21 1SD,Tel: 01323 645123, - ,,,No ratings yet Rate it yourself - /Services/opticians/LeaveReview/DefaultView.aspx?id=OP_5LR_1291__000002_BN211SD,0,0,
Barracloughs the Opticians,OP_5FH_12491__000001_TN401DT,OPT,,41 Western Road,,Bexhill-on-Sea,,TN40 1DT,Tel: 01424 219543, - ,,,No ratings yet Rate it yourself - /Services/opticians/LeaveReview/DefaultView.aspx?id=OP_5FH_12491__000001_TN401DT,0,0,
Green & Elliott Optometrists,OP_5FH_2952__000001_TN393JE,OPT,,36 Sackville Road,,Bexhill-on-Sea,,TN39 3JE,Tel: 01424 212544, - ,,,No ratings yet Rate it yourself - /Services/opticians/LeaveReview/DefaultView.aspx?id=OP_5FH_2952__000001_TN393JE,0,0,
Specsavers,OP_5P8_2552__000001_TN401DX,OPT,6 Western Road,,Bexhill On Sea,East Sussex,,TN40 1DX,Tel: 01424 739110, - ,,,No ratings yet Rate it yourself - /Services/opticians/LeaveReview/DefaultView.aspx?id=OP_5P8_2552__000001_TN401DX,0,0,
Vision Express,OP_5FH_9524__000001_TN401BD,OPT,43 Devonshire Road,,Bexhill-on-Sea,,,TN40 1BD,Tel: 01424 219306, - ,,,No ratings yet Rate it yourself - /Services/opticians/LeaveReview/DefaultView.aspx?id=OP_5FH_9524__000001_TN401BD,0,0,
Botts Opticians,OPT_BN214TJ_1,OPT,,4a Grove Road,,Eastbourne,East Sussex,BN21 4TJ,Tel: 01323 727782, - ,,,No ratings yet Rate it yourself - /Services/opticians/LeaveReview/DefaultView.aspx?id=OPT_BN214TJ_1,0,0,
Specsavers Opticians,OP_5LR_2426__000001_BN213QL,OPT,8b Arndale centre,Terminus road,Eastbourne,East Sussex,,BN21 3QP,Tel: 01323 649767, - ,,,No ratings yet Rate it yourself - /Services/opticians/LeaveReview/DefaultView.aspx?id=OP_5LR_2426__000001_BN213QL,0,0,
Boots Opticians -Eastbourne (in Boots UK),OP_5LR_41__000001_BN213NW,OPT,15 Eastbourne Arndale Centre,15 The Beacon,,Eastbourne,East Sussex,BN21 3NL,Tel: 01323 411042, - ,,,No ratings yet Rate it yourself - /Services/opticians/LeaveReview/DefaultView.aspx?id=OP_5LR_41__000001_BN213NW,0,0,
Vision Express,OP_5LR_12544__000003_BN213NW,OPT,,134 Terminus Road,The Beacon,Eastbourne,,BN21 3AN,Tel: 01323 722975, - ,,,No ratings yet Rate it yourself - /Services/opticians/LeaveReview/DefaultView.aspx?id=OP_5LR_12544__000003_BN213NW,0,0,
Barracloughs the Opticians,OP_5LR_9446__000001_BN213BB,OPT,194 Terminus Road,,Eastbourne,East Sussex,,BN21 3BB,Tel: 01323 721906, - ,,,No ratings yet Rate it yourself - /Services/opticians/LeaveReview/DefaultView.aspx?id=OP_5LR_9446__000001_BN213BB,0,0,
Peepers,OP_5FF_9945__000001_TN11XU,OPT,49 High Street,Tunbridge Wells,Kent,,,TN1 1XU,Tel: 01892 534481, - ,,,No ratings yet Rate it yourself - /Services/opticians/LeaveReview/DefaultView.aspx?id=OP_5FF_9945__000001_TN11XU,0,0,
David Clulow,OPT_TN11NX_1,OPT,,32-34 High Street,,Tunbridge Wells,Kent,TN1 1NX,Tel: 01892 512385, - ,,,No ratings yet Rate it yourself - /Services/opticians/LeaveReview/DefaultView.aspx?id=OPT_TN11NX_1,0,0,
Scrivens Opticians (Tunbridge Wells),OP_5FF_11300__000001_TN11PN,OPT,29 Mount Pleasant,,Kent,Tunbridge Wells,,TN1 1PN,Tel: 01892 527999, - ,,,No ratings yet Rate it yourself - /Services/opticians/LeaveReview/DefaultView.aspx?id=OP_5FF_11300__000001_TN11PN,0,0,
Edney & Edney,OPT_TN11LS_1,OPT,,35 Monson Road,,Tunbridge Wells,,TN1 1LS,Tel: 01892 517986, - ,,,No ratings yet Rate it yourself - /Services/opticians/LeaveReview/DefaultView.aspx?id=OPT_TN11LS_1,0,0,
Edney & Edney Ltd,CO-5383,OPT,,35 Monson Road,,"Tunbridge Wells, Kent ",,TN1 1LS,, - ,,,No ratings yet Rate it yourself - /Services/opticians/LeaveReview/DefaultView.aspx?id=CO-5383,0,0,
Boots-Tunbridge Wells - Calverley Rd,OP_5FF_12824__000001_TN12UU,OPT,49 Calverley Road,,,Tunbridge Wells,Kent,TN1 2TT,Tel: 01892 525 561, - ,,,No ratings yet Rate it yourself - /Services/opticians/LeaveReview/DefaultView.aspx?id=OP_5FF_12824__000001_TN12UU,0,0,
Specsavers (Tunbridge Wells),OP_5FF_2826__000001_TN11QR,OPT,119 Mount Pleasant Road,,Kent,Tunbridge Wells,,TN1 1QR,Tel: 01892 533550, - ,,,1 rating Rate it yourself - /Services/opticians/LeaveReview/DefaultView.aspx?id=OP_5FF_2826__000001_TN11QR,,,
Vision Express (Tunbridge Wells),OP_5FF_1__000001_TN12TH,OPT,23 Calverley Road,,Kent,Tunbridge Wells,,TN1 2TH,Tel: 01892 537585, - ,,,3 ratings Rate it yourself - /Services/opticians/LeaveReview/DefaultView.aspx?id=OP_5FF_1__000001_TN12TH,,,
Boots-Tunbridge Wells - Calverley Rd (in Boots UK),OP_5FF_11550__000002_TN12TE,OPT,7-11 Calverley Road,,,Tunbridge Wells,Kent,TN1 2TE,Tel: 01892 546063, - ,,,No ratings yet Rate it yourself - /Services/opticians/LeaveReview/DefaultView.aspx?id=OP_5FF_11550__000002_TN12TE,0,0,
Leightons Opticians and Hearing Care,TP4N9,OPT,,2 Goods Station Road,,Tunbridge Wells,Kent,TN1 2BJ,Tel: 01892 539808, - ,,,No ratings yet Rate it yourself - /Services/opticians/LeaveReview/DefaultView.aspx?id=TP4N9,0,0,
Tesco Opticians,10006__000002_TN389RB,OPT,Church Wood Drive,,St Leonards-on-Sea,East Sussex,,TN38 9RB,Tel: 01424 789438, - ,,,No ratings yet Rate it yourself - /Services/opticians/LeaveReview/DefaultView.aspx?id=10006__000002_TN389RB,0,0,
Linda Pope Optician,OPT_TN184EY_1,OPT,,"Venture House, Rye Road",,Hawkhurst,Kent,TN18 4EY,Tel: 01580 753744, - ,,,No ratings yet Rate it yourself - /Services/opticians/LeaveReview/DefaultView.aspx?id=OPT_TN184EY_1,0,0,
Specsavers Opticians,OP_5P7_3128__000002_BN251NF,OPT,34 Broad Street,,Seaford,East Sussex,,BN25 1NF,Tel: 01323 493050, - ,,,No ratings yet Rate it yourself - /Services/opticians/LeaveReview/DefaultView.aspx?id=OP_5P7_3128__000002_BN251NF,0,0,
Redgold Opticians,OP_5LR_7409__000001_BN251LA,OPT,32 Broad Street,,Seaford,,,BN25 1ND,Tel: 01323 890200, - ,,,No ratings yet Rate it yourself - /Services/opticians/LeaveReview/DefaultView.aspx?id=OP_5LR_7409__000001_BN251LA,0,0,
Hastings Sedlescombe Road Specsavers Limited,Y1M6U,OPT,,"Sainsburys Sedlescombe Road, John Macadam Way",,St. Leonards-on-Sea,East Sussex,TN37 7SQ,Tel: 01424 619730, - ,,,No ratings yet Rate it yourself - /Services/opticians/LeaveReview/DefaultView.aspx?id=Y1M6U,0,0,
Sussex Eyecare Ltd,CO2386__000003_BN251LS,OPT,,9 Broad Street,,Seaford,,BN25 1LS,Tel: 01323 892211, - ,,,No ratings yet Rate it yourself - /Services/opticians/LeaveReview/DefaultView.aspx?id=CO2386__000003_BN251LS,0,0,
Barracloughs the Opticians,OP_5LR_2083__000001_BN251DJ,OPT,The Old Cottage,Dane Road,Seaford,Seaford,,BN25 1DJ,Tel: 01323 898777, - ,,,No ratings yet Rate it yourself - /Services/opticians/LeaveReview/DefaultView.aspx?id=OP_5LR_2083__000001_BN251DJ,0,0,
Barracloughs the Opticians,9003,OPT,,23 Sedlescombe Road North,,"Silver Hill, St Leonards on Sea",,TN37 7DA,, - ,,,No ratings yet Rate it yourself - /Services/opticians/LeaveReview/DefaultView.aspx?id=9003,0,0,
Eye Concern,DOMICILIARYEYECARE1,OPT,,"134 London Road, Southborough",,Tunbridge Wells,,TN4 0PL,Tel: 01892 517312, - ,,,5 ratings Rate it yourself - /Services/opticians/LeaveReview/DefaultView.aspx?id=DOMICILIARYEYECARE1,,,
Day Lewis Opticians (Southborough),OPT_TN40PN_1,OPT,,100 London Road,,Southborough,,TN4 0PN,Tel: 01892 529626, - ,,,No ratings yet Rate it yourself - /Services/opticians/LeaveReview/DefaultView.aspx?id=OPT_TN40PN_1,0,0,
Scrivens,OPT_BN108BB_1,OPT,,10-11 Meridian Centre,,Peacehaven,Sussex,BN10 8BB,Tel: 01273 585359, - ,,,No ratings yet Rate it yourself - /Services/opticians/LeaveReview/DefaultView.aspx?id=OPT_BN108BB_1,0,0,
Lindfield Eyecare,OPT_RH162HN_1,OPT,,53 High Street,,Lindfield,West Sussex,RH16 2HN,Tel: 01444 484123, - ,,,No ratings yet Rate it yourself - /Services/opticians/LeaveReview/DefaultView.aspx?id=OPT_RH162HN_1,0,0,
Ingram & Schofield,OP_5LT_8428__000001_BN108JR,OPT,224 South Coast Road,,Peacehaven,East Sussex,,BN10 8JR,Tel: 01273 582549, - ,,,1 rating Rate it yourself - /Services/opticians/LeaveReview/DefaultView.aspx?id=OP_5LT_8428__000001_BN108JR,,,
"Wilson, Wilson & Hancock",OP_5FJ_6655__000001_TN341DJ,OPT,12-14 Cambridge Road,,Hastings,East Sussex,,TN34 1DJ,Tel: 01424 421717, - ,,,2 ratings Rate it yourself - /Services/opticians/LeaveReview/DefaultView.aspx?id=OP_5FJ_6655__000001_TN341DJ,,,
Claire Reed Optician,OP_5FH_9565__000001_TN316LB,OPT,Dixter Road,Northiam,Rye,East Sussex,,TN31 6LB,Tel: 01797 252411, - ,,,No ratings yet Rate it yourself - /Services/opticians/LeaveReview/DefaultView.aspx?id=OP_5FH_9565__000001_TN316LB,0,0,
Vision Express,OP_5P8_1881__000001_TN341QR,OPT,3 Priory Meadow Shopping Centre,Queens Road,Hastings,East Sussex,,TN34 1PH,Tel: 01424 720957, - ,,,No ratings yet Rate it yourself - /Services/opticians/LeaveReview/DefaultView.aspx?id=OP_5P8_1881__000001_TN341QR,0,0,
Specsavers Opticians,OP_5FJ_4361__000002_TN341PH,OPT,Unit Qr40 Priory Meadow Shopping Centre,Queens Road,Hastings,East Sussex,,TN34 1PH,Tel: 01424 717900, - ,,,No ratings yet Rate it yourself - /Services/opticians/LeaveReview/DefaultView.aspx?id=OP_5FJ_4361__000002_TN341PH,0,0,
Boots-Hastings - Kings Walk,OP_5FJ_6818__000003_TN341PH,OPT,"Kings Walk, Priory Meadows",,,Hastings,East Sussex,TN34 1PH,Tel: 01424 718365, - ,,,1 rating Rate it yourself - /Services/opticians/LeaveReview/DefaultView.aspx?id=OP_5FJ_6818__000003_TN341PH,,,
Scrivens Opticians,OP_5FK_4893__000001_RH164LX,OPT,,86 South Road,,Haywards Heath,West Sussex,RH16 4LA,Tel: 01444 454721, - ,,,No ratings yet Rate it yourself - /Services/opticians/LeaveReview/DefaultView.aspx?id=OP_5FK_4893__000001_RH164LX,0,0,
Leightons Opticians & Hearing Care,OP_5FK_9605__000003_RH163TH,OPT,Leightons Opticians,27 The Orchards Shopping Centre,,Haywards Heath,West Sussex,RH16 3TH,Tel: 01444 416877, - ,,,No ratings yet Rate it yourself - /Services/opticians/LeaveReview/DefaultView.aspx?id=OP_5FK_9605__000003_RH163TH,0,0,
Boots-Haywards Heath,OP_5FK_4058__000002_RH163TH,OPT,Unit 3 The Orchards,,Haywards Heath,West Sussex,,RH16 3TH,Tel: 01444 441025, - ,,,No ratings yet Rate it yourself - /Services/opticians/LeaveReview/DefaultView.aspx?id=OP_5FK_4058__000002_RH163TH,0,0,
Specsavers Opticians,SS002__000001_RH164JW,OPT,89 South Road,,Haywards Heath,West Sussex,,RH16 4JW,Tel: 01444 255990, - ,,,No ratings yet Rate it yourself - /Services/opticians/LeaveReview/DefaultView.aspx?id=SS002__000001_RH164JW,0,0,
Vision Express,OP_5FK_10444__000002_RH164LN,OPT,94 South Road,,Haywards Heath,West Sussex,,RH16 4LN,Tel: 01444 413742, - ,,,No ratings yet Rate it yourself - /Services/opticians/LeaveReview/DefaultView.aspx?id=OP_5FK_10444__000002_RH164LN,0,0,
Optical Revolution,OP_5FK_2556__000001_RH164LR,OPT,103 South Road,,Haywards Heath,West Sussex,,RH16 4LR,Tel: 01444 450193, - ,,,1 rating Rate it yourself - /Services/opticians/LeaveReview/DefaultView.aspx?id=OP_5FK_2556__000001_RH164LR,,,
The Deans Optician,9010,OPT,,18 Longridge Avenue,,Saltdean,East Sussex,BN2 8LH,Tel: 01273 303111, - ,,,7 ratings Rate it yourself - /Services/opticians/LeaveReview/DefaultView.aspx?id=9010,,,yes
UKP Consultancy Ltd t/a Dolphins Optometrists,OPT_RH164AL_1,OPT,,Dolphin House,33 Muster Green,Haywards Heath,West Sussex,RH16 4AL,Tel: 01444 454808, - ,,,No ratings yet Rate it yourself - /Services/opticians/LeaveReview/DefaultView.aspx?id=OPT_RH164AL_1,0,0,
The Hammond Optical Practice,OP_5L2_6686__000001_TN173RB,OPT,,High Street,,Cranbrook,Kent,TN17 3RB,Tel: 01580 715008, - ,,,No ratings yet Rate it yourself - /Services/opticians/LeaveReview/DefaultView.aspx?id=OP_5L2_6686__000001_TN173RB,0,0,
Peter Jones Opticians,OP_5L2_1737__000001_TN173HE,OPT,25 Stone Street,Cranbrook,Kent,,,TN17 3HE,Tel: 01580 712254, - ,,,1 rating Rate it yourself - /Services/opticians/LeaveReview/DefaultView.aspx?id=OP_5L2_1737__000001_TN173HE,,,
Early and Edmonds,TP3XP,OPT,,"7 Keymer Parade, Keymer Road",,Burgess Hill,West Sussex,RH15 0AB,Tel: 01444 236367, - ,,,3 ratings Rate it yourself - /Services/opticians/LeaveReview/DefaultView.aspx?id=TP3XP,,,
Vision Express,W1004__000004_RH159DE,OPT,19 Station Road,,Burgess Hill,West Sussex,,RH15 9DE,Tel: 01444 232402, - ,,,No ratings yet Rate it yourself - /Services/opticians/LeaveReview/DefaultView.aspx?id=W1004__000004_RH159DE,0,0,
Specsavers Opticians,OP_5FK_6271__000001_RH159BB,OPT,43 Church Road,,Burgess Hill,West Sussex,,RH15 9BB,Tel: 01444 257722, - ,,,1 rating Rate it yourself - /Services/opticians/LeaveReview/DefaultView.aspx?id=OP_5FK_6271__000001_RH159BB,,,
Gardiner Opticians,OP_5FK_10075__000001_RH159BQ,OPT,,9 Church Road,Burgess Hill,West Sussex,,RH15 9BB,Tel: 01444 248277, - ,,,No ratings yet Rate it yourself - /Services/opticians/LeaveReview/DefaultView.aspx?id=OP_5FK_10075__000001_RH159BQ,0,0,
Boots Opticians,OPT_RH159NP_1,OPT,,22-22a Market Place,,Burgess Hill,,RH15 9NP,, - ,,,No ratings yet Rate it yourself - /Services/opticians/LeaveReview/DefaultView.aspx?id=OPT_RH159NP_1,0,0,
Boots-East Grinstead,OP_5FK_9105__000001_RH194DW,OPT,"Unit K, Queenswalk Shopping Centre",,,East Grinstead,Sussex,RH19 4DW,Tel: 01342 300708, - ,,,No ratings yet Rate it yourself - /Services/opticians/LeaveReview/DefaultView.aspx?id=OP_5FK_9105__000001_RH194DW,0,0,
Specsavers Opticians,SS001__000002_RH191AB,OPT,74 - 76 London Road,,East Grinstead,West Sussex,,RH19 1AB,Tel: 01342 335360, - ,,,No ratings yet Rate it yourself - /Services/opticians/LeaveReview/DefaultView.aspx?id=SS001__000002_RH191AB,0,0,
Alexander Opticians,OP_5FK_7452__000002_RH191EQ,OPT,97 London Road,,East Grinstead,West Sussex,,RH19 1EQ,Tel: 01342 323115, - ,,,No ratings yet Rate it yourself - /Services/opticians/LeaveReview/DefaultView.aspx?id=OP_5FK_7452__000002_RH191EQ,0,0,
Scrivens Opticians,OP_5FK_12754__000001_RH191EQ,OPT,71 London Road,,,East Grinstead,West Sussex,RH19 1EQ,Tel: 01342 321657, - ,,,No ratings yet Rate it yourself - /Services/opticians/LeaveReview/DefaultView.aspx?id=OP_5FK_12754__000001_RH191EQ,0,0,
Scrivens Opticians (Tonbridge),OP_5FF_13081__000001_TN91TE,OPT,8 The Pavilion,High Street,Tonbridge,Kent,,TN9 1TE,Tel: 01732 352565, - ,,,No ratings yet Rate it yourself - /Services/opticians/LeaveReview/DefaultView.aspx?id=OP_5FF_13081__000001_TN91TE,0,0,
Specsavers (Tonbridge),00289__000001_TN91SQ,OPT,15 High Street,,Tonbridge,Kent,,TN9 1SQ,Tel: 01732 370480, - ,,,2 ratings Rate it yourself - /Services/opticians/LeaveReview/DefaultView.aspx?id=00289__000001_TN91SQ,,,
Asda Opticians Ltd,OP_5LQ_2058__000002_BN18AS,OPT,1 Crowhurst Road,Hollingbury,Brighton,East Sussex,,BN1 8AS,Tel: 01273 560412, - ,,,No ratings yet Rate it yourself - /Services/opticians/LeaveReview/DefaultView.aspx?id=OP_5LQ_2058__000002_BN18AS,0,0,
Elaine M Yorwarth,00156__000001_TN126DP,OPT,70 Commercial Road,,Paddock Wood,Kent,,TN12 6DP,Tel: 01892 833017, - ,,,No ratings yet Rate it yourself - /Services/opticians/LeaveReview/DefaultView.aspx?id=00156__000001_TN126DP,0,0,
Boots-Tonbridge,OP_5FF_3325__000002_TN91SD,OPT,59 High Street,,,Tonbridge,Kent,TN9 1SD,Tel: 01732 357565, - ,,,No ratings yet Rate it yourself - /Services/opticians/LeaveReview/DefaultView.aspx?id=OP_5FF_3325__000002_TN91SD,0,0,
Hassocks Eyecare Centre Ltd,OP_5FK_3523__000001_BN68AD,OPT,,17 Keymer Road,,Hassocks,West Sussex,BN6 8AD,Tel: 01273 843946, - ,,,No ratings yet Rate it yourself - /Services/opticians/LeaveReview/DefaultView.aspx?id=OP_5FK_3523__000001_BN68AD,0,0,yes
Crayford Optical Centre,OPT_TN91RE_3,OPT,,Home Visits,,Kent,,TN9 1RE,Tel: 01322 557 700, - ,,,2 ratings Rate it yourself - /Services/opticians/LeaveReview/DefaultView.aspx?id=OPT_TN91RE_3,,,
Complete Community Care Kent Ltd,OPT_TN91RE_2,OPT,,Home Visits,,Kent,,TN9 1RE,Tel: 01732 458 424, - ,,,No ratings yet Rate it yourself - /Services/opticians/LeaveReview/DefaultView.aspx?id=OPT_TN91RE_2,0,0,
Bansal Opticians ,OPT_TN91RE_1,OPT,,Home Visits,,Kent and Medway,Kent,TN9 1RE,Tel: 020 8470 1133, - ,,,No ratings yet Rate it yourself - /Services/opticians/LeaveReview/DefaultView.aspx?id=OPT_TN91RE_1,0,0,
William J Wilkinson (Tonbridge),OP_5FF_2040__000001_TN91AP,OPT,90 High Street,,Kent,Tonbridge,,TN9 1AP,Tel: 01732 353803, - ,,,1 rating Rate it yourself - /Services/opticians/LeaveReview/DefaultView.aspx?id=OP_5FF_2040__000001_TN91AP,,,
Patrick Duff,OP_5L2_12575__000001_TN126EN,OPT,3 Commercial Road,Paddock Wood,Tonbridge,,,TN12 6EN,Tel: 01892 838608, - ,,,No ratings yet Rate it yourself - /Services/opticians/LeaveReview/DefaultView.aspx?id=OP_5L2_12575__000001_TN126EN,0,0,
Complete Community Care (South) Ltd,10053__000003_BN37NA,OPT,,15 Court Close,,Brighton,East Sussex,BN1 8YG,Tel: 01273 220 588, - ,,,No ratings yet Rate it yourself - /Services/opticians/LeaveReview/DefaultView.aspx?id=10053__000003_BN37NA,0,0,
Osborne Harle,OP_5FF_397__000003_TN104AE,OPT,1-3 Martin Hardie Way,Tonbridge,,Kent,,TN10 4AE,Tel: 01732 368678, - ,,,9 ratings Rate it yourself - /Services/opticians/LeaveReview/DefaultView.aspx?id=OP_5FF_397__000003_TN104AE,,,yes
Specsavers Opticians,TP9AN,OPT,,142-143 London Road,,Brighton,Sussex,BN1 4JH,Tel: 01273 121636, - ,,,No ratings yet Rate it yourself - /Services/opticians/LeaveReview/DefaultView.aspx?id=TP9AN,0,0,
Boots-Brighton - London Rd,OP_5LQ_1521__000001_BN14JB,OPT,,39 London Road,,Brighton,Sussex,BN1 4JB,Tel: 01273 698 142, - ,,,No ratings yet Rate it yourself - /Services/opticians/LeaveReview/DefaultView.aspx?id=OP_5LQ_1521__000001_BN14JB,0,0,
Thomas H. Collison Ltd,TP35T,OPT,57b London Road,57B London Road,Brighton,Brighton ,,BN1 4JE,Tel: 01273 682952, - ,,,No ratings yet Rate it yourself - /Services/opticians/LeaveReview/DefaultView.aspx?id=TP35T,0,0,
Specs,OP_5LQ_8554__000001_BN14AL,OPT,22 Kensington Gardens,,Brighton,East Sussex,,BN1 4AL,Tel: 01273 676796, - ,,,No ratings yet Rate it yourself - /Services/opticians/LeaveReview/DefaultView.aspx?id=OP_5LQ_8554__000001_BN14AL,0,0,
Optical Express,OP_12345_BN1 3XF,OPT,Queensberry House,"2nd Floor, 103-109 Queens Road",,Brighton,East Sussex,BN1 3XF,Tel: 0800 023 2020, - ,,,No ratings yet Rate it yourself - /Services/opticians/LeaveReview/DefaultView.aspx?id=OP_12345_BN1 3XF,0,0,
Boots-Brighton - North St,OP_5LQ_3884__000002_BN12BE,OPT,129 North Street,,Brighton,Brighton,East Sussex,BN1 2BE,Tel: 01273 325600, - ,,,1 rating Rate it yourself - /Services/opticians/LeaveReview/DefaultView.aspx?id=OP_5LQ_3884__000002_BN12BE,,,
Eyesite Opticians,OP_5LQ_12450__000001_BN11RH,OPT,47-48 North Street,,,Brighton,East Sussex,BN1 1RH,Tel: 01273 724111, - ,,,No ratings yet Rate it yourself - /Services/opticians/LeaveReview/DefaultView.aspx?id=OP_5LQ_12450__000001_BN11RH,0,0,
Specsavers Opticians,OP_5LQ_8510__000002_BN11RH,OPT,49 North Street,,Brighton,East Sussex,,BN1 1RH,Tel: 01273 328322, - ,,,No ratings yet Rate it yourself - /Services/opticians/LeaveReview/DefaultView.aspx?id=OP_5LQ_8510__000002_BN11RH,0,0,