Organisation Name,NACS Code,Organisation Type,Address1,Address2,Address3,Address4,Address5,PostCode,Telephone Number,Opening time,Value  (Opening time),Banding Classification  (Opening time),NHS.UK users rating,Value  (NHS.UK users rating),Banding Classification  (NHS.UK users rating),Car parking (Is there car parking at this organisation?)
Dale Opticians,OP_DE43LT_46230,OPT,1 Dale Road,,,Matlock,,DE4 3LT,Tel: 01629 57751, - ,,,No ratings yet Rate it yourself - /Services/opticians/LeaveReview/DefaultView.aspx?id=OP_DE43LT_46230,0,0,
Lancaster and Thorpe,OP_5HN_14732__000002_DE43AR,OPT,,13 Causeway Lane,,Matlock,Derbyshire,DE4 3AR,Tel: 01629 582590, - ,,,No ratings yet Rate it yourself - /Services/opticians/LeaveReview/DefaultView.aspx?id=OP_5HN_14732__000002_DE43AR,0,0,no
David Bray Opticians,OP_5HN_9217__000001_DE43AQ,OPT,6 Bank Road,,Matlock,Derby,Derbyshire,DE4 3AQ,Tel: 01629 584280, - ,,,No ratings yet Rate it yourself - /Services/opticians/LeaveReview/DefaultView.aspx?id=OP_5HN_9217__000001_DE43AQ,0,0,
Fosman Ltd,OP_5H7_9628__000001_DE44DR,OPT,7 St. John Street,Wirksworth,Derbyshire,,,DE4 4DR,Tel: 01629 825125, - ,,,No ratings yet Rate it yourself - /Services/opticians/LeaveReview/DefaultView.aspx?id=OP_5H7_9628__000001_DE44DR,0,0,
The Glebe Field Centre,OP_5ED_13289__000002_DE45EU,OPT,Glebe Field Close,Crich,Derbyshire,,,DE4 5EU,Tel: 01773 857894, - ,,,No ratings yet Rate it yourself - /Services/opticians/LeaveReview/DefaultView.aspx?id=OP_5ED_13289__000002_DE45EU,0,0,
IKON Eyewear,OL73175N6__000002_S459JE,OPT,5 B Market Street,Clay Cross,Chesterfield,Derbyshire,,S45 9JE,Tel: 01246 250377, - ,,,No ratings yet Rate it yourself - /Services/opticians/LeaveReview/DefaultView.aspx?id=OL73175N6__000002_S459JE,0,0,
GF Lewis Opticians,OP_5EG_14739__000001_S459PE,OPT,36 Eldon Street,Clay Cross,Chesterfield,,,S45 9PE,Tel: 01246 863197, - ,,,No ratings yet Rate it yourself - /Services/opticians/LeaveReview/DefaultView.aspx?id=OP_5EG_14739__000001_S459PE,0,0,
Tesco Opticians,C/19982__000002_S459AE,OPT,Bridge Street,Clay Cross,Chesterfield,,,S45 9AE,, - ,,,No ratings yet Rate it yourself - /Services/opticians/LeaveReview/DefaultView.aspx?id=C/19982__000002_S459AE,0,0,
Tesco Opticians,C/19982/5N6__000001_S459AE,OPT,Bridge Street,Clay Cross,,Chesterfield,,S45 9SL,Tel: 0845 601 3479, - ,,,No ratings yet Rate it yourself - /Services/opticians/LeaveReview/DefaultView.aspx?id=C/19982/5N6__000001_S459AE,0,0,
Stanley H Field Ltd,OP_5ED_1183__000001_DE557AH,OPT,2 Church Street,Alfreton,Derbyshire,,,DE55 7AH,Tel: 01773 832091, - ,,,No ratings yet Rate it yourself - /Services/opticians/LeaveReview/DefaultView.aspx?id=OP_5ED_1183__000001_DE557AH,0,0,
Specsavers Opticians,OL17859/5N6__000001_DE557BQ,OPT,2 Institute Lane,Alfreton,Derby,,,DE55 7BQ,Tel: 01773 523070, - ,,,No ratings yet Rate it yourself - /Services/opticians/LeaveReview/DefaultView.aspx?id=OL17859/5N6__000001_DE557BQ,0,0,
"Blow, D I, Opticians Ltd",OP_5ED_9579__000001_DE557BE,OPT,115 High Street,Alfreton,Derbyshire,,,DE55 7DP,Tel: 01773 836661, - ,,,No ratings yet Rate it yourself - /Services/opticians/LeaveReview/DefaultView.aspx?id=OP_5ED_9579__000001_DE557BE,0,0,
Scrivens Opticians,OP_5ED_7168__000001_DE557DR,OPT,84 High Street,,,Alfreton,Derbyshire,DE55 7BE,Tel: 01733 832474, - ,,,No ratings yet Rate it yourself - /Services/opticians/LeaveReview/DefaultView.aspx?id=OP_5ED_7168__000001_DE557DR,0,0,
The Eye Place,OP_5HN_12438__000001_DE451HD,OPT,4 Royal Oak Place,Matlock Street,,Bakewell,Derbyshire,DE45 1HD,Tel: 01629 813603, - ,,,No ratings yet Rate it yourself - /Services/opticians/LeaveReview/DefaultView.aspx?id=OP_5HN_12438__000001_DE451HD,0,0,
K A Heath,OP_5HN_14730__000001_DE451BT,OPT,Burgons Buildings,Bath Gardens,Bakewell,Derbyshire,,DE45 1BT,Tel: 01629 813532, - ,,,No ratings yet Rate it yourself - /Services/opticians/LeaveReview/DefaultView.aspx?id=OP_5HN_14730__000001_DE451BT,0,0,
Vision Express,C/01-16611__000002_DE561PW,OPT,,3 King Street,,Belper,Derbyshire,DE56 1PW,Tel: 01773 825361, - ,,,1 rating Rate it yourself - /Services/opticians/LeaveReview/DefaultView.aspx?id=C/01-16611__000002_DE561PW,,,
Lancaster & Thorpe Opticians,OP_5ED_1708__000001_DE561AX,OPT,29B King Street,,,Belper,Derbyshire,DE56 1PX,Tel: 01773 822231, - ,,,No ratings yet Rate it yourself - /Services/opticians/LeaveReview/DefaultView.aspx?id=OP_5ED_1708__000001_DE561AX,0,0,no
Specsavers Opticians,OL19617/5N6__000002_DE561PL,OPT,46-48 King Street,Belper,Derbyshire,,,DE56 1PL,Tel: 01773 824375, - ,,,No ratings yet Rate it yourself - /Services/opticians/LeaveReview/DefaultView.aspx?id=OL19617/5N6__000002_DE561PL,0,0,
Belper Opticians,OP_5ED_4604__000001_DE561PZ,OPT,72 King Street,Belper,Derbyshire,Belper,,DE56 1PZ,Tel: 01773 825614, - ,,,No ratings yet Rate it yourself - /Services/opticians/LeaveReview/DefaultView.aspx?id=OP_5ED_4604__000001_DE561PZ,0,0,
Hurst Opticians,OP_5ED_12250__000002_DE53AB,OPT,5-7 High Street,Ripley,Derbyshire,,,DE5 3AB,Tel: 01773 744333, - ,,,1 rating Rate it yourself - /Services/opticians/LeaveReview/DefaultView.aspx?id=OP_5ED_12250__000002_DE53AB,,,
Scrivens Opticians & Hearing Care,OP_5ED_978__000003_DE53AG,OPT,,Commercial Buildings Oxford Street,,Ripley,Derbyshire,DE5 3AG,Tel: 01773 743167, - ,,,No ratings yet Rate it yourself - /Services/opticians/LeaveReview/DefaultView.aspx?id=OP_5ED_978__000003_DE53AG,0,0,no
The Eye Gallery,OL 16358__000001_DE53AH,OPT,49 Oxford Street,Ripley,Derbyshire,,,DE5 3AH,Tel: 01773 513493, - ,,,No ratings yet Rate it yourself - /Services/opticians/LeaveReview/DefaultView.aspx?id=OL 16358__000001_DE53AH,0,0,
Baker & Bee Opticians,OP_5ED_699__000001_DE554JH,OPT,125 Nottingham Road,Somercotes,Derbyshire,,,DE55 4JH,Tel: 01773 609411, - ,,,No ratings yet Rate it yourself - /Services/opticians/LeaveReview/DefaultView.aspx?id=OP_5ED_699__000001_DE554JH,0,0,
B Davies,OP_5EA_8221__000001_S401BA,OPT,73 West Bars,,Chesterfield,,,S40 1BA,Tel: 01246 273069, - ,,,No ratings yet Rate it yourself - /Services/opticians/LeaveReview/DefaultView.aspx?id=OP_5EA_8221__000001_S401BA,0,0,
Blow DI,OP_5EA_14784__000003_DE552BN,OPT,20 Market Place,South Normanton,Derbyshire,,,DE55 2BN,Tel: 01773 862343, - ,,,No ratings yet Rate it yourself - /Services/opticians/LeaveReview/DefaultView.aspx?id=OP_5EA_14784__000003_DE552BN,0,0,
Boots Opticians,OP_5EA_1576__000002_S401PQ,OPT,,35-37 Low Pavement,,Chesterfield,,S40 1PB,Tel: 01246 204693, - ,,,No ratings yet Rate it yourself - /Services/opticians/LeaveReview/DefaultView.aspx?id=OP_5EA_1576__000002_S401PQ,0,0,
Boots-Chesterfield - Low Pavement (in Boots UK),OP_5EA_3089__000003_S401PB,OPT,35-37 Low Pavement,,,Chesterfield,Derbyshire,S40 1PB,Tel: 01246 204693, - ,,,4 ratings Rate it yourself - /Services/opticians/LeaveReview/DefaultView.aspx?id=OP_5EA_3089__000003_S401PB,,,
Lancaster & Thorpe Ltd,OP_5EA_2059__000002_S401RQ,OPT,5 Low Pavement,,,Chesterfield,Derbyshire,S40 1PF,Tel: 01246 234205, - ,,,No ratings yet Rate it yourself - /Services/opticians/LeaveReview/DefaultView.aspx?id=OP_5EA_2059__000002_S401RQ,0,0,no
Crown Optical Centre,OP_5EA_14787__000001_S401JN,OPT,4 and 6 Soresby Street,Chesterfield,Derbyshire,,,S40 1JN,Tel: 01246 200209, - ,,,No ratings yet Rate it yourself - /Services/opticians/LeaveReview/DefaultView.aspx?id=OP_5EA_14787__000001_S401JN,0,0,
Watson & Jenkins Opticians Ltd,OL2238/5N6__000001_S401PA,OPT,86 Saltergate,Chesterfield,Derbyshire,.,,S40 1LG,Tel: 01246 205792, - ,,,No ratings yet Rate it yourself - /Services/opticians/LeaveReview/DefaultView.aspx?id=OL2238/5N6__000001_S401PA,0,0,
Scrivens Optical and Hearing,OP_5EA_2134__000001_S401PW,OPT,21 Market Place,,,Chesterfield,Derbyshire,S40 1PJ,Tel: 01246 232747, - ,,,No ratings yet Rate it yourself - /Services/opticians/LeaveReview/DefaultView.aspx?id=OP_5EA_2134__000001_S401PW,0,0,
Vision Express (UK) Ltd,OP_5EA_7070__000001_S401PY,OPT,"Unit 4, 10 Steeplegate",Vicar Lane Shopping Centre,Chesterfield,,,S40 1PY,Tel: 01246 277432, - ,,,No ratings yet Rate it yourself - /Services/opticians/LeaveReview/DefaultView.aspx?id=OP_5EA_7070__000001_S401PY,0,0,
Ray-Lewis Opticians,TP4CW,OPT,7 Packers Row,7 Packers Row,Derbyshire,Chesterfield,,S40 1RB,Tel: 01246 551115, - ,,,No ratings yet Rate it yourself - /Services/opticians/LeaveReview/DefaultView.aspx?id=TP4CW,0,0,
Specsavers Opticians,OP_5EA_14786__000002_S401RB,OPT,2 Burlington Street,,Chesterfield,Derbyshire,,S40 1RB,Tel: 01246 222334, - ,,,No ratings yet Rate it yourself - /Services/opticians/LeaveReview/DefaultView.aspx?id=OP_5EA_14786__000002_S401RB,0,0,
Crown Eyeglass (Manufacturing Opticians),OP_5EA_14802__000001_S417SA,OPT,15 Holywell Street,Chesterfield,Derbyshire,,,S41 7SA,Tel: 01246 277025, - ,,,No ratings yet Rate it yourself - /Services/opticians/LeaveReview/DefaultView.aspx?id=OP_5EA_14802__000001_S417SA,0,0,
"Elliott, AG & Heath, RA",OP_5EA_2593__000001_S417QA,OPT,79 Newbold Road,,Chesterfield,,,S41 7QA,Tel: 01246 275847, - ,,,No ratings yet Rate it yourself - /Services/opticians/LeaveReview/DefaultView.aspx?id=OP_5EA_2593__000001_S417QA,0,0,
C & N Witham Ltd,OP_5EA_14799__000001_S419SD,OPT,2 Abbey Croft,,Cutthorpe,Chesterfield,,S41 9SB,Tel: 01246 297001, - ,,,No ratings yet Rate it yourself - /Services/opticians/LeaveReview/DefaultView.aspx?id=OP_5EA_14799__000001_S419SD,0,0,
Chesterfield Royal Hospital,OP_5EA_11486__000002_S445BL,OPT,Eye Department,Calow,,Chesterfield,,S44 5BL,Tel: 01246 277271, - ,,,1 rating Rate it yourself - /Services/opticians/LeaveReview/DefaultView.aspx?id=OP_5EA_11486__000002_S445BL,,,
Derbyshire Eyecare,OP_5ED_7784__000001_DE564GH,OPT,,31 Town Street,,Duffield,Derbyshire,DE56 4GD,Tel: 01332 843666, - ,,,No ratings yet Rate it yourself - /Services/opticians/LeaveReview/DefaultView.aspx?id=OP_5ED_7784__000001_DE564GH,0,0,yes
Tesco Opticians,S417BJ__000001_S417JB,OPT,,Lockerford Lane,,Chesterfield,,S41 7JB,Tel: 0845 601 3479, - ,,,No ratings yet Rate it yourself - /Services/opticians/LeaveReview/DefaultView.aspx?id=S417BJ__000001_S417JB,0,0,
Vision Express,OL18376/5N6__000003_DE61GH,OPT,,42 St John Street,,Ashbourne,Derbyshire,DE6 1GH,Tel: 01335 300199, - ,,,No ratings yet Rate it yourself - /Services/opticians/LeaveReview/DefaultView.aspx?id=OL18376/5N6__000003_DE61GH,0,0,
John Fell Opticians Ltd ,OP_5H7_10985__000002_DE61GH,OPT,Horse and Jockey Yard,St John Street,Ashbourne,,,DE6 1GH,Tel: 01335 300658, - ,,,No ratings yet Rate it yourself - /Services/opticians/LeaveReview/DefaultView.aspx?id=OP_5H7_10985__000002_DE61GH,0,0,
Greens Opticians,OP_5H7_7481__000001_DE61GG,OPT,,2 The Gallery,,Ashbourne,Derbyshire,DE6 1GG,Tel: 01335 342484, - ,,,No ratings yet Rate it yourself - /Services/opticians/LeaveReview/DefaultView.aspx?id=OP_5H7_7481__000001_DE61GG,0,0,yes
Scrivens Opticians & Hearing Care,OP_5ED_5977__000002_DE757NR,OPT,6 Market Street,,,Heanor,Derbyshire,DE75 7NR,Tel: 01773 712047, - ,,,No ratings yet Rate it yourself - /Services/opticians/LeaveReview/DefaultView.aspx?id=OP_5ED_5977__000002_DE757NR,0,0,
"Stephens, A C",OP_5ED_13294__000001_DE77NR,OPT,11 Market Street,Heanor,Derbyshire,,,DE7 7NR,Tel: 01773 713803, - ,,,No ratings yet Rate it yourself - /Services/opticians/LeaveReview/DefaultView.aspx?id=OP_5ED_13294__000001_DE77NR,0,0,
IWear Opticians,OP_5ED_14384__000001_DE757EG,OPT,29c Market Place,,Heanor,,,DE75 7EG,Tel: 01773 765200, - ,,,1 rating Rate it yourself - /Services/opticians/LeaveReview/DefaultView.aspx?id=OP_5ED_14384__000001_DE757EG,,,
Asda Stores Ltd,OP_NG164LH_46734,OPT,,Wesley Road,,Langley Mill,,NG16 4LH,Tel: 01773 536140, - ,,,No ratings yet Rate it yourself - /Services/opticians/LeaveReview/DefaultView.aspx?id=OP_NG164LH_46734,0,0,
Lorraine Bonete Opticians,00566__000001_S188UE,OPT,Gosforth Valley Medical Centre,,Dronfield Woodhouse,Derbyshire,,S18 8UE,Tel: 01246 292088, - ,,,No ratings yet Rate it yourself - /Services/opticians/LeaveReview/DefaultView.aspx?id=00566__000001_S188UE,0,0,
Wycherley Opticians,OP_5FA_6683__000002_NG171AL,OPT,Brook Street,,Sutton-In-Ashfield,,,NG17 1AL,Tel: 01623 554377, - ,,,No ratings yet Rate it yourself - /Services/opticians/LeaveReview/DefaultView.aspx?id=OP_5FA_6683__000002_NG171AL,0,0,
I.Con Optical Eyewear Ltd,OP_5FA_0038__000001_NG171AQ,OPT,The Market Place,,Sutton-In-Ashfield,Nottinghamshire,,NG17 1AQ,Tel: 01623 559655, - ,,,No ratings yet Rate it yourself - /Services/opticians/LeaveReview/DefaultView.aspx?id=OP_5FA_0038__000001_NG171AQ,0,0,
Scrivens Ltd,OP_5FA_10761__000003_NG171BJ,OPT,The Idlewells Precinct,,Sutton-In-Ashfield,,,NG17 1BP,Tel: 01623 513954, - ,,,No ratings yet Rate it yourself - /Services/opticians/LeaveReview/DefaultView.aspx?id=OP_5FA_10761__000003_NG171BJ,0,0,
Specsavers Opticians,OP_5FA_1545__000006_NG171BJ,OPT,The Idlewells Precinct,,Sutton-In-Ashfield,,,NG17 1BP,Tel: 01623 552456, - ,,,3 ratings Rate it yourself - /Services/opticians/LeaveReview/DefaultView.aspx?id=OP_5FA_1545__000006_NG171BJ,,,
The Eye Gallery,DE222GP__000003_DE222GP,OPT,6 Blenheim Parade,Allestree,Derby,Derbyshire,,DE22 2GP,Tel: 01332 551010, - ,,,No ratings yet Rate it yourself - /Services/opticians/LeaveReview/DefaultView.aspx?id=DE222GP__000003_DE222GP,0,0,
DI Blow Opticians,OP_5FA_7203__000001_NG171AZ,OPT,55a Portland Square,,Sutton-In-Ashfield,,,NG17 1AZ,Tel: 01623 511896, - ,,,No ratings yet Rate it yourself - /Services/opticians/LeaveReview/DefaultView.aspx?id=OP_5FA_7203__000001_NG171AZ,0,0,
Lawrence and Jenkinson,OP_5EG_14738__000001_S181PP,OPT,Yorkshire House,Civic Centre,Dronfield,Sheffield,,S18 1PD,Tel: 01246 291999, - ,,,1 rating Rate it yourself - /Services/opticians/LeaveReview/DefaultView.aspx?id=OP_5EG_14738__000001_S181PP,,,
Thomas & Holloway (Opticians),OP_5EG_9992__000001_S182XA,OPT,33 Chesterfield Road,,Dronfield,,,S18 2XA,Tel: 01246 419408, - ,,,1 rating Rate it yourself - /Services/opticians/LeaveReview/DefaultView.aspx?id=OP_5EG_9992__000001_S182XA,,,
Forbes PL,OP_5EA_14792__000002_S433UU,OPT,T/A Jean Holmes Opticians,33 High Street,Staveley,,,S43 3UU,Tel: 01246 477199, - ,,,No ratings yet Rate it yourself - /Services/opticians/LeaveReview/DefaultView.aspx?id=OP_5EA_14792__000002_S433UU,0,0,
Salinger Opticians,OP_5EV_11035__000001_NG163NQ,OPT,68 Nottingham Road,Eastwood,Nottingham,,,NG16 3NQ,Tel: 01773 712812, - ,,,No ratings yet Rate it yourself - /Services/opticians/LeaveReview/DefaultView.aspx?id=OP_5EV_11035__000001_NG163NQ,0,0,
Philip Bradley Opticians,OP_5EX_3278__000002_DE222QN,OPT,Park Farm Centre,Allestree,Derby,,,DE22 2QN,Tel: 01332 550674, - ,,,1 rating Rate it yourself - /Services/opticians/LeaveReview/DefaultView.aspx?id=OP_5EX_3278__000002_DE222QN,,,
Allestree Eyecare,OP_5EX_4179__000001_DE222QQ,OPT,29 Park Farm Centre,Allestree,Derby,,,DE22 2QN,Tel: 01332 554797, - ,,,No ratings yet Rate it yourself - /Services/opticians/LeaveReview/DefaultView.aspx?id=OP_5EX_4179__000001_DE222QQ,0,0,
DI Blow Opticians,OP_5EV_2846__000001_NG163AJ,OPT,79 Nottingham Road,,Eastwood,,,NG16 3AJ,Tel: 01773 762326, - ,,,No ratings yet Rate it yourself - /Services/opticians/LeaveReview/DefaultView.aspx?id=OP_5EV_2846__000001_NG163AJ,0,0,
Woolcott Opticians,OP_5FA_9367__000001_NG177AQ,OPT,17 Station Street,,Kirkby-In-Ashfield,,,NG17 7AQ,Tel: 01623 752345, - ,,,No ratings yet Rate it yourself - /Services/opticians/LeaveReview/DefaultView.aspx?id=OP_5FA_9367__000001_NG177AQ,0,0,
DI Blow Opticians,OP_5FA_4816__000003_NG177AS,OPT,40 Station Street,,Kirkby-In-Ashfield,,,NG17 7AS,Tel: 01623 752453, - ,,,No ratings yet Rate it yourself - /Services/opticians/LeaveReview/DefaultView.aspx?id=OP_5FA_4816__000003_NG177AS,0,0,
Warner and Medlam t/a Parker Opticians,OP_5EG_12882__000003_S446DT,OPT,48 Town End,Bolsover,Chesterfield,,,S44 6DT,Tel: 01246 823242, - ,,,No ratings yet Rate it yourself - /Services/opticians/LeaveReview/DefaultView.aspx?id=OP_5EG_12882__000003_S446DT,0,0,
Martyn Kemp Opticians,OP_5EP_13324__000002_S174DL,OPT,63 Baslow Road,Totley,Sheffield,,,S17 4DL,Tel: 0114 236 4485, - ,,,No ratings yet Rate it yourself - /Services/opticians/LeaveReview/DefaultView.aspx?id=OP_5EP_13324__000002_S174DL,0,0,
Dore Opticians,OP_5EP_1672__000002_S173GD,OPT,,25 Townhead Road,Dore,Sheffield,,S17 3GD,Tel: 0114 327 3737, - ,,,No ratings yet Rate it yourself - /Services/opticians/LeaveReview/DefaultView.aspx?id=OP_5EP_1672__000002_S173GD,0,0,
Specsavers Opticians,OP_5ER_1916__000001_DE78AS,OPT,104 Bath Street,Ilkeston,Derbyshire,,,DE7 8SE,Tel: 0115 944 1401, - ,,,No ratings yet Rate it yourself - /Services/opticians/LeaveReview/DefaultView.aspx?id=OP_5ER_1916__000001_DE78AS,0,0,
The Eye Place,,OPT,,28 Causeway Head Road,,Sheffield,,S17 3DT,Tel: 01144300028, - ,,,N/A - Data not available,,,
Oakwood Eyecare,OP_5EX_233__000002_DE212HT,OPT,Oakwood District Centre,Off Bishops Drive,Oakwood,Derby,Derbyshire,DE21 2HT,Tel: 01332 676433, - ,,,1 rating Rate it yourself - /Services/opticians/LeaveReview/DefaultView.aspx?id=OP_5EX_233__000002_DE212HT,,,yes
Ian Truelove (Optometrist) Ltd,OP_5N4_2648__000003_S64GU,OPT,100 Causeway Head Road,,Sheffield,,,S17 3DW,Tel: 0114 2620123, - ,,,No ratings yet Rate it yourself - /Services/opticians/LeaveReview/DefaultView.aspx?id=OP_5N4_2648__000003_S64GU,0,0,
Hope Valley Opticians Ltd,00568__000001_S321DQ,OPT,Unit 5b Hathersage Park,Heather Lane,Hathersage,,,S32 1DP,Tel: 01433 659565, - ,,,No ratings yet Rate it yourself - /Services/opticians/LeaveReview/DefaultView.aspx?id=00568__000001_S321DQ,0,0,
Lancaster & Thorpe Ltd,OP_5AL_2249__000001_DE13NQ,OPT,14 Sadler Gate,,,Derby,Derbyshire,DE1 3NF,Tel: 01332 341186, - ,,,No ratings yet Rate it yourself - /Services/opticians/LeaveReview/DefaultView.aspx?id=OP_5AL_2249__000001_DE13NQ,0,0,no
The Eye Gallery,OP_5AL_13291__000002_DE13NR,OPT,31 Sadler Gate,Derby,,,,DE1 3NR,Tel: 01332 332759, - ,,,No ratings yet Rate it yourself - /Services/opticians/LeaveReview/DefaultView.aspx?id=OP_5AL_13291__000002_DE13NR,0,0,
Specsavers Opticians,OP_5AL_52__000001_DE12AZ,OPT,22 Crown Walk,Eagle Centre,Derby,,,DE1 2NP,Tel: 01332 294939, - ,,,No ratings yet Rate it yourself - /Services/opticians/LeaveReview/DefaultView.aspx?id=OP_5AL_52__000001_DE12AZ,0,0,
Optical Express,OP_5AL_3683__000001_DE12NR,OPT,4 St. Peters Way,,,Derby,Derbyshire,DE1 2NR,Tel: 0800 023 2020, - ,,,2 ratings Rate it yourself - /Services/opticians/LeaveReview/DefaultView.aspx?id=OP_5AL_3683__000001_DE12NR,,,
Specs 4 U Opticians,SPECS__000001_DE12NG,OPT,19 Theatre Walk,Westfield Centre,Derby,Derbyshire,,DE1 2NG,Tel: 01332 348990, - ,,,No ratings yet Rate it yourself - /Services/opticians/LeaveReview/DefaultView.aspx?id=SPECS__000001_DE12NG,0,0,
Vision Express UK Ltd,OP_5AL_1100__000003_DE12AZ,OPT,Unit 111 Level 1,"North Mall, Westfield Centre",Derby,Derbyshire,,DE1 1PG,Tel: 01332 295411, - ,,,No ratings yet Rate it yourself - /Services/opticians/LeaveReview/DefaultView.aspx?id=OP_5AL_1100__000003_DE12AZ,0,0,
Specs 4U Opticians,DE12NQ__000001_DE12NQ,OPT,Su 109-Level 1-North Mall,Westfield Centre,Derby,Derbyshire,,DE1 2NQ,Tel: 01332 348990, - ,,,No ratings yet Rate it yourself - /Services/opticians/LeaveReview/DefaultView.aspx?id=DE12NQ__000001_DE12NQ,0,0,
Specsavers Opticians,OP_5AM_8070__000001_NG181RQ,OPT,55 West Gate,,Mansfield,,,NG18 1RQ,Tel: 01623 650273, - ,,,2 ratings Rate it yourself - /Services/opticians/LeaveReview/DefaultView.aspx?id=OP_5AM_8070__000001_NG181RQ,,,
Lancaster & Thorpe Ltd,OP_5AL_574__000001_DE11SR,OPT,100 St. Peters Street,,,Derby,Derbyshire,DE1 1SR,Tel: 01332 348271, - ,,,No ratings yet Rate it yourself - /Services/opticians/LeaveReview/DefaultView.aspx?id=OP_5AL_574__000001_DE11SR,0,0,no
Boots-Derby - Devonshire Walk (in Boots UK),OP_5AL_2840__000002_DE12AH,OPT,1 Devonshire Walk,,,Derby,Derbyshire,DE1 2AH,Tel: 01332 384701, - ,,,No ratings yet Rate it yourself - /Services/opticians/LeaveReview/DefaultView.aspx?id=OP_5AL_2840__000002_DE12AH,0,0,
Sumpton Opticians,OP_5ER_4385__000001_DE78FE,OPT,,8 Station Road,,Ilkeston,Derbyshire,DE7 5LD,Tel: 0115 932 2653, - ,,,2 ratings Rate it yourself - /Services/opticians/LeaveReview/DefaultView.aspx?id=OP_5ER_4385__000001_DE78FE,,,
Lancaster & Thorpe,OP_5EX_2164__000002_DE216NA,OPT,495 Nottingham Road,Chaddesden,,Derby,Derbyshire,DE21 6NA,Tel: 01332 666806, - ,,,No ratings yet Rate it yourself - /Services/opticians/LeaveReview/DefaultView.aspx?id=OP_5EX_2164__000002_DE216NA,0,0,yes
Tesco Opticians,CO-0072/5N8__000001_NG220AP,OPT,Chesterfield Road,,Mansfield,,,NG19 7BQ,Tel: 01623 581400, - ,,,No ratings yet Rate it yourself - /Services/opticians/LeaveReview/DefaultView.aspx?id=CO-0072/5N8__000001_NG220AP,0,0,
Optique Vision Ltd,OL/CO/3453/5N7__000001_DE12PQ,OPT,Unit 157 Intu Centre,Unit 157 Level 1,Intu Centre,Derby,Derbyshire,DE1 2PL,Tel: 01332 208880, - ,,,No ratings yet Rate it yourself - /Services/opticians/LeaveReview/DefaultView.aspx?id=OL/CO/3453/5N7__000001_DE12PQ,0,0,yes
Wozencroft & Co,OP_5AL_10290__000001_DE12JH,OPT,59 Osmaston Road,,Derby,,,DE1 2JH,Tel: 01332 348063, - ,,,No ratings yet Rate it yourself - /Services/opticians/LeaveReview/DefaultView.aspx?id=OP_5AL_10290__000001_DE12JH,0,0,
Scrivens Opticians,OP_5ER_9618__000001_DE75QQ,OPT,,24 Bath Street,Ilkeston,Derbyshire,,DE7 8FB,Tel: 0115 932 5431, - ,,,No ratings yet Rate it yourself - /Services/opticians/LeaveReview/DefaultView.aspx?id=OP_5ER_9618__000001_DE75QQ,0,0,
"Bryson, Bell & Clenton",OP_5AM_11910__000002_NG181RU,OPT,59 West Gate,,Mansfield,,,NG18 1RU,Tel: 01623 623393, - ,,,No ratings yet Rate it yourself - /Services/opticians/LeaveReview/DefaultView.aspx?id=OP_5AM_11910__000002_NG181RU,0,0,
"Blow, D I, Opticians Ltd",OP_5ER_12835__000001_DE75QA,OPT,16 Market Place,Ilkeston,Derbyshire,,,DE7 5QA,Tel: 0115 930 4564, - ,,,No ratings yet Rate it yourself - /Services/opticians/LeaveReview/DefaultView.aspx?id=OP_5ER_12835__000001_DE75QA,0,0,
Vision Express,OP_5AM_8905__000001_NG181SN,OPT,The Four Seasons Centre,,Mansfield,,,NG18 1SN,Tel: 01623 422222, - ,,,No ratings yet Rate it yourself - /Services/opticians/LeaveReview/DefaultView.aspx?id=OP_5AM_8905__000001_NG181SN,0,0,
Pinder's Optometrists,OP_5AM_12761__000001_NG181JL,OPT,5-9 Queen Street,,Mansfield,,,NG18 1JL,Tel: 01623 621965, - ,,,No ratings yet Rate it yourself - /Services/opticians/LeaveReview/DefaultView.aspx?id=OP_5AM_12761__000001_NG181JL,0,0,
Alex Gage Opticians,OP_5EP_6453__000001_S80SQ,OPT,Alex Gage Opticians,857 Chesterfield Road,,Sheffield,,S8 0SQ,Tel: 0114 274 8582, - ,,,No ratings yet Rate it yourself - /Services/opticians/LeaveReview/DefaultView.aspx?id=OP_5EP_6453__000001_S80SQ,0,0,
Portland Opticians,OP_5EG_4851__000001_S434DN,OPT,5 - 7 Southgate,Eckington,Sheffield,,,S21 4FS,Tel: 01246 432209, - ,,,1 rating Rate it yourself - /Services/opticians/LeaveReview/DefaultView.aspx?id=OP_5EG_4851__000001_S434DN,,,
Boots-Mansfield - West Gate,OP_5AM_6709__000004_NG181RY,OPT,9-11 Westgate,,Nottinghamshire,Mansfield,,NG18 1RY,Tel: 01623 624555, - ,,,No ratings yet Rate it yourself - /Services/opticians/LeaveReview/DefaultView.aspx?id=OP_5AM_6709__000004_NG181RY,0,0,
Victoria J Smith Opticians,OPT_S72LH_1,OPT,26 Terminus Road,,,Sheffield,,S7 2LH,Tel: 0114 262 1955, - ,,,No ratings yet Rate it yourself - /Services/opticians/LeaveReview/DefaultView.aspx?id=OPT_S72LH_1,0,0,
Specs Opticians,OP_5AL_13293__000001_DE12RD,OPT,106 Osmaston Road,,Derby,,,DE1 2RD,Tel: 01332 385287, - ,,,No ratings yet Rate it yourself - /Services/opticians/LeaveReview/DefaultView.aspx?id=OP_5AL_13293__000001_DE12RD,0,0,
Crown Optical Centre,OP_5AM_0001__000001_NG186HU,OPT,8 Market Place,,Mansfield,Nottinghamshire,,NG18 1HU,Tel: 01623 621112, - ,,,No ratings yet Rate it yourself - /Services/opticians/LeaveReview/DefaultView.aspx?id=OP_5AM_0001__000001_NG186HU,0,0,
Boots-Mansfield - Four Seasons Centre,OP_5AM_10995__000003_NG181SU,OPT,Number 39,Four Seasons Shopping Centre,Mansfield,Nottinghamshire,,NG18 1SY,Tel: 01623 652390, - ,,,2 ratings Rate it yourself - /Services/opticians/LeaveReview/DefaultView.aspx?id=OP_5AM_10995__000003_NG181SU,,,