Organisation Name,NACS Code,Organisation Type,Address1,Address2,Address3,Address4,Address5,PostCode,Telephone Number,Opening time,Value  (Opening time),Banding Classification  (Opening time),NHS.UK users rating,Value  (NHS.UK users rating),Banding Classification  (NHS.UK users rating),Car parking (Is there car parking at this organisation?)
Old Town Optometrists,OP_5E4_5718__000001_YO164QL,OPT,69 High Street,69 High Street,Bridlington,Bridlington,,YO16 4PR,Tel: 01262 673772, - ,,,No ratings yet Rate it yourself - /Services/opticians/LeaveReview/DefaultView.aspx?id=OP_5E4_5718__000001_YO164QL,0,0,
Crown Optical,OP_5E4_14664__000001_YO152PX,OPT,4a The Promenade,,Bridlington,E Yorkshire,,YO15 2PX,Tel: 01262 674350, - ,,,No ratings yet Rate it yourself - /Services/opticians/LeaveReview/DefaultView.aspx?id=OP_5E4_14664__000001_YO152PX,0,0,
Langton Opticians,OP_5E4_8177__000001_YO152AE,OPT,27 Prospect Street,,Bridlington,,,YO15 2AE,Tel: 01262 673113, - ,,,1 rating Rate it yourself - /Services/opticians/LeaveReview/DefaultView.aspx?id=OP_5E4_8177__000001_YO152AE,,,
Specsavers Opticians,OP_5E4_12692__000001_YO152DN,OPT,29 King Street,,,Bridlington,,YO15 2DN,Tel: 01262 400011, - ,,,No ratings yet Rate it yourself - /Services/opticians/LeaveReview/DefaultView.aspx?id=OP_5E4_12692__000001_YO152DN,0,0,
Hunmanby Opticians,OP_5KK_14980__000004_YO140JR,OPT,24 Bridlington Street,Hunmanby,Filey,,,YO14 0JR,Tel: 01723 890011, - ,,,No ratings yet Rate it yourself - /Services/opticians/LeaveReview/DefaultView.aspx?id=OP_5KK_14980__000004_YO140JR,0,0,
Langton Opticians,OP_5KK_3231__000001_YO149AA,OPT,17b West Avenue,,Filey,,,YO14 9AA,Tel: 01723 512100, - ,,,No ratings yet Rate it yourself - /Services/opticians/LeaveReview/DefaultView.aspx?id=OP_5KK_3231__000001_YO149AA,0,0,
Scrivens Opticians,OP_5E4_6784__000001_YO256QF,OPT,71 Middle Street South,,,Driffield,Yorkshire(East Riding),YO25 6QF,Tel: 01377 253145, - ,,,No ratings yet Rate it yourself - /Services/opticians/LeaveReview/DefaultView.aspx?id=OP_5E4_6784__000001_YO256QF,0,0,
R M Higson Optometrist ,OP_5E4_1270__000001_YO256QE,OPT,100 Middle Street South,,Driffield,,,YO25 6QE,Tel: 01377 253039, - ,,,1 rating Rate it yourself - /Services/opticians/LeaveReview/DefaultView.aspx?id=OP_5E4_1270__000001_YO256QE,,,
Glens Optical Ltd,OP_5E4_2457__000002_YO256PS,OPT,23/3 Middle Street South,,Driffield,Driffield,,YO25 6PS,Tel: 01377 257252, - ,,,No ratings yet Rate it yourself - /Services/opticians/LeaveReview/DefaultView.aspx?id=OP_5E4_2457__000002_YO256PS,0,0,
Specsavers Opticians,OP_5E4_14669__000001_YO256AP,OPT,7 Market Place,,Driffield,E Yorkshire,,YO25 6AP,Tel: 01377 249710, - ,,,No ratings yet Rate it yourself - /Services/opticians/LeaveReview/DefaultView.aspx?id=OP_5E4_14669__000001_YO256AP,0,0,
Robert Higson Opticians,OP_5E4_7315__000002_HU181PB,OPT,104 Newbegin,,Hornsea,East Yorkshire,,HU18 1PB,Tel: 01964 532589, - ,,,No ratings yet Rate it yourself - /Services/opticians/LeaveReview/DefaultView.aspx?id=OP_5E4_7315__000002_HU181PB,0,0,
Onlookers Ltd,OP_5NW_ONLOOKERS__000002_YO259DJ,OPT,,83 Kelleythorpe Industrial Estate,,Driffield,Yorkshire(East Riding),YO25 9DJ,Tel: 01377 200040, - ,,,No ratings yet Rate it yourself - /Services/opticians/LeaveReview/DefaultView.aspx?id=OP_5NW_ONLOOKERS__000002_YO259DJ,0,0,
Brown & Humhreys Opticians,OP_5KK_5719__000001_YO112EF,OPT,42 Huntriss Row,,,Scarborough,,YO11 2EF,Tel: 01723 361957, - ,,,No ratings yet Rate it yourself - /Services/opticians/LeaveReview/DefaultView.aspx?id=OP_5KK_5719__000001_YO112EF,0,0,
Local Eyes,,OPT,,4 Newborough,,Scarborough,,YO11 1NA,Tel: 01723 364045, - ,,,N/A - Data not available,,,
Vision Express (UK) Ltd,OP_5KK_10368__000001_YO111LP,OPT,1 Bar House,Westborough,Scarborough,,,YO11 1LP,Tel: 01723 507667, - ,,,No ratings yet Rate it yourself - /Services/opticians/LeaveReview/DefaultView.aspx?id=OP_5KK_10368__000001_YO111LP,0,0,
 Scarborough Visionplus Ltd,OP_5KK_5660__000002_YO111LD,OPT,94 Westborough,94 Westborough,Scarborough, Scarborough,,YO11 1LD,Tel: 01723 501990, - ,,,No ratings yet Rate it yourself - /Services/opticians/LeaveReview/DefaultView.aspx?id=OP_5KK_5660__000002_YO111LD,0,0,
Pagan & McQuade,OP_5KK_3608__000001_YO111LD,OPT,108 Westborough,,,Scarborough,North Yorkshire,YO11 1LD,Tel: 01723 371250, - ,,,2 ratings Rate it yourself - /Services/opticians/LeaveReview/DefaultView.aspx?id=OP_5KK_3608__000001_YO111LD,,,no
Boots-Scarborough - Westborough,OP_5KK_869__000002_YO111LN,OPT,100 - 101 Westborough,,,Scarborough,North Yorkshire,YO11 1LN,Tel: 01723 500661, - ,,,4 ratings Rate it yourself - /Services/opticians/LeaveReview/DefaultView.aspx?id=OP_5KK_869__000002_YO111LN,,,
John Tomlinson Mobile Optician,OP_5E4_14668__000003_YO259QZ,OPT,Mobile Unit,Station Yard (Friday (Pm),Hutton Cranswick,,,YO25 9QZ,Tel: 07976 567487, - ,,,No ratings yet Rate it yourself - /Services/opticians/LeaveReview/DefaultView.aspx?id=OP_5E4_14668__000003_YO259QZ,0,0,
David Horn & A E Pierce,OP_5KK_3952__000001_YO111JR,OPT,Bradshaw House,21 Alma Square,Scarborough,,,YO11 1JR,Tel: 01723 364045, - ,,,No ratings yet Rate it yourself - /Services/opticians/LeaveReview/DefaultView.aspx?id=OP_5KK_3952__000001_YO111JR,0,0,
Edwards Opticians,OP_5E3_487__000002_HU178BB,OPT,8 Saturday Market,,Beverley,,,HU17 8BB,Tel: 01482 868428, - ,,,1 rating Rate it yourself - /Services/opticians/LeaveReview/DefaultView.aspx?id=OP_5E3_487__000002_HU178BB,,,
Eyesite,OPT_5E3_HARRODS__000003_HU178BB,OPT,13a Saturday Market Place,Beverley,,East Yorkshire,,HU17 8BB,Tel: 01482 868039, - ,,,1 rating Rate it yourself - /Services/opticians/LeaveReview/DefaultView.aspx?id=OPT_5E3_HARRODS__000003_HU178BB,,,
Andrew and Rogers,OP_5E3_13038__000001_HU178AJ,OPT,15 North Bar Within,,Beverley,E Yorkshire,,HU17 8AP,Tel: 01482 860362, - ,,,1 rating Rate it yourself - /Services/opticians/LeaveReview/DefaultView.aspx?id=OP_5E3_13038__000001_HU178AJ,,,
Specsavers Opticians,OP_5E3_7142__000001_HU179BN,OPT,52 Toll Gavel,,Beverley,,,HU17 9BN,Tel: 01482 679933, - ,,,No ratings yet Rate it yourself - /Services/opticians/LeaveReview/DefaultView.aspx?id=OP_5E3_7142__000001_HU179BN,0,0,
Boots-Beverley,OP_5E3_11631__000001_HU179AJ,OPT,43-45 Toll Gavel,,,Beverley,Yorkshire,HU17 9AA,Tel: 01482 872333, - ,,,No ratings yet Rate it yourself - /Services/opticians/LeaveReview/DefaultView.aspx?id=OP_5E3_11631__000001_HU179AJ,0,0,
Beverley Vision Express,5NW VE__000003_HU179AJ,OPT,,12 Toll Gavel,,Beverley,Yorkshire(East Riding),HU17 9AJ,Tel: 01482 863547, - ,,,1 rating Rate it yourself - /Services/opticians/LeaveReview/DefaultView.aspx?id=5NW VE__000003_HU179AJ,,,
ASDA Opticians,OPT_HU11 4AL,OPT,,"Main Road, Bilton",,HULL,,HU11 4AL,Tel: 01482 818812, - ,,,1 rating Rate it yourself - /Services/opticians/LeaveReview/DefaultView.aspx?id=OPT_HU11 4AL,,,
Rouse Opticians,OP_5E5_2060__000004_HU74EE,OPT,5c North Point Shopping Centre,Goodhart Road,Hull,E Yorkshire,,HU7 4EE,Tel: 01482 833451, - ,,,No ratings yet Rate it yourself - /Services/opticians/LeaveReview/DefaultView.aspx?id=OP_5E5_2060__000004_HU74EE,0,0,
Asda Opticians,OP_5E5_14668__000003_HU74HS,OPT,Asda Stores,Kingswood,,Hull,,HU7 4HS,Tel: 01482 370820, - ,,,3 ratings Rate it yourself - /Services/opticians/LeaveReview/DefaultView.aspx?id=OP_5E5_14668__000003_HU74HS,,,
Winter Opticians,OP_5E5_14667__000001_HU89AL,OPT,,623 Holderness Road,,Hull,,HU8 9AL,Tel: 01482 375295, - ,,,4 ratings Rate it yourself - /Services/opticians/LeaveReview/DefaultView.aspx?id=OP_5E5_14667__000001_HU89AL,,,
Scrivens Opticians,OP_5E3_5474__000002_HU164BD,OPT,160 Hallgate,,Cottingham,Nr Hull,Yorkshire(East Riding),HU16 4BD,Tel: 01482 845056, - ,,,No ratings yet Rate it yourself - /Services/opticians/LeaveReview/DefaultView.aspx?id=OP_5E3_5474__000002_HU164BD,0,0,
Buckingham Opticians,OP_5E3_3903__000001_HU164BB,OPT,183 Hallgate,,Cottingham,Cottingham,,HU16 4BB,Tel: 01482 841359, - ,,,No ratings yet Rate it yourself - /Services/opticians/LeaveReview/DefaultView.aspx?id=OP_5E3_3903__000001_HU164BB,0,0,
Coates Opticians,OP_5E3_4819__000002_HU165QE,OPT,,8 King Street,,Cottingham,East Yorkshire,HU16 5QE,Tel: 01482 840989, - ,,,No ratings yet Rate it yourself - /Services/opticians/LeaveReview/DefaultView.aspx?id=OP_5E3_4819__000002_HU165QE,0,0,
Eyesite Opticians,OP_5E3_13040__000003_HU165QE,OPT,96 King Street,,Cottingham,E Yorkshire,,HU16 5QE,Tel: 01482 845651, - ,,,1 rating Rate it yourself - /Services/opticians/LeaveReview/DefaultView.aspx?id=OP_5E3_13040__000003_HU165QE,,,
Bush Opticians (Hull) Ltd,OP_5E5_7794__000001_HU88RD,OPT,337 Holderness Road,,Hull,E Yorkshire,,HU8 8RD,Tel: 01482 323443, - ,,,No ratings yet Rate it yourself - /Services/opticians/LeaveReview/DefaultView.aspx?id=OP_5E5_7794__000001_HU88RD,0,0,
M & A Optics,OP_5E6_5538__000002_HU52ES,OPT,115 Newland Avenue,,Hull,,,HU5 2ES,Tel: 01482 472848, - ,,,No ratings yet Rate it yourself - /Services/opticians/LeaveReview/DefaultView.aspx?id=OP_5E6_5538__000002_HU52ES,0,0,
Robert Higson Opticians,OP_5E5_3497__000001_HU88SH,OPT,323 Holderness Road,,,Hull,,HU8 8SH,Tel: 01482 329404, - ,,,4 ratings Rate it yourself - /Services/opticians/LeaveReview/DefaultView.aspx?id=OP_5E5_3497__000001_HU88SH,,,
Rouse Opticians,OP_5E6_2061__000001_HU52AA,OPT,95 Newland Avenue,95 Newland Avenue,,Hull,,HU5 2AA,Tel: 01482 346728, - ,,,No ratings yet Rate it yourself - /Services/opticians/LeaveReview/DefaultView.aspx?id=OP_5E6_2061__000001_HU52AA,0,0,
Vision Plus Opticians,OP_5E5_9519__000001_HU88TE,OPT,,283 Holderness Road,,Hull,,HU8 8TE,Tel: 01482 225545, - ,,,No ratings yet Rate it yourself - /Services/opticians/LeaveReview/DefaultView.aspx?id=OP_5E5_9519__000001_HU88TE,0,0,
Asda Opticians,OPT_HU9 2BN,OPT,,THE MOUNT RETAIL PARK,,HULL,,HU9 2BN,, - ,,,No ratings yet Rate it yourself - /Services/opticians/LeaveReview/DefaultView.aspx?id=OPT_HU9 2BN,0,0,
"Daniels, Turner & Associates",5NXDANIELS__000002_HU31AA,OPT,90 Spring Bank,,Hull,E Yorkshire,,HU3 1AA,Tel: 01482 228525, - ,,,No ratings yet Rate it yourself - /Services/opticians/LeaveReview/DefaultView.aspx?id=5NXDANIELS__000002_HU31AA,0,0,
Robinson Opticians Ltd,OP_5KK_1041__000002_YO187DP,OPT,14 Eastgate Square,,Pickering,,,YO18 7DP,Tel: 01751 472737, - ,,,No ratings yet Rate it yourself - /Services/opticians/LeaveReview/DefaultView.aspx?id=OP_5KK_1041__000002_YO187DP,0,0,
Edwards Opticians,OP_5E4_9059__000001_YO43AF,OPT,17-19 Southgate,,Market Weighton,E Yorkshire,,YO43 3AF,Tel: 01430 873288, - ,,,No ratings yet Rate it yourself - /Services/opticians/LeaveReview/DefaultView.aspx?id=OP_5E4_9059__000001_YO43AF,0,0,
Sight Care UK Ltd,OP_5E3_8924__000001_HU106BN,OPT,4 Kingston Road,,Willerby,,,HU10 6BN,Tel: 01482 658048, - ,,,1 rating Rate it yourself - /Services/opticians/LeaveReview/DefaultView.aspx?id=OP_5E3_8924__000001_HU106BN,,,
John Tomlinson Mobile Optician,OP_5E3_13033__000001_YO433SN,OPT,Mobile Unit,Newbald Village Hall Car Park,Westgate (Thur 4.45pm-7pm Alt),,,YO43 4SE,Tel: 07976 567487, - ,,,No ratings yet Rate it yourself - /Services/opticians/LeaveReview/DefaultView.aspx?id=OP_5E3_13033__000001_YO433SN,0,0,
Specsavers,TP730,OPT,,17-21 Market Place,,Pocklington,,YO42 2AS,, - ,,,No ratings yet Rate it yourself - /Services/opticians/LeaveReview/DefaultView.aspx?id=TP730,0,0,
Scrivens Opticians,OP_5E4_10770__000001_YO422DG,OPT,4 George Street,,Pocklington,E Yorkshire,,YO42 2DG,Tel: 01759 303150, - ,,,No ratings yet Rate it yourself - /Services/opticians/LeaveReview/DefaultView.aspx?id=OP_5E4_10770__000001_YO422DG,0,0,
John Tomlinson Mobile Optician,OP_5E3_13034__000001_HU151QT,OPT,Mobile Unit,The Library Car Park,Church Street (Tues 9-12.15pm Alt),,,HU15 1QT,Tel: 07976 567487, - ,,,No ratings yet Rate it yourself - /Services/opticians/LeaveReview/DefaultView.aspx?id=OP_5E3_13034__000001_HU151QT,0,0,
John Tomlinson Mobile Optician,OP_5E3_13031__000001_HU152PR,OPT,Mobile Unit,Recreation Club (Thur Pm Alt),,"Main Street, Newport",,HU15 2PR,Tel: 07976 567487, - ,,,No ratings yet Rate it yourself - /Services/opticians/LeaveReview/DefaultView.aspx?id=OP_5E3_13031__000001_HU152PR,0,0,
John Tomlinson Mobile Optician,OP_5E3_13036__000001_HU152UB,OPT,Mobile Optician,Village Hall Car Park,Gilberdyke,,,HU15 2UB,Tel: 07976 567487, - ,,,No ratings yet Rate it yourself - /Services/opticians/LeaveReview/DefaultView.aspx?id=OP_5E3_13036__000001_HU152UB,0,0,
