Organisation Name,NACS Code,Organisation Type,Address1,Address2,Address3,Address4,Address5,PostCode,Telephone Number,Opening time,Value  (Opening time),Banding Classification  (Opening time),NHS.UK users rating,Value  (NHS.UK users rating),Banding Classification  (NHS.UK users rating),Car parking (Is there car parking at this organisation?)
Specsavers Opticians,OP_5MN_11367__000001_ST162BQ,OPT,20 Gaolgate Street,Stafford,,Staffordshire,,ST16 2BQ,Tel: 01785 255210, - ,,,No ratings yet Rate it yourself - /Services/opticians/LeaveReview/DefaultView.aspx?id=OP_5MN_11367__000001_ST162BQ,0,0,
Direct Specs,5PK_ST16 2JU__000001_ST162JU,OPT,1 Salter Street,,Stafford,Staffordshire,,ST16 2JU,Tel: 01785 212001, - ,,,No ratings yet Rate it yourself - /Services/opticians/LeaveReview/DefaultView.aspx?id=5PK_ST16 2JU__000001_ST162JU,0,0,
Boots-Stafford - Goalgate St,OP_5MN_12039__000001_ST162NR,OPT,39 Gaolgate Street,,,Stafford,Staffordshire,ST16 2NR,Tel: 01785 225948, - ,,,1 rating Rate it yourself - /Services/opticians/LeaveReview/DefaultView.aspx?id=OP_5MN_12039__000001_ST162NR,,,
"Goodwin & Edge Ltd, T/A Mincher-Lockett Optometric Group",OP_5MN_3642__000001_ST162BP,OPT,18 Stafford Street,Stafford,,Staffordshire,,ST16 2BP,Tel: 01785 253478, - ,,,No ratings yet Rate it yourself - /Services/opticians/LeaveReview/DefaultView.aspx?id=OP_5MN_3642__000001_ST162BP,0,0,
Eye Works,6800,OPT,,"No. 4, St. Mary's Mews",,Stafford,Staffordshire,ST16 2AP,Tel: 01785 249417, - ,,,No ratings yet Rate it yourself - /Services/opticians/LeaveReview/DefaultView.aspx?id=6800,0,0,
Vision Express Opticians,20135__000001_ST162BB,OPT,Unit 3,Stafford Riverside,Stafford,Staffs,,ST16 3AA,Tel: 01785 215077, - ,,,No ratings yet Rate it yourself - /Services/opticians/LeaveReview/DefaultView.aspx?id=20135__000001_ST162BB,0,0,
Asda Opticians,20129__000001_ST163TA,OPT,Queensway,,Stafford,Staffordshire,,ST16 3TA,Tel: 01785 782020, - ,,,No ratings yet Rate it yourself - /Services/opticians/LeaveReview/DefaultView.aspx?id=20129__000001_ST163TA,0,0,
The Eye Works,D-10610__000001_ST162DF,OPT,"Unit G24, Sts. John's Market",Earl Street,,Stafford,,ST16 2DF,, - ,,,No ratings yet Rate it yourself - /Services/opticians/LeaveReview/DefaultView.aspx?id=D-10610__000001_ST162DF,0,0,
Webb & Lucas ,OP_5MN_3588__000001_ST162HL,OPT,"Webb, Lucas & Stubbs Optometrists",8 Bridge Street,,Stafford,Staffordshire,ST16 2HL,Tel: 01785 242127, - ,,,1 rating Rate it yourself - /Services/opticians/LeaveReview/DefaultView.aspx?id=OP_5MN_3588__000001_ST162HL,,,
Brian Hitchin (DOM),5LA_OPT_44__000003_ST158AD,OPT,"60, Pirehill Lane,",,,Stone,Staffordshire,ST15 0JN,Tel: 017581 5656, - ,,,No ratings yet Rate it yourself - /Services/opticians/LeaveReview/DefaultView.aspx?id=5LA_OPT_44__000003_ST158AD,0,0,
Scrivens Opticians & Hearing Care,,OPT,,27 High Street,,Stone,,ST15 8AJ,Tel: 01785 814777, - ,,,N/A - Data not available,,,
Nusyte Opticians (Stone),5PK_ST15 8YQ__000001_ST158YQ,OPT,Nusyte Opticians (Stone),1/2 Oddfellows,Adies Alley,Stone,Staffordshire,ST15 8YQ,Tel: 01785 814777, - ,,,No ratings yet Rate it yourself - /Services/opticians/LeaveReview/DefaultView.aspx?id=5PK_ST15 8YQ__000001_ST158YQ,0,0,
Peter Bowers Optometrist,OP_5MN_2377__000001_ST158AD,OPT,,63A High Street,,Stone,Staffordshire,ST15 8AD,Tel: 01785 813902, - ,,,No ratings yet Rate it yourself - /Services/opticians/LeaveReview/DefaultView.aspx?id=OP_5MN_2377__000001_ST158AD,0,0,
Brian Hitchin ,-44 5LC__000002_ST158AD,OPT,,48 Mount Avenue,,Stone,Staffordshire,ST15 8EE,Tel: 01785 815 656, - ,,,No ratings yet Rate it yourself - /Services/opticians/LeaveReview/DefaultView.aspx?id=-44 5LC__000002_ST158AD,0,0,
Malcolm Gray & Associates,OP_5MN_1689__000001_ST216BZ,OPT,56 High Street,,Stafford,Eccleshall,Staffordshire,ST21 6BZ,Tel: 01785 851015, - ,,,2 ratings Rate it yourself - /Services/opticians/LeaveReview/DefaultView.aspx?id=OP_5MN_1689__000001_ST216BZ,,,
"Goodwin & Edge Ltd, T/A Mincher-Lockett Optometric Group",5PK_ST20 0EZ__000001_ST200EZ,OPT,Station Road,Gnosall,,Stafford,,ST20 0EZ,Tel: 01785 823790, - ,,,No ratings yet Rate it yourself - /Services/opticians/LeaveReview/DefaultView.aspx?id=5PK_ST20 0EZ__000001_ST200EZ,0,0,
Carolyn Parker Optometrist (owned by Terry & Associates Ltd),OP_5MN_4147__000001_ST195AA,OPT,Crown Bridge,Penkridge,,Stafford,Staffordshire,ST19 5AA,Tel: 01785 713861, - ,,,No ratings yet Rate it yourself - /Services/opticians/LeaveReview/DefaultView.aspx?id=OP_5MN_4147__000001_ST195AA,0,0,
Gillian E Scarisbrick Optometrist,OPT_ST119LY_1,OPT,,"266 Uttoxeter Road, Blythe Bridge",,Stoke on Trent,,ST11 9LY,Tel: 01782 388355, - ,,,No ratings yet Rate it yourself - /Services/opticians/LeaveReview/DefaultView.aspx?id=OPT_ST119LY_1,0,0,
Right Vision Ophthalmic Opticians,01-19976/5PL/C__000002_B694DS,OPT,6 Richardson Way,,Rugeley,Staffordshire,,WS15 2TD,Tel: 07966 960606, - ,,,No ratings yet Rate it yourself - /Services/opticians/LeaveReview/DefaultView.aspx?id=01-19976/5PL/C__000002_B694DS,0,0,
Razvi SIH,OP_5MF_4701__000001_ST36AF,OPT,1 Cornelious Street,,Stoke-on-Trent,,,ST3 6AF,Tel: 01782 314673, - ,,,No ratings yet Rate it yourself - /Services/opticians/LeaveReview/DefaultView.aspx?id=OP_5MF_4701__000001_ST36AF,0,0,
Heath JH,5MF-023__000001_ST48ES,OPT,2 Garfield Avenue,Hanford,,Stoke On Trent,Staffordshire,ST4 8ES,Tel: 01782 643999, - ,,,No ratings yet Rate it yourself - /Services/opticians/LeaveReview/DefaultView.aspx?id=5MF-023__000001_ST48ES,0,0,yes
Colin Lee Opticians (Rugeley),OP_5DQ_14952__000002_WS152DA,OPT,1 Shrewsbury Mall,Market Square,Rugeley,,,WS15 2DA,Tel: 01889 570544, - ,,,3 ratings Rate it yourself - /Services/opticians/LeaveReview/DefaultView.aspx?id=OP_5DQ_14952__000002_WS152DA,,,
Boots-Rugeley,OL/01-014482/5PK__000001_WS152DR,OPT,2 Brook Square,,,Rugeley,Staffordshire,WS15 2DR,Tel: 01889 579000, - ,,,1 rating Rate it yourself - /Services/opticians/LeaveReview/DefaultView.aspx?id=OL/01-014482/5PK__000001_WS152DR,,,
Scrivens Opticians & Hearing Care,OP_5MM_438__000001_WS152DN,OPT,16a Upper Brook Street,16a Upper Brook Street,Staffordshire,Rugeley,,WS15 2DN,Tel: 01889 575257, - ,,,No ratings yet Rate it yourself - /Services/opticians/LeaveReview/DefaultView.aspx?id=OP_5MM_438__000001_WS152DN,0,0,
"Specsavers Opticians, Rugeley",CO-3227/5PK/C__000003_WS152DP,OPT,5 Upper Brook Street,,Rugeley,Staffordshire,,WS15 2DP,Tel: 01889 576060, - ,,,No ratings yet Rate it yourself - /Services/opticians/LeaveReview/DefaultView.aspx?id=CO-3227/5PK/C__000003_WS152DP,0,0,
Boots-Longton,OP_5MF_11634__000002_ST32HX,OPT,24-26 Bennett Precinct,,,Longton,Staffordshire,ST3 2JA,Tel: 01782 599002, - ,,,No ratings yet Rate it yourself - /Services/opticians/LeaveReview/DefaultView.aspx?id=OP_5MF_11634__000002_ST32HX,0,0,
"John Saum Optometrist, Newbold Opticians t/a The Specsplace",OP_5ME__000001_ST31BS,OPT,,"46a Market Street,",,Longton / Stoke on Trent,,ST3 1BS,Tel: 01782 330803, - ,,,No ratings yet Rate it yourself - /Services/opticians/LeaveReview/DefaultView.aspx?id=OP_5ME__000001_ST31BS,0,0,
Specsavers Opticians,5MF-272__000002_ST31BS,OPT,36-38 Market Street,Longton,Stoke On Trent,Staffordshire,,ST3 1BS,Tel: 01782 337830, - ,,,No ratings yet Rate it yourself - /Services/opticians/LeaveReview/DefaultView.aspx?id=5MF-272__000002_ST31BS,0,0,
R K Mehta,OP_5MF_8544__000001_ST32JF,OPT,31 The Strand,Longton,,STOKE-ON-TRENT,Staffordshire,ST3 2JF,Tel: 01782 319703, - ,,,No ratings yet Rate it yourself - /Services/opticians/LeaveReview/DefaultView.aspx?id=OP_5MF_8544__000001_ST32JF,0,0,
Portland Opticians,5MF-202__000002_ST31BE,OPT,21 Market Street,Longton,Stoke On Trent,Staffordshire,,ST3 1BE,Tel: 01782 319930, - ,,,No ratings yet Rate it yourself - /Services/opticians/LeaveReview/DefaultView.aspx?id=5MF-202__000002_ST31BE,0,0,
Tesco Opticians Limited,OP_5PH_0291__000001_ST32JB,OPT,Baths Passage,Longton,Stoke On Trent,,,ST3 2JB,Tel: 01782 424400, - ,,,No ratings yet Rate it yourself - /Services/opticians/LeaveReview/DefaultView.aspx?id=OP_5PH_0291__000001_ST32JB,0,0,
Heather Bailey,OP_5MM_8119__000003_WS125AG,OPT,T/a Boots Optician,88 Market Street,,Cannock,,WS12 5AG,Tel: 01543 422113, - ,,,No ratings yet Rate it yourself - /Services/opticians/LeaveReview/DefaultView.aspx?id=OP_5MM_8119__000003_WS125AG,0,0,
Boots Opticians,OP_5DQ_14950__000004_WS125AG,OPT,88 Market Street,Hednesford,,Staffordshire,,WS12 1AG,Tel: 01543 422113, - ,,,No ratings yet Rate it yourself - /Services/opticians/LeaveReview/DefaultView.aspx?id=OP_5DQ_14950__000004_WS125AG,0,0,
Specsavers Opticians,ST7783__000002_ST147HN,OPT,3 High Street,,Uttoxeter,Staffordshire,,ST14 7HN,Tel: 01889 561770, - ,,,No ratings yet Rate it yourself - /Services/opticians/LeaveReview/DefaultView.aspx?id=ST7783__000002_ST147HN,0,0,
Nusyte Opticians (chedle),OP_5HR_4056__000002_ST101AF,OPT,Nusyte Opticians (Cheadle),50 High street,Cheadle,Stoke-on-Trent,Staffordshire,ST10 1AF,Tel: 01538 752085, - ,,,No ratings yet Rate it yourself - /Services/opticians/LeaveReview/DefaultView.aspx?id=OP_5HR_4056__000002_ST101AF,0,0,
Vision Express,5PK_004__000002_ST148HY,OPT,,15 Market Place,,Uttoxeter,Staffordshire,ST14 8HY,Tel: 01889 567474, - ,,,No ratings yet Rate it yourself - /Services/opticians/LeaveReview/DefaultView.aspx?id=5PK_004__000002_ST148HY,0,0,
McCracken Opticians,OP_5ML_14383__000001_ST148HY,OPT,Northgate House,Church Street,Uttoxeter,Staffordshire,,ST14 8AG,Tel: 01889 562184, - ,,,No ratings yet Rate it yourself - /Services/opticians/LeaveReview/DefaultView.aspx?id=OP_5ML_14383__000001_ST148HY,0,0,
Ernest G Hanwell Ltd,OP_5ME_1538__000001_ST41HP,OPT,11 Glebe Street,,Stoke-on-Trent,,,ST4 1HP,Tel: 01782 844105, - ,,,No ratings yet Rate it yourself - /Services/opticians/LeaveReview/DefaultView.aspx?id=OP_5ME_1538__000001_ST41HP,0,0,
Nusyte Opticians (stoke),01-22440,OPT,,80-82 Church Street,,Stoke-on-Trent,,ST4 1BS,Tel: 01782 845592, - ,,,No ratings yet Rate it yourself - /Services/opticians/LeaveReview/DefaultView.aspx?id=01-22440,0,0,
Edwards RG,5MF-014__000002_ST44AA,OPT,80-82 Church Street,Stoke,Stoke On Trent,Staffordshire,,ST4 1BS,Tel: 01782 848070, - ,,,No ratings yet Rate it yourself - /Services/opticians/LeaveReview/DefaultView.aspx?id=5MF-014__000002_ST44AA,0,0,
Specsavers Opticians,OP_5MM_8649__000001_WS111WS,OPT,19 Cannock Shopping Centre,Cannock,Staffordshire,,,WS11 1WS,Tel: 01543 462232, - ,,,No ratings yet Rate it yourself - /Services/opticians/LeaveReview/DefaultView.aspx?id=OP_5MM_8649__000001_WS111WS,0,0,
Puri Healthcare Ltd T/A Chase Eyecare,OP_5MM_7952__000001_WS125AY,OPT,75 High Green,,Cannock,Cannock,Staffordshire,WS11 1BN,Tel: 01543 570313, - ,,,No ratings yet Rate it yourself - /Services/opticians/LeaveReview/DefaultView.aspx?id=OP_5MM_7952__000001_WS125AY,0,0,yes
LAM Ltd,OP_5MM_5057__000001_WS111BN,OPT,,69 High Green,,Cannock,,WS11 1BN,Tel: 01543 503356, - ,,,No ratings yet Rate it yourself - /Services/opticians/LeaveReview/DefaultView.aspx?id=OP_5MM_5057__000001_WS111BN,0,0,
Boots-Cannock,CO-2377/5MM/C__000002_WS111BN,OPT,,69 High Green,,Cannock,Staffordshire,WS11 1BN,Tel: 01543 503 356, - ,,,No ratings yet Rate it yourself - /Services/opticians/LeaveReview/DefaultView.aspx?id=CO-2377/5MM/C__000002_WS111BN,0,0,
Puri Healthcare Ltd T/A Chase Eyecare,CO-2707/5MM/C__000003_WS111BN,OPT,75 High Green,,Cannock,Staffordshire,Staffordshire,WS11 1BN,Tel: 01543 570313, - ,,,No ratings yet Rate it yourself - /Services/opticians/LeaveReview/DefaultView.aspx?id=CO-2707/5MM/C__000003_WS111BN,0,0,yes
Philip Howard Opticians,5PK/WS11 1DD__000001_WS111DD,OPT,4a Market Place,,Cannock,Staffordshire,,WS11 1DD,Tel: 01543 467277, - ,,,No ratings yet Rate it yourself - /Services/opticians/LeaveReview/DefaultView.aspx?id=5PK/WS11 1DD__000001_WS111DD,0,0,
Portland Opticians,OP_5MM_11876__000001_WS111BZ,OPT,17 Market Place,Cannock,Staffordshire,Staffordshire,,WS11 1BZ,Tel: 01543 503343, - ,,,No ratings yet Rate it yourself - /Services/opticians/LeaveReview/DefaultView.aspx?id=OP_5MM_11876__000001_WS111BZ,0,0,
Kenneth Wright,OP_5ME_1551__000001_ST47NX,OPT,340 Hartshill Road,,Stoke-on-Trent,Stoke-on-Trent,,ST4 7NX,Tel: 01782 617217, - ,,,2 ratings Rate it yourself - /Services/opticians/LeaveReview/DefaultView.aspx?id=OP_5ME_1551__000001_ST47NX,,,
Flint & Partners,OP_5MN_6856__000001_ST199ES,OPT,The Surgery,Sandy Lane,Brewood,,,ST19 9ES,Tel: 0844 4770924, - ,,,No ratings yet Rate it yourself - /Services/opticians/LeaveReview/DefaultView.aspx?id=OP_5MN_6856__000001_ST199ES,0,0,
"McKellen, Ashton & Tavernor",OP_5PH_0001__000001_ST52DZ,OPT,6 Friar Street,,Newcaslte-under-Lyme,Staffordshire,,ST5 2DZ,Tel: 01782 619175, - ,,,No ratings yet Rate it yourself - /Services/opticians/LeaveReview/DefaultView.aspx?id=OP_5PH_0001__000001_ST52DZ,0,0,
Bains Optical Healthcare,TP5KL,OPT,,160-162 Hednesford Road,,"Heath Hayes, Cannock",,WS12 3DZ,Tel: 01543 270080, - ,,,18 ratings Rate it yourself - /Services/opticians/LeaveReview/DefaultView.aspx?id=TP5KL,,,
A Hurd Opticians,OP_5PJ_0006__000002_ST13BT,OPT,15 Regent Road,Hanley,Stoke-on-Trent,Staffordshire,,ST1 3BT,Tel: 01782 266228, - ,,,No ratings yet Rate it yourself - /Services/opticians/LeaveReview/DefaultView.aspx?id=OP_5PJ_0006__000002_ST13BT,0,0,
Specsavers Opticians,OP_5HW_3465__000001_ST51QZ,OPT,Unit 9 Castle Walk,,Staffordshire,Newcastle-under-Lyme,Staffordshire,ST5 1AN,Tel: 01782 714 444, - ,,,3 ratings Rate it yourself - /Services/opticians/LeaveReview/DefaultView.aspx?id=OP_5HW_3465__000001_ST51QZ,,,
Dollond & Aitchison,OP_5HW_13142__000001_ST51SW,OPT,Unit 11 Roebuck Centre,High Street,Newcastle-under-Lyme,,,ST5 1SW,Tel: 01782 630 478, - ,,,No ratings yet Rate it yourself - /Services/opticians/LeaveReview/DefaultView.aspx?id=OP_5HW_13142__000001_ST51SW,0,0,
Boots-Newcastle under Lyme - High St,OP_5HW_5841__000002_ST51QL,OPT,60-62 High Street,,,Newcastle Under Lyme,Staffordshire,ST5 1QL,Tel: 01782 711739, - ,,,1 rating Rate it yourself - /Services/opticians/LeaveReview/DefaultView.aspx?id=OP_5HW_5841__000002_ST51QL,,,
B Newbold (Newcastle) Ltd,OP_5HW_9731__000001_ST51RP,OPT,34 Ironmarket,,Newcastle,,,ST5 1RP,Tel: 01782 617044, - ,,,No ratings yet Rate it yourself - /Services/opticians/LeaveReview/DefaultView.aspx?id=OP_5HW_9731__000001_ST51RP,0,0,
Lancaster & Thorpe,OP_5HW_10835__000001_ST52AE,OPT,57 Merrial Street,,Newcastle,,,ST5 2AE,Tel: 01782 617400, - ,,,No ratings yet Rate it yourself - /Services/opticians/LeaveReview/DefaultView.aspx?id=OP_5HW_10835__000001_ST52AE,0,0,
Browns Opticians,OP_5PH_0003__000002_ST52AE,OPT,33 Merrial Street,,Newcastle-under-Lyme,Staffordshire,,ST5 2AE,Tel: 01782 715113, - ,,,No ratings yet Rate it yourself - /Services/opticians/LeaveReview/DefaultView.aspx?id=OP_5PH_0003__000002_ST52AE,0,0,
Specsavers,TP9EM,OPT,,"Unit 9 Baddeley Court , Newport ",,Shropshire,,TF10 7GQ,, - ,,,No ratings yet Rate it yourself - /Services/opticians/LeaveReview/DefaultView.aspx?id=TP9EM,0,0,
Duignan Phelps Opticians,OP5MK49__000001_TF107AB,OPT,10 St Mary's Street,,Newport,Shropshire,,TF10 7AB,Tel: 01952 812820, - ,,,No ratings yet Rate it yourself - /Services/opticians/LeaveReview/DefaultView.aspx?id=OP5MK49__000001_TF107AB,0,0,yes
Glass House Eye Care Centre,OP_5MK_6162__000002_TF107AT,OPT,43 High Street,,Newport,,,TF10 7AT,Tel: 01952 812009, - ,,,1 rating Rate it yourself - /Services/opticians/LeaveReview/DefaultView.aspx?id=OP_5MK_6162__000002_TF107AT,,,
Evenett & Bishop Opticians,OP_5MK_5867__000001_TF107AT,OPT,35 High Street,,Newport,Shropshire,,TF10 7AT,Tel: 01952 810808, - ,,,No ratings yet Rate it yourself - /Services/opticians/LeaveReview/DefaultView.aspx?id=OP_5MK_5867__000001_TF107AT,0,0,
Portland Eye Care Services Ltd,5MX095,OPT,,19 New Street,Bridgtown,Cannock,,WS11 0DD,Tel: 01543 462029, - ,,,No ratings yet Rate it yourself - /Services/opticians/LeaveReview/DefaultView.aspx?id=5MX095,0,0,
Partridge Opticians,OP_5MK_9908__000001_TF107AY,OPT,Partridge Opticians,81 High Street,,Newport,Shropshire,TF10 7AY,Tel: 01952 811750, - ,,,No ratings yet Rate it yourself - /Services/opticians/LeaveReview/DefaultView.aspx?id=OP_5MK_9908__000001_TF107AY,0,0,
Optical Express,ST1 1QH_27836,OPT,Suite 10 The Forecourt,12 Albion St,,Stoke-on-trent,Staffordshire,ST1 1QH,Tel: 0800 023 2020, - ,,,No ratings yet Rate it yourself - /Services/opticians/LeaveReview/DefaultView.aspx?id=ST1 1QH_27836,0,0,
Crown Eyeglass,OP_5ME_7857__000001_ST11NQ,OPT,16 Tontine Street,,Stoke-on-Trent,,,ST1 1NQ,Tel: 01782 206969, - ,,,No ratings yet Rate it yourself - /Services/opticians/LeaveReview/DefaultView.aspx?id=OP_5ME_7857__000001_ST11NQ,0,0,
Specsavers Opticians,OP_5ME_13105__000001_ST11NP,OPT,2/4 Piccadilly,Hanley,Stoke-on-Trent,,,ST1 1DF,Tel: 01782 206662, - ,,,No ratings yet Rate it yourself - /Services/opticians/LeaveReview/DefaultView.aspx?id=OP_5ME_13105__000001_ST11NP,0,0,
Glyn Jones (Hanley) Ltd,OP_5ME_12317__000001_ST15LA,OPT,36 Trinity Street,,Stoke-on-Trent,Hanley,Staffordshire,ST1 5LA,Tel: 01782 212666, - ,,,7 ratings Rate it yourself - /Services/opticians/LeaveReview/DefaultView.aspx?id=OP_5ME_12317__000001_ST15LA,,,
Boots-Hanley - Upper Market Sq,OP_5ME_1700__000002_ST11PZ,OPT,3-5 Upper Market Square,,Stoke-on-Trent,Hanley,Staffordshire,ST1 1PZ,Tel: 01782 202064, - ,,,No ratings yet Rate it yourself - /Services/opticians/LeaveReview/DefaultView.aspx?id=OP_5ME_1700__000002_ST11PZ,0,0,
Cannock Voyager Specsavers,L6R0Z,OPT,Sainsbury's,Voyager Drive,Orbital Retail Centre,Cannock,Staffordshire,WS11 8XP,Tel: 01543 462 232, - ,,,No ratings yet Rate it yourself - /Services/opticians/LeaveReview/DefaultView.aspx?id=L6R0Z,0,0,
Dolland & Aitchison,OP_5PH_0004__000004_ST11PS,OPT,Unit 221 Potteries Shopping Centre,Hanley,Stoke-on-Trent,Staffordshire,,ST1 1PS,Tel: 01782 219754, - ,,,No ratings yet Rate it yourself - /Services/opticians/LeaveReview/DefaultView.aspx?id=OP_5PH_0004__000004_ST11PS,0,0,
Vision Express (UK) Ltd,OP_5ME_12350__000002_ST11PS,OPT,The Potteries Shopping Centre,Hanley,Stoke-on-Trent,,,ST1 1PS,Tel: 01782 283400, - ,,,No ratings yet Rate it yourself - /Services/opticians/LeaveReview/DefaultView.aspx?id=OP_5ME_12350__000002_ST11PS,0,0,
Asda Opticians,OP_5PH_0002__000001_ST50AP,OPT,Wolstanton Retail Park,Wolstanton,Newcastle-under-Lyme,Staffordshire,,ST5 0AP,Tel: 01782 349112, - ,,,158 ratings Rate it yourself - /Services/opticians/LeaveReview/DefaultView.aspx?id=OP_5PH_0002__000001_ST50AP,,,
Nusyte Opticians (Wol),OP_5HW_2210__000004_ST50EP,OPT,Nusyte Opticians (Wol),107 High Street,Wolstanton,Newcastle-u-Lyme,,ST5 0EP,Tel: 01782 617072, - ,,,No ratings yet Rate it yourself - /Services/opticians/LeaveReview/DefaultView.aspx?id=OP_5HW_2210__000004_ST50EP,0,0,
David Stidwill Optometrist,OP_5DQ_9442__000001_WS78AG,OPT,31 Rugeley Road,Chase Terrace,Burntwood,,,WS7 8AG,Tel: 01543 682730, - ,,,No ratings yet Rate it yourself - /Services/opticians/LeaveReview/DefaultView.aspx?id=OP_5DQ_9442__000001_WS78AG,0,0,
Boots-Chase Terrace - Burntwood,OP_5DQ_14949__000002_WS78JR,OPT,Unit 14,Burntwood Town Centre,,Cannock Road,,WS7 1JR,Tel: 01543 686 498, - ,,,No ratings yet Rate it yourself - /Services/opticians/LeaveReview/DefaultView.aspx?id=OP_5DQ_14949__000002_WS78JR,0,0,
KELCHER OPTOMETRISTS,OP_5MN_12465__000001_WS66DZ,OPT,88A Wardles Lane,Great Wryley,,Walsall,Staffordshire,WS6 6DY,Tel: 01922 412040, - ,,,No ratings yet Rate it yourself - /Services/opticians/LeaveReview/DefaultView.aspx?id=OP_5MN_12465__000001_WS66DZ,0,0,Data not available
A Hurd Opticians,OP_5PJ_0005__000001_ST27BW,OPT,48 Millrise Road,Milton,Stoke-on-Trent,Staffordshire,,ST2 7BW,Tel: 01782 570057, - ,,,No ratings yet Rate it yourself - /Services/opticians/LeaveReview/DefaultView.aspx?id=OP_5PJ_0005__000001_ST27BW,0,0,
Nusyte Opticians (burslem),OP_5PJ_0007__000002_ST63EH,OPT,Nusyte Opticians (Burslem),45 Queen Street,Burslem,Stoke-on-Trent,Staffordshire,ST6 3EH,Tel: 01782 834936, - ,,,No ratings yet Rate it yourself - /Services/opticians/LeaveReview/DefaultView.aspx?id=OP_5PJ_0007__000002_ST63EH,0,0,
See to it Opticians Ltd,S7T7F,OPT,,21 Ruston Road,,Burntwood,,WS7 3RU,, - ,,,No ratings yet Rate it yourself - /Services/opticians/LeaveReview/DefaultView.aspx?id=S7T7F,0,0,
Scrivens Ltd,OP_5ME_6427__000001_ST63AG,OPT,37 Market Place,Burslem,,Stoke on Trent,Staffordshire,ST6 3AG,Tel: 01782 837530, - ,,,1 rating Rate it yourself - /Services/opticians/LeaveReview/DefaultView.aspx?id=OP_5ME_6427__000001_ST63AG,,,
Optical and Hearing Centre,5PK/6400__000001_WV107AU,OPT,Surgery House,2 South Crescent,Featherstone,,,WV10 7AU,Tel: 01902 306925, - ,,,No ratings yet Rate it yourself - /Services/opticians/LeaveReview/DefaultView.aspx?id=5PK/6400__000001_WV107AU,0,0,
Colin Lee Opticians,7790_7791__000001_WS70DW,OPT,2 Swan Island Shopping Precinct,Chase Road,Burntwood,Staffordshire,,WS7 0DW,, - ,,,No ratings yet Rate it yourself - /Services/opticians/LeaveReview/DefaultView.aspx?id=7790_7791__000001_WS70DW,0,0,
Nusyte Opticians (tunstall),OP_5ME_4057__000001_ST65AN,OPT,Nusyte Opticians (Tunstall),115 High street,Tunstall,Stoke-on-Trent,Staffordshire,ST6 5TA,Tel: 01782 837858, - ,,,1 rating Rate it yourself - /Services/opticians/LeaveReview/DefaultView.aspx?id=OP_5ME_4057__000001_ST65AN,,,
James Herd Opticians,OP_5ME_4308__000001_ST65TA,OPT,59 High Street,Tunstall,Stoke-on-Trent,,,ST6 5TA,Tel: 01782 837961, - ,,,No ratings yet Rate it yourself - /Services/opticians/LeaveReview/DefaultView.aspx?id=OP_5ME_4308__000001_ST65TA,0,0,
Nuvision Opticians,CO-5045,OPT,Nuvision,84 High Street Stoke on Trent,,Stoke on Trent,Staffordshire,ST6 5TJ,Tel: 01782 499600, - ,,,No ratings yet Rate it yourself - /Services/opticians/LeaveReview/DefaultView.aspx?id=CO-5045,0,0,
Ernest G Hanwell Ltd,OP_5ME_10839__000001_ST65AA,OPT,8 Tower Square,Tunstall,Stoke-on-Trent,,,ST6 5AA,Tel: 01782 838710, - ,,,No ratings yet Rate it yourself - /Services/opticians/LeaveReview/DefaultView.aspx?id=OP_5ME_10839__000001_ST65AA,0,0,
Burgess Opticians,OP_5PJ_0002__000001_ST65AW,OPT,97 Roundwell Street,Tunstall,Stoke-on-Trent,Staffordshire,,ST6 5AW,Tel: 01782 837881, - ,,,No ratings yet Rate it yourself - /Services/opticians/LeaveReview/DefaultView.aspx?id=OP_5PJ_0002__000001_ST65AW,0,0,
Flint & Partners,OP_5MN_7633__000001_WV81PT,OPT,15 The Square,Wolverhampton Road,,Codsall,,WV8 1PT,Tel: 01902 846745, - ,,,No ratings yet Rate it yourself - /Services/opticians/LeaveReview/DefaultView.aspx?id=OP_5MN_7633__000001_WV81PT,0,0,
Scrivens Ltd,OP_5MV_585__000001_WV106BA,OPT,5 Three Tuns Parade,Stafford Road,,Fordhouses,West Midlands,WV10 6BA,Tel: 01902 782280, - ,,,No ratings yet Rate it yourself - /Services/opticians/LeaveReview/DefaultView.aspx?id=OP_5MV_585__000001_WV106BA,0,0,
Miracle Eyes Ltd,OP_5MV_853__000001_WV106RT,OPT,Unit 4 Marsh Lane Parade,"Three Tuns, Fordhouses",,Wolverhampton,,WV10 6RT,Tel: 01902 789900, - ,,,No ratings yet Rate it yourself - /Services/opticians/LeaveReview/DefaultView.aspx?id=OP_5MV_853__000001_WV106RT,0,0,
4 Sight Eyecare Centre,OP_5MN_13987__000002_WV81PE,OPT,88 Wolverhampton Road,Birches Bridge,Codsall,,,WV8 1PE,Tel: 01902 844201, - ,,,No ratings yet Rate it yourself - /Services/opticians/LeaveReview/DefaultView.aspx?id=OP_5MN_13987__000002_WV81PE,0,0,
Specsavers Opticians,OP_WS86EQ_29574,OPT,,"Unit 1, 12 - 28 High Street",,Brownhills,,WS8 6EQ,Tel: 01543 363790, - ,,,No ratings yet Rate it yourself - /Services/opticians/LeaveReview/DefaultView.aspx?id=OP_WS86EQ_29574,0,0,
Frames 4 U,OP_5M3_12441__000001_WS86HH,OPT,50 High Street,Brownhills,,Walsall,,WS8 6EL,Tel: 01543 373731, - ,,,1 rating Rate it yourself - /Services/opticians/LeaveReview/DefaultView.aspx?id=OP_5M3_12441__000001_WS86HH,,,
Boots-Brownhills,OP_5M3_6340__000001_WS86EL,OPT,42 High Street,Brownhills,,Walsall,West Midlands,WS8 6EL,Tel: 01543 372 696, - ,,,No ratings yet Rate it yourself - /Services/opticians/LeaveReview/DefaultView.aspx?id=OP_5M3_6340__000001_WS86EL,0,0,