Organisation Name,NACS Code,Organisation Type,Address1,Address2,Address3,Address4,Address5,PostCode,Telephone Number,Opening time,Value  (Opening time),Banding Classification  (Opening time),NHS.UK users rating,Value  (NHS.UK users rating),Banding Classification  (NHS.UK users rating),Car parking (Is there car parking at this organisation?)
McCracken Opticians,OP_5ML_14383__000001_ST148HY,OPT,Northgate House,Church Street,Uttoxeter,Staffordshire,,ST14 8AG,Tel: 01889 562184, - ,,,No ratings yet Rate it yourself - /Services/opticians/LeaveReview/DefaultView.aspx?id=OP_5ML_14383__000001_ST148HY,0,0,
Specsavers Opticians,ST7783__000002_ST147HN,OPT,3 High Street,,Uttoxeter,Staffordshire,,ST14 7HN,Tel: 01889 561770, - ,,,No ratings yet Rate it yourself - /Services/opticians/LeaveReview/DefaultView.aspx?id=ST7783__000002_ST147HN,0,0,
Vision Express,5PK_004__000002_ST148HY,OPT,,15 Market Place,,Uttoxeter,Staffordshire,ST14 8HY,Tel: 01889 567474, - ,,,No ratings yet Rate it yourself - /Services/opticians/LeaveReview/DefaultView.aspx?id=5PK_004__000002_ST148HY,0,0,
Greens Opticians,OP_5H7_7481__000001_DE61GG,OPT,,2 The Gallery,,Ashbourne,Derbyshire,DE6 1GG,Tel: 01335 342484, - ,,,No ratings yet Rate it yourself - /Services/opticians/LeaveReview/DefaultView.aspx?id=OP_5H7_7481__000001_DE61GG,0,0,yes
Vision Express,OL18376/5N6__000003_DE61GH,OPT,,42 St John Street,,Ashbourne,Derbyshire,DE6 1GH,Tel: 01335 300199, - ,,,No ratings yet Rate it yourself - /Services/opticians/LeaveReview/DefaultView.aspx?id=OL18376/5N6__000003_DE61GH,0,0,
John Fell Opticians Ltd ,OP_5H7_10985__000002_DE61GH,OPT,Horse and Jockey Yard,St John Street,Ashbourne,,,DE6 1GH,Tel: 01335 300658, - ,,,No ratings yet Rate it yourself - /Services/opticians/LeaveReview/DefaultView.aspx?id=OP_5H7_10985__000002_DE61GH,0,0,
Tutbury Opticians,OP_5ML_7802__000001_DE139LU,OPT,"Unit 8, Tutbury Mill Mews",6 Lower High Street,Tutbury,Staffs,,DE13 9LU,Tel: 01283 813329, - ,,,No ratings yet Rate it yourself - /Services/opticians/LeaveReview/DefaultView.aspx?id=OP_5ML_7802__000001_DE139LU,0,0,
Nusyte Opticians (chedle),OP_5HR_4056__000002_ST101AF,OPT,Nusyte Opticians (Cheadle),50 High street,Cheadle,Stoke-on-Trent,Staffordshire,ST10 1AF,Tel: 01538 752085, - ,,,No ratings yet Rate it yourself - /Services/opticians/LeaveReview/DefaultView.aspx?id=OP_5HR_4056__000002_ST101AF,0,0,
Hilton Opticians,3963,OPT,Hilton Opticians,Welland Road,,"Hilton, Derby",,DE65 5GZ,Tel: 01283736353, - ,,,No ratings yet Rate it yourself - /Services/opticians/LeaveReview/DefaultView.aspx?id=3963,0,0,yes
Carlton Opticians Burton Upon Trent,TP8WQ,OPT,,First Floor,118 Calais Road,Burton On Trent,,DE13 0UW,Tel: 01283512066, - ,,,1 rating Rate it yourself - /Services/opticians/LeaveReview/DefaultView.aspx?id=TP8WQ,,,
Gillian E Scarisbrick Optometrist,OPT_ST119LY_1,OPT,,"266 Uttoxeter Road, Blythe Bridge",,Stoke on Trent,,ST11 9LY,Tel: 01782 388355, - ,,,No ratings yet Rate it yourself - /Services/opticians/LeaveReview/DefaultView.aspx?id=OPT_ST119LY_1,0,0,
John Fell Opticians Ltd,5N7_DE235GB__000001_DE235GB,OPT,"8 The Parade, Uttoxeter Road",Mickleover,Derby,Derbyshire,,DE3 0GB,Tel: 01332 517388, - ,,,1 rating Rate it yourself - /Services/opticians/LeaveReview/DefaultView.aspx?id=5N7_DE235GB__000001_DE235GB,,,
Midlands Eye Care Ltd,CO/7100/5PK,OPT,,59 New Street,,Burton-on-Trent,,DE14 3QY,Tel: 01283 561320, - ,,,No ratings yet Rate it yourself - /Services/opticians/LeaveReview/DefaultView.aspx?id=CO/7100/5PK,0,0,
Prince and Bates Opticians,OP_5ML_9729__000001_DE141BH,OPT,193 Station Street,,,Burton On Trent,Staffordshire,DE14 1BH,Tel: 01283 542482, - ,,,1 rating Rate it yourself - /Services/opticians/LeaveReview/DefaultView.aspx?id=OP_5ML_9729__000001_DE141BH,,,
Boots-Burton on Trent - Burton Place,OP_5ML_13082__000001_DE141BU,OPT,"Unit 8, Burton Place",,,Burton-on-Trent,Staffordshire,DE14 1BU,Tel: 01283 510130, - ,,,No ratings yet Rate it yourself - /Services/opticians/LeaveReview/DefaultView.aspx?id=OP_5ML_13082__000001_DE141BU,0,0,
Vision Express (UK) Ltd,OP_5ML_7820__000001_DE141DE,OPT,2 Underhill Walk,Burton On Trent,Staffordshire,,,DE14 1DE,Tel: 01283 511772, - ,,,No ratings yet Rate it yourself - /Services/opticians/LeaveReview/DefaultView.aspx?id=OP_5ML_7820__000001_DE141DE,0,0,
Lancaster Thorpe,OP_5ML_5577__000001_DE141AN,OPT,198 Station Street,Burton On Trent,Staffordshire,,,DE14 1AN,Tel: 01283 568652, - ,,,No ratings yet Rate it yourself - /Services/opticians/LeaveReview/DefaultView.aspx?id=OP_5ML_5577__000001_DE141AN,0,0,
Specsavers Opticians,OP_5ML_2645__000001_DE149JF,OPT,176 High Street,Burton On Trent,Staffordshire,,,DE14 1JF,Tel: 01283 500 117, - ,,,1 rating Rate it yourself - /Services/opticians/LeaveReview/DefaultView.aspx?id=OP_5ML_2645__000001_DE149JF,,,
Richard Petrie Optometrist,OP_5EX_5001__000002_DE236DF,OPT,564 Burton Road,Littleover,Derby,,,DE23 6DF,Tel: 01332 291010, - ,,,1 rating Rate it yourself - /Services/opticians/LeaveReview/DefaultView.aspx?id=OP_5EX_5001__000002_DE236DF,,,
Razvi SIH,OP_5MF_4701__000001_ST36AF,OPT,1 Cornelious Street,,Stoke-on-Trent,,,ST3 6AF,Tel: 01782 314673, - ,,,No ratings yet Rate it yourself - /Services/opticians/LeaveReview/DefaultView.aspx?id=OP_5MF_4701__000001_ST36AF,0,0,
Allestree Eyecare,OP_5EX_4179__000001_DE222QQ,OPT,29 Park Farm Centre,Allestree,Derby,,,DE22 2QN,Tel: 01332 554797, - ,,,No ratings yet Rate it yourself - /Services/opticians/LeaveReview/DefaultView.aspx?id=OP_5EX_4179__000001_DE222QQ,0,0,
Philip Bradley Opticians,OP_5EX_3278__000002_DE222QN,OPT,Park Farm Centre,Allestree,Derby,,,DE22 2QN,Tel: 01332 550674, - ,,,1 rating Rate it yourself - /Services/opticians/LeaveReview/DefaultView.aspx?id=OP_5EX_3278__000002_DE222QN,,,
The Eye Gallery,DE222GP__000003_DE222GP,OPT,6 Blenheim Parade,Allestree,Derby,Derbyshire,,DE22 2GP,Tel: 01332 551010, - ,,,No ratings yet Rate it yourself - /Services/opticians/LeaveReview/DefaultView.aspx?id=DE222GP__000003_DE222GP,0,0,
Right Vision Ophthalmic Opticians,01-19976/5PL/C__000002_B694DS,OPT,6 Richardson Way,,Rugeley,Staffordshire,,WS15 2TD,Tel: 07966 960606, - ,,,No ratings yet Rate it yourself - /Services/opticians/LeaveReview/DefaultView.aspx?id=01-19976/5PL/C__000002_B694DS,0,0,
Derbyshire Eyecare,OP_5ED_7784__000001_DE564GH,OPT,,31 Town Street,,Duffield,Derbyshire,DE56 4GD,Tel: 01332 843666, - ,,,No ratings yet Rate it yourself - /Services/opticians/LeaveReview/DefaultView.aspx?id=OP_5ED_7784__000001_DE564GH,0,0,yes
Specsavers Opticians,21975__000002_DE237JA,OPT,10-12 Stenson Road,Normanton,Derby,Derbyshire,,DE23 1JA,Tel: 01332 771555, - ,,,No ratings yet Rate it yourself - /Services/opticians/LeaveReview/DefaultView.aspx?id=21975__000002_DE237JA,0,0,
The Eye Gallery,OP_5AL_13291__000002_DE13NR,OPT,31 Sadler Gate,Derby,,,,DE1 3NR,Tel: 01332 332759, - ,,,No ratings yet Rate it yourself - /Services/opticians/LeaveReview/DefaultView.aspx?id=OP_5AL_13291__000002_DE13NR,0,0,
Vision Express UK Ltd,OP_5AL_1100__000003_DE12AZ,OPT,Unit 111 Level 1,"North Mall, Westfield Centre",Derby,Derbyshire,,DE1 1PG,Tel: 01332 295411, - ,,,No ratings yet Rate it yourself - /Services/opticians/LeaveReview/DefaultView.aspx?id=OP_5AL_1100__000003_DE12AZ,0,0,
Lancaster & Thorpe Ltd,OP_5AL_2249__000001_DE13NQ,OPT,14 Sadler Gate,,,Derby,Derbyshire,DE1 3NF,Tel: 01332 341186, - ,,,No ratings yet Rate it yourself - /Services/opticians/LeaveReview/DefaultView.aspx?id=OP_5AL_2249__000001_DE13NQ,0,0,no
Colin Lee Opticians (Rugeley),OP_5DQ_14952__000002_WS152DA,OPT,1 Shrewsbury Mall,Market Square,Rugeley,,,WS15 2DA,Tel: 01889 570544, - ,,,3 ratings Rate it yourself - /Services/opticians/LeaveReview/DefaultView.aspx?id=OP_5DQ_14952__000002_WS152DA,,,
Fosman Ltd,OP_5H7_9628__000001_DE44DR,OPT,7 St. John Street,Wirksworth,Derbyshire,,,DE4 4DR,Tel: 01629 825125, - ,,,No ratings yet Rate it yourself - /Services/opticians/LeaveReview/DefaultView.aspx?id=OP_5H7_9628__000001_DE44DR,0,0,
Adams Opticians,OP_5AL_4749__000002_DE243DS,OPT,16b Sinfin District Centre,Sinfin,Derby,Derbyshire,,DE24 3DS,Tel: 01332 272400, - ,,,1 rating Rate it yourself - /Services/opticians/LeaveReview/DefaultView.aspx?id=OP_5AL_4749__000002_DE243DS,,,
Boots-Rugeley,OL/01-014482/5PK__000001_WS152DR,OPT,2 Brook Square,,,Rugeley,Staffordshire,WS15 2DR,Tel: 01889 579000, - ,,,1 rating Rate it yourself - /Services/opticians/LeaveReview/DefaultView.aspx?id=OL/01-014482/5PK__000001_WS152DR,,,
"Specsavers Opticians, Rugeley",CO-3227/5PK/C__000003_WS152DP,OPT,5 Upper Brook Street,,Rugeley,Staffordshire,,WS15 2DP,Tel: 01889 576060, - ,,,No ratings yet Rate it yourself - /Services/opticians/LeaveReview/DefaultView.aspx?id=CO-3227/5PK/C__000003_WS152DP,0,0,
Scrivens Opticians & Hearing Care,OP_5MM_438__000001_WS152DN,OPT,16a Upper Brook Street,16a Upper Brook Street,Staffordshire,Rugeley,,WS15 2DN,Tel: 01889 575257, - ,,,No ratings yet Rate it yourself - /Services/opticians/LeaveReview/DefaultView.aspx?id=OP_5MM_438__000001_WS152DN,0,0,
Ultimate Spex,OP_5AL_13292__000001_DE236UT,OPT,281 Normanton Road,,Derby,,,DE23 6UU,Tel: 01332 294599, - ,,,2 ratings Rate it yourself - /Services/opticians/LeaveReview/DefaultView.aspx?id=OP_5AL_13292__000001_DE236UT,,,
Lancaster & Thorpe Ltd,OP_5AL_574__000001_DE11SR,OPT,100 St. Peters Street,,,Derby,Derbyshire,DE1 1SR,Tel: 01332 348271, - ,,,No ratings yet Rate it yourself - /Services/opticians/LeaveReview/DefaultView.aspx?id=OP_5AL_574__000001_DE11SR,0,0,no
Optical Express,OP_5AL_3683__000001_DE12NR,OPT,4 St. Peters Way,,,Derby,Derbyshire,DE1 2NR,Tel: 0800 023 2020, - ,,,2 ratings Rate it yourself - /Services/opticians/LeaveReview/DefaultView.aspx?id=OP_5AL_3683__000001_DE12NR,,,
Burrows & Wozencroft Opticians,OP_5AL_5887__000001_DE236US,OPT,191 Normanton Road,,,Derby,,DE23 6US,Tel: 01332 345034, - ,,,No ratings yet Rate it yourself - /Services/opticians/LeaveReview/DefaultView.aspx?id=OP_5AL_5887__000001_DE236US,0,0,
Specsavers Opticians,OP_5AL_52__000001_DE12AZ,OPT,22 Crown Walk,Eagle Centre,Derby,,,DE1 2NP,Tel: 01332 294939, - ,,,No ratings yet Rate it yourself - /Services/opticians/LeaveReview/DefaultView.aspx?id=OP_5AL_52__000001_DE12AZ,0,0,
Wozencroft & Co,OP_5AL_10290__000001_DE12JH,OPT,59 Osmaston Road,,Derby,,,DE1 2JH,Tel: 01332 348063, - ,,,No ratings yet Rate it yourself - /Services/opticians/LeaveReview/DefaultView.aspx?id=OP_5AL_10290__000001_DE12JH,0,0,
Boots-Derby - Devonshire Walk (in Boots UK),OP_5AL_2840__000002_DE12AH,OPT,1 Devonshire Walk,,,Derby,Derbyshire,DE1 2AH,Tel: 01332 384701, - ,,,No ratings yet Rate it yourself - /Services/opticians/LeaveReview/DefaultView.aspx?id=OP_5AL_2840__000002_DE12AH,0,0,
Specs 4U Opticians,DE12NQ__000001_DE12NQ,OPT,Su 109-Level 1-North Mall,Westfield Centre,Derby,Derbyshire,,DE1 2NQ,Tel: 01332 348990, - ,,,No ratings yet Rate it yourself - /Services/opticians/LeaveReview/DefaultView.aspx?id=DE12NQ__000001_DE12NQ,0,0,
Specs Opticians,OP_5AL_13293__000001_DE12RD,OPT,106 Osmaston Road,,Derby,,,DE1 2RD,Tel: 01332 385287, - ,,,No ratings yet Rate it yourself - /Services/opticians/LeaveReview/DefaultView.aspx?id=OP_5AL_13293__000001_DE12RD,0,0,
Specs 4 U Opticians,SPECS__000001_DE12NG,OPT,19 Theatre Walk,Westfield Centre,Derby,Derbyshire,,DE1 2NG,Tel: 01332 348990, - ,,,No ratings yet Rate it yourself - /Services/opticians/LeaveReview/DefaultView.aspx?id=SPECS__000001_DE12NG,0,0,
Optique Vision Ltd,OL/CO/3453/5N7__000001_DE12PQ,OPT,Unit 157 Intu Centre,Unit 157 Level 1,Intu Centre,Derby,Derbyshire,DE1 2PL,Tel: 01332 208880, - ,,,No ratings yet Rate it yourself - /Services/opticians/LeaveReview/DefaultView.aspx?id=OL/CO/3453/5N7__000001_DE12PQ,0,0,yes
"John Saum Optometrist, Newbold Opticians t/a The Specsplace",OP_5ME__000001_ST31BS,OPT,,"46a Market Street,",,Longton / Stoke on Trent,,ST3 1BS,Tel: 01782 330803, - ,,,No ratings yet Rate it yourself - /Services/opticians/LeaveReview/DefaultView.aspx?id=OP_5ME__000001_ST31BS,0,0,
Specsavers Opticians,5MF-272__000002_ST31BS,OPT,36-38 Market Street,Longton,Stoke On Trent,Staffordshire,,ST3 1BS,Tel: 01782 337830, - ,,,No ratings yet Rate it yourself - /Services/opticians/LeaveReview/DefaultView.aspx?id=5MF-272__000002_ST31BS,0,0,
Boots-Longton,OP_5MF_11634__000002_ST32HX,OPT,24-26 Bennett Precinct,,,Longton,Staffordshire,ST3 2JA,Tel: 01782 599002, - ,,,No ratings yet Rate it yourself - /Services/opticians/LeaveReview/DefaultView.aspx?id=OP_5MF_11634__000002_ST32HX,0,0,
Portland Opticians,5MF-202__000002_ST31BE,OPT,21 Market Street,Longton,Stoke On Trent,Staffordshire,,ST3 1BE,Tel: 01782 319930, - ,,,No ratings yet Rate it yourself - /Services/opticians/LeaveReview/DefaultView.aspx?id=5MF-202__000002_ST31BE,0,0,
R K Mehta,OP_5MF_8544__000001_ST32JF,OPT,31 The Strand,Longton,,STOKE-ON-TRENT,Staffordshire,ST3 2JF,Tel: 01782 319703, - ,,,No ratings yet Rate it yourself - /Services/opticians/LeaveReview/DefaultView.aspx?id=OP_5MF_8544__000001_ST32JF,0,0,
Tesco Opticians Limited,OP_5PH_0291__000001_ST32JB,OPT,Baths Passage,Longton,Stoke On Trent,,,ST3 2JB,Tel: 01782 424400, - ,,,No ratings yet Rate it yourself - /Services/opticians/LeaveReview/DefaultView.aspx?id=OP_5PH_0291__000001_ST32JB,0,0,
Brian Hitchin ,-44 5LC__000002_ST158AD,OPT,,48 Mount Avenue,,Stone,Staffordshire,ST15 8EE,Tel: 01785 815 656, - ,,,No ratings yet Rate it yourself - /Services/opticians/LeaveReview/DefaultView.aspx?id=-44 5LC__000002_ST158AD,0,0,
Vision Express,C/01-16611__000002_DE561PW,OPT,,3 King Street,,Belper,Derbyshire,DE56 1PW,Tel: 01773 825361, - ,,,1 rating Rate it yourself - /Services/opticians/LeaveReview/DefaultView.aspx?id=C/01-16611__000002_DE561PW,,,
Scrivens Opticians & Hearing Care,,OPT,,27 High Street,,Stone,,ST15 8AJ,Tel: 01785 814777, - ,,,N/A - Data not available,,,
A Hurd Opticians,OP_5HR_1256__000001_ST136JP,OPT,3 Cawdry Buildings,Fountain Street,Leek,,,ST13 6JP,Tel: 01538 382 927, - ,,,No ratings yet Rate it yourself - /Services/opticians/LeaveReview/DefaultView.aspx?id=OP_5HR_1256__000001_ST136JP,0,0,
Boots-Leek,OP_5HR_13040__000002_ST136HN,OPT,44 Derby Street,,,Leek,Staffordshire,ST13 5AJ,Tel: 01538 385950, - ,,,No ratings yet Rate it yourself - /Services/opticians/LeaveReview/DefaultView.aspx?id=OP_5HR_13040__000002_ST136HN,0,0,
Nusyte Opticians (Stone),5PK_ST15 8YQ__000001_ST158YQ,OPT,Nusyte Opticians (Stone),1/2 Oddfellows,Adies Alley,Stone,Staffordshire,ST15 8YQ,Tel: 01785 814777, - ,,,No ratings yet Rate it yourself - /Services/opticians/LeaveReview/DefaultView.aspx?id=5PK_ST15 8YQ__000001_ST158YQ,0,0,
Specsavers Opticians,OL19617/5N6__000002_DE561PL,OPT,46-48 King Street,Belper,Derbyshire,,,DE56 1PL,Tel: 01773 824375, - ,,,No ratings yet Rate it yourself - /Services/opticians/LeaveReview/DefaultView.aspx?id=OL19617/5N6__000002_DE561PL,0,0,
Peter Bowers Optometrist,OP_5MN_2377__000001_ST158AD,OPT,,63A High Street,,Stone,Staffordshire,ST15 8AD,Tel: 01785 813902, - ,,,No ratings yet Rate it yourself - /Services/opticians/LeaveReview/DefaultView.aspx?id=OP_5MN_2377__000001_ST158AD,0,0,
Lancaster & Thorpe Opticians,OP_5ED_1708__000001_DE561AX,OPT,29B King Street,,,Belper,Derbyshire,DE56 1PX,Tel: 01773 822231, - ,,,No ratings yet Rate it yourself - /Services/opticians/LeaveReview/DefaultView.aspx?id=OP_5ED_1708__000001_DE561AX,0,0,no
Belper Opticians,OP_5ED_4604__000001_DE561PZ,OPT,72 King Street,Belper,Derbyshire,Belper,,DE56 1PZ,Tel: 01773 825614, - ,,,No ratings yet Rate it yourself - /Services/opticians/LeaveReview/DefaultView.aspx?id=OP_5ED_4604__000001_DE561PZ,0,0,
B Newbold (Leek) Ltd,OP_5HR_9303__000001_ST135DN,OPT,,49 St. Edward Street,,Leek,Staffordshire,ST13 5DN,Tel: 01538 382090, - ,,,3 ratings Rate it yourself - /Services/opticians/LeaveReview/DefaultView.aspx?id=OP_5HR_9303__000001_ST135DN,,,
Brian Hitchin (DOM),5LA_OPT_44__000003_ST158AD,OPT,"60, Pirehill Lane,",,,Stone,Staffordshire,ST15 0JN,Tel: 017581 5656, - ,,,No ratings yet Rate it yourself - /Services/opticians/LeaveReview/DefaultView.aspx?id=5LA_OPT_44__000003_ST158AD,0,0,
Simply Specs,OP_5AL_1484__000001_DE249BR,OPT,851 Osmaston Road,Allenton,Derby,,,DE24 9BR,Tel: 01332 362365, - ,,,No ratings yet Rate it yourself - /Services/opticians/LeaveReview/DefaultView.aspx?id=OP_5AL_1484__000001_DE249BR,0,0,
Costco Derby,OP_DE216RS_46388,OPT,Costco,Wyvernside,Wyvern Way,Derby,,DE21 6RS,Tel: 01332 680815, - ,,,No ratings yet Rate it yourself - /Services/opticians/LeaveReview/DefaultView.aspx?id=OP_DE216RS_46388,0,0,
Lancaster & Thorpe,OP_5EX_2164__000002_DE216NA,OPT,495 Nottingham Road,Chaddesden,,Derby,Derbyshire,DE21 6NA,Tel: 01332 666806, - ,,,No ratings yet Rate it yourself - /Services/opticians/LeaveReview/DefaultView.aspx?id=OP_5EX_2164__000002_DE216NA,0,0,yes
Elks Opticians,OP_5H7_13296__000001_DE110AG,OPT,12 Midland Road,Swadlincote,Derbyshire,,,DE11 0AG,Tel: 01283 216284, - ,,,No ratings yet Rate it yourself - /Services/opticians/LeaveReview/DefaultView.aspx?id=OP_5H7_13296__000001_DE110AG,0,0,
Oakwood Eyecare,OP_5EX_233__000002_DE212HT,OPT,Oakwood District Centre,Off Bishops Drive,Oakwood,Derby,Derbyshire,DE21 2HT,Tel: 01332 676433, - ,,,1 rating Rate it yourself - /Services/opticians/LeaveReview/DefaultView.aspx?id=OP_5EX_233__000002_DE212HT,,,yes
Grimley & Glynn Opticians,OP_5H7_2945__000002_DE119DG,OPT,15 West Street,Swadlincote,Derbyshire,,,DE11 9DG,Tel: 01283 222535, - ,,,1 rating Rate it yourself - /Services/opticians/LeaveReview/DefaultView.aspx?id=OP_5H7_2945__000002_DE119DG,,,
Specsavers Opticians,OL1743395N6__000004_DE118HY,OPT,26 High Street,,Swadlincote,Derbyshire,,DE11 8HY,Tel: 01283 552211, - ,,,No ratings yet Rate it yourself - /Services/opticians/LeaveReview/DefaultView.aspx?id=OL1743395N6__000004_DE118HY,0,0,
Scrivens Opticians & Hearing Care,OP_5H7_7184__000001_DE118HY,OPT,,18 High Street,,Swadlincote,Derbyshire,DE11 8HY,Tel: 01283 217262, - ,,,No ratings yet Rate it yourself - /Services/opticians/LeaveReview/DefaultView.aspx?id=OP_5H7_7184__000001_DE118HY,0,0,no
Prince & Bates Opticians,OP_5H7_2251__000002_DE118HY,OPT,16 High Street,Swadlincote,Derbyshire,,,DE11 8HY,Tel: 01283 216602, - ,,,No ratings yet Rate it yourself - /Services/opticians/LeaveReview/DefaultView.aspx?id=OP_5H7_2251__000002_DE118HY,0,0,
Personaleyez Swadlincote ltd,OPL/01-14091/5N7,OPT,,Unit 2a Rinkway Business Park,Rink Drive,Swadlincote,Derbyshire,DE11 8JL,Tel: 01283 226358, - ,,,No ratings yet Rate it yourself - /Services/opticians/LeaveReview/DefaultView.aspx?id=OPL/01-14091/5N7,0,0,yes
Chellaston Opticians,13690__000001_DE735AS,OPT,17 Derby Road,Chellaston,Derby,,,DE73 5AS,, - ,,,1 rating Rate it yourself - /Services/opticians/LeaveReview/DefaultView.aspx?id=13690__000001_DE735AS,,,
Asda Opticians,20129__000001_ST163TA,OPT,Queensway,,Stafford,Staffordshire,,ST16 3TA,Tel: 01785 782020, - ,,,No ratings yet Rate it yourself - /Services/opticians/LeaveReview/DefaultView.aspx?id=20129__000001_ST163TA,0,0,
Alvaston Opticians,OP_5AL_8422__000001_DE28QP,OPT,1260 London Road,Alvaston,,Derby,,DE24 8QP,Tel: 01332 571642, - ,,,No ratings yet Rate it yourself - /Services/opticians/LeaveReview/DefaultView.aspx?id=OP_5AL_8422__000001_DE28QP,0,0,yes
Vision Express Opticians,20135__000001_ST162BB,OPT,Unit 3,Stafford Riverside,Stafford,Staffs,,ST16 3AA,Tel: 01785 215077, - ,,,No ratings yet Rate it yourself - /Services/opticians/LeaveReview/DefaultView.aspx?id=20135__000001_ST162BB,0,0,
A Hurd Opticians,OP_5PJ_0005__000001_ST27BW,OPT,48 Millrise Road,Milton,Stoke-on-Trent,Staffordshire,,ST2 7BW,Tel: 01782 570057, - ,,,No ratings yet Rate it yourself - /Services/opticians/LeaveReview/DefaultView.aspx?id=OP_5PJ_0005__000001_ST27BW,0,0,
Direct Specs,5PK_ST16 2JU__000001_ST162JU,OPT,1 Salter Street,,Stafford,Staffordshire,,ST16 2JU,Tel: 01785 212001, - ,,,No ratings yet Rate it yourself - /Services/opticians/LeaveReview/DefaultView.aspx?id=5PK_ST16 2JU__000001_ST162JU,0,0,
Boots-Stafford - Goalgate St,OP_5MN_12039__000001_ST162NR,OPT,39 Gaolgate Street,,,Stafford,Staffordshire,ST16 2NR,Tel: 01785 225948, - ,,,1 rating Rate it yourself - /Services/opticians/LeaveReview/DefaultView.aspx?id=OP_5MN_12039__000001_ST162NR,,,
Specsavers Opticians,OP_5MN_11367__000001_ST162BQ,OPT,20 Gaolgate Street,Stafford,,Staffordshire,,ST16 2BQ,Tel: 01785 255210, - ,,,No ratings yet Rate it yourself - /Services/opticians/LeaveReview/DefaultView.aspx?id=OP_5MN_11367__000001_ST162BQ,0,0,
Asda Stores Ltd,OP_5EX_14058__000001_DE27UY,OPT,Derby Road,Spondon,,Derby,,DE21 7LW,Tel: 01332 826712, - ,,,1 rating Rate it yourself - /Services/opticians/LeaveReview/DefaultView.aspx?id=OP_5EX_14058__000001_DE27UY,,,
"Goodwin & Edge Ltd, T/A Mincher-Lockett Optometric Group",OP_5MN_3642__000001_ST162BP,OPT,18 Stafford Street,Stafford,,Staffordshire,,ST16 2BP,Tel: 01785 253478, - ,,,No ratings yet Rate it yourself - /Services/opticians/LeaveReview/DefaultView.aspx?id=OP_5MN_3642__000001_ST162BP,0,0,
Webb & Lucas ,OP_5MN_3588__000001_ST162HL,OPT,"Webb, Lucas & Stubbs Optometrists",8 Bridge Street,,Stafford,Staffordshire,ST16 2HL,Tel: 01785 242127, - ,,,1 rating Rate it yourself - /Services/opticians/LeaveReview/DefaultView.aspx?id=OP_5MN_3588__000001_ST162HL,,,
Eye Works,6800,OPT,,"No. 4, St. Mary's Mews",,Stafford,Staffordshire,ST16 2AP,Tel: 01785 249417, - ,,,No ratings yet Rate it yourself - /Services/opticians/LeaveReview/DefaultView.aspx?id=6800,0,0,
The Eye Works,D-10610__000001_ST162DF,OPT,"Unit G24, Sts. John's Market",Earl Street,,Stafford,,ST16 2DF,, - ,,,No ratings yet Rate it yourself - /Services/opticians/LeaveReview/DefaultView.aspx?id=D-10610__000001_ST162DF,0,0,
A Hurd Opticians,OP_5PJ_0006__000002_ST13BT,OPT,15 Regent Road,Hanley,Stoke-on-Trent,Staffordshire,,ST1 3BT,Tel: 01782 266228, - ,,,No ratings yet Rate it yourself - /Services/opticians/LeaveReview/DefaultView.aspx?id=OP_5PJ_0006__000002_ST13BT,0,0,
Ernest G Hanwell Ltd,OP_5ME_1538__000001_ST41HP,OPT,11 Glebe Street,,Stoke-on-Trent,,,ST4 1HP,Tel: 01782 844105, - ,,,No ratings yet Rate it yourself - /Services/opticians/LeaveReview/DefaultView.aspx?id=OP_5ME_1538__000001_ST41HP,0,0,
Nusyte Opticians (stoke),01-22440,OPT,,80-82 Church Street,,Stoke-on-Trent,,ST4 1BS,Tel: 01782 845592, - ,,,No ratings yet Rate it yourself - /Services/opticians/LeaveReview/DefaultView.aspx?id=01-22440,0,0,
Edwards RG,5MF-014__000002_ST44AA,OPT,80-82 Church Street,Stoke,Stoke On Trent,Staffordshire,,ST4 1BS,Tel: 01782 848070, - ,,,No ratings yet Rate it yourself - /Services/opticians/LeaveReview/DefaultView.aspx?id=5MF-014__000002_ST44AA,0,0,
Boots-Hanley - Upper Market Sq,OP_5ME_1700__000002_ST11PZ,OPT,3-5 Upper Market Square,,Stoke-on-Trent,Hanley,Staffordshire,ST1 1PZ,Tel: 01782 202064, - ,,,No ratings yet Rate it yourself - /Services/opticians/LeaveReview/DefaultView.aspx?id=OP_5ME_1700__000002_ST11PZ,0,0,
Crown Eyeglass,OP_5ME_7857__000001_ST11NQ,OPT,16 Tontine Street,,Stoke-on-Trent,,,ST1 1NQ,Tel: 01782 206969, - ,,,No ratings yet Rate it yourself - /Services/opticians/LeaveReview/DefaultView.aspx?id=OP_5ME_7857__000001_ST11NQ,0,0,
Optical Express,ST1 1QH_27836,OPT,Suite 10 The Forecourt,12 Albion St,,Stoke-on-trent,Staffordshire,ST1 1QH,Tel: 0800 023 2020, - ,,,No ratings yet Rate it yourself - /Services/opticians/LeaveReview/DefaultView.aspx?id=ST1 1QH_27836,0,0,
Heath JH,5MF-023__000001_ST48ES,OPT,2 Garfield Avenue,Hanford,,Stoke On Trent,Staffordshire,ST4 8ES,Tel: 01782 643999, - ,,,No ratings yet Rate it yourself - /Services/opticians/LeaveReview/DefaultView.aspx?id=5MF-023__000001_ST48ES,0,0,yes
Specsavers Opticians,OP_5ME_13105__000001_ST11NP,OPT,2/4 Piccadilly,Hanley,Stoke-on-Trent,,,ST1 1DF,Tel: 01782 206662, - ,,,No ratings yet Rate it yourself - /Services/opticians/LeaveReview/DefaultView.aspx?id=OP_5ME_13105__000001_ST11NP,0,0,
Dolland & Aitchison,OP_5PH_0004__000004_ST11PS,OPT,Unit 221 Potteries Shopping Centre,Hanley,Stoke-on-Trent,Staffordshire,,ST1 1PS,Tel: 01782 219754, - ,,,No ratings yet Rate it yourself - /Services/opticians/LeaveReview/DefaultView.aspx?id=OP_5PH_0004__000004_ST11PS,0,0,