Organisation Name,NACS Code,Organisation Type,Address1,Address2,Address3,Address4,Address5,PostCode,Telephone Number,Opening time,Value  (Opening time),Banding Classification  (Opening time),NHS.UK users rating,Value  (NHS.UK users rating),Banding Classification  (NHS.UK users rating),Car parking (Is there car parking at this organisation?)
Boots Opticians (Adams Eyecare Ltd),OP_5D3_5457__000001_NG319PH,OPT,,32 High Street,,Grantham,,NG31 9PH,Tel: 01476 594474, - ,,,No ratings yet Rate it yourself - /Services/opticians/LeaveReview/DefaultView.aspx?id=OP_5D3_5457__000001_NG319PH,0,0,Data not available
Asda Opticians,TP7AK,OPT,,Asda Grantham Superstore,,Grantham,,NG31 6NZ,Tel: 01476 581512, - ,,,No ratings yet Rate it yourself - /Services/opticians/LeaveReview/DefaultView.aspx?id=TP7AK,0,0,
Lunettes Opticians,OP_5D3_459__000001_NG316LH,OPT,,25 The George Shopping Centre,,Grantham,,NG31 6LH,Tel: 01476 591793, - ,,,No ratings yet Rate it yourself - /Services/opticians/LeaveReview/DefaultView.aspx?id=OP_5D3_459__000001_NG316LH,0,0,no
Scrivens Ltd,OP_NG316PH_34927,OPT,,35a High Street,,Grantham,Lincolnshire,NG31 6PH,Tel: 01476 573931, - ,,,No ratings yet Rate it yourself - /Services/opticians/LeaveReview/DefaultView.aspx?id=OP_NG316PH_34927,0,0,
Boots-Grantham - High St,NG31 6PH_19273,OPT,,32 High Street,,Grantham,Lincolnshire,NG31 6PH,Tel: 01476 594474, - ,,,No ratings yet Rate it yourself - /Services/opticians/LeaveReview/DefaultView.aspx?id=NG31 6PH_19273,0,0,
Specsavers Opticians,OP_5D3_1423__000001_NG316EE,OPT,Isaac Newton Centre,,Grantham,,,NG31 6EE,Tel: 01476 572111, - ,,,No ratings yet Rate it yourself - /Services/opticians/LeaveReview/DefaultView.aspx?id=OP_5D3_1423__000001_NG316EE,0,0,
Neville Clark,OP_5GD_12412__000001_NG319PL,OPT,Home Eyecare,PO Box 2826,,Grantham,Lincolnshire,NG31 9ZQ,Tel: 01476 590353, - ,,,No ratings yet Rate it yourself - /Services/opticians/LeaveReview/DefaultView.aspx?id=OP_5GD_12412__000001_NG319PL,0,0,
Neville Clarke Optometrist,OP_5PA_281010_1__000002_NG319ZQ,OPT,Home Eyecare,PO Box 2826,,Grantham,Lincolnshire,NG31 9ZQ,Tel: 01476 590353, - ,,,No ratings yet Rate it yourself - /Services/opticians/LeaveReview/DefaultView.aspx?id=OP_5PA_281010_1__000002_NG319ZQ,0,0,
Neville Clark,OP_NG319ZQ_46952,OPT,Home Eyecare,PO Box 2826,,Grantham,Lincolnshire,NG31 9ZQ,Tel: 01476 590353, - ,,,No ratings yet Rate it yourself - /Services/opticians/LeaveReview/DefaultView.aspx?id=OP_NG319ZQ_46952,0,0,
Clark - Neville,MOB/01-12412/5N8__000001_NG319ZQ,OPT,Home Eyecare,PO Box 2826,,Grantham,Lincolnshire,NG31 9ZQ,Tel: 01476 590353, - ,,,No ratings yet Rate it yourself - /Services/opticians/LeaveReview/DefaultView.aspx?id=MOB/01-12412/5N8__000001_NG319ZQ,0,0,
Morris & Kon,OP_5D3_6913__000001_NG316TS,OPT,8 St. Catherines Road,,Grantham,,,NG31 6TS,Tel: 01476 564766, - ,,,No ratings yet Rate it yourself - /Services/opticians/LeaveReview/DefaultView.aspx?id=OP_5D3_6913__000001_NG316TS,0,0,
Richards Opticians,OP_5AP_3771__000001_NG241PX,OPT,Harry's Eyewear,5-7 Barnby Gate,,Newark,Nottinghamshire,NG24 1PX,Tel: 01636 704656, - ,,,No ratings yet Rate it yourself - /Services/opticians/LeaveReview/DefaultView.aspx?id=OP_5AP_3771__000001_NG241PX,0,0,
Scrivens Ltd,OP_5AP_5472__000002_NG241UD,OPT,10 The Arcade,,,Newark,Nottinghamshire,NG24 1UD,Tel: 01636 704503, - ,,,No ratings yet Rate it yourself - /Services/opticians/LeaveReview/DefaultView.aspx?id=OP_5AP_5472__000002_NG241UD,0,0,
J:D Opticians,TP3XC,OPT,,17/19 Appleton Gate   ,,Newark,,NG24 1JR,Tel: 01636 611133, - ,,,No ratings yet Rate it yourself - /Services/opticians/LeaveReview/DefaultView.aspx?id=TP3XC,0,0,
Boots-Newark,OP_5AP_11578__000001_NG241EG,OPT,31-32 Market Place,,,Newark,Nottinghamshire,NG24 1EG,Tel: 01636 702057, - ,,,No ratings yet Rate it yourself - /Services/opticians/LeaveReview/DefaultView.aspx?id=OP_5AP_11578__000001_NG241EG,0,0,
London Eye Bespoke Eyewear,CO-0099,OPT,,9 Chain Lane,,Newark,,NG24 1AU,, - ,,,No ratings yet Rate it yourself - /Services/opticians/LeaveReview/DefaultView.aspx?id=CO-0099,0,0,
Duffy Optometrists,OP_5AP_8716__000001_NG241JT,OPT,51 Stodman Street,,Newark,Nottinghamshire,,NG24 1AW,Tel: 01636 705677, - ,,,No ratings yet Rate it yourself - /Services/opticians/LeaveReview/DefaultView.aspx?id=OP_5AP_8716__000001_NG241JT,0,0,
Specsavers Opticians,OP_5AP_12095__000001_NG241EW,OPT,c/o Morrisons Superstore,Kings Road,Newark,,,NG24 1EW,Tel: 01636 611599, - ,,,No ratings yet Rate it yourself - /Services/opticians/LeaveReview/DefaultView.aspx?id=OP_5AP_12095__000001_NG241EW,0,0,
Opticare Midlands Limited,OP_5AP_9380__000001_NG241DH,OPT,3 Paxton Court,,Newark,,,NG24 1DH,Tel: 01636 679555, - ,,,No ratings yet Rate it yourself - /Services/opticians/LeaveReview/DefaultView.aspx?id=OP_5AP_9380__000001_NG241DH,0,0,
E R Dixon Ltd,OP_5D3_910__000001_NG347PD,OPT,6 Southgate Shopping Precinct,Southgate,Sleaford,,,NG34 7PD,Tel: 01529 414212, - ,,,No ratings yet Rate it yourself - /Services/opticians/LeaveReview/DefaultView.aspx?id=OP_5D3_910__000001_NG347PD,0,0,yes
Hunts of Sleaford,OP_5D3_900__000001_NG347SR,OPT,,11 Market Place,,Sleaford,Lincolnshire,NG34 7SR,Tel: 01529 302122, - ,,,No ratings yet Rate it yourself - /Services/opticians/LeaveReview/DefaultView.aspx?id=OP_5D3_900__000001_NG347SR,0,0,yes
Lunettes Opticians,OP_5D3_14934__000001_NG347RL,OPT,,70 Southgate,,Sleaford,Lincolnshire,NG34 7RL,Tel: 01529 414066, - ,,,No ratings yet Rate it yourself - /Services/opticians/LeaveReview/DefaultView.aspx?id=OP_5D3_14934__000001_NG347RL,0,0,no
Thomas Bond & Partners,OP_5FC_3209__000003_NG138BD,OPT,17 Eaton Place,,,Bingham,Nottinghamshire,NG13 8BD,Tel: 01949 838242, - ,,,No ratings yet Rate it yourself - /Services/opticians/LeaveReview/DefaultView.aspx?id=OP_5FC_3209__000003_NG138BD,0,0,
Twynings Opticians,CO-0076/2/5N8__000002_NG138AD,OPT,17 Union Street,,Bingham,Nottinghamshire,,NG13 8AD,, - ,,,No ratings yet Rate it yourself - /Services/opticians/LeaveReview/DefaultView.aspx?id=CO-0076/2/5N8__000002_NG138AD,0,0,
Lunettes Opticians Ltd,OP_NG349DT_84705,OPT,,24 High Street,,Ruskington,Lincolnshire,NG34 9DW,Tel: 01526 834466, - ,,,No ratings yet Rate it yourself - /Services/opticians/LeaveReview/DefaultView.aspx?id=OP_NG349DT_84705,0,0,
Minster Optical Limited t/a Andrew Spybey & Associates,TP80E,OPT,,Willoughby House,,Nottinghamshire,,NG25 0HQ,, - ,,,No ratings yet Rate it yourself - /Services/opticians/LeaveReview/DefaultView.aspx?id=TP80E,0,0,
Pinder's Optometrists,OP_5AP_877__000003_NG250AA,OPT,20 Queen Street,,Southwell,,,NG25 0AA,Tel: 01636 812286, - ,,,No ratings yet Rate it yourself - /Services/opticians/LeaveReview/DefaultView.aspx?id=OP_5AP_877__000003_NG250AA,0,0,
Holiday - Adam,MOB/01-17484/5N8__000001_NG123FB,OPT,5 The Mews,Hall Lane,Colston Basset,Nottinghamshire,,NG12 3FB,, - ,,,No ratings yet Rate it yourself - /Services/opticians/LeaveReview/DefaultView.aspx?id=MOB/01-17484/5N8__000001_NG123FB,0,0,
Asda Opticians,190920161532,OPT,,Newark Road,,Lincoln,,LN6 8JY,Tel: 01522 581148, - ,,,No ratings yet Rate it yourself - /Services/opticians/LeaveReview/DefaultView.aspx?id=190920161532,0,0,
Charlotte Saunders Ltd (Charlotte Saunders),OP_NG236QA_34422,OPT,,5 High Street,,Newark,,NG23 6QA,Tel: 07898695809, - ,,,No ratings yet Rate it yourself - /Services/opticians/LeaveReview/DefaultView.aspx?id=OP_NG236QA_34422,0,0,
Bowler & Charsley,OP_5FC_1226__000001_NG122AG,OPT,22 Shelford Road,Radcliffe-on-Trent,,Nottingham,,NG12 2AG,Tel: 0115 933 3930, - ,,,No ratings yet Rate it yourself - /Services/opticians/LeaveReview/DefaultView.aspx?id=OP_5FC_1226__000001_NG122AG,0,0,
Lesley Cree Opticians Limited,NG12 2FD,OPT,,9b Main Road,,Radcliffe on Trent,Nottinghamshire,NG12 2FD,Tel: 0115 9332999, - ,,,10 ratings Rate it yourself - /Services/opticians/LeaveReview/DefaultView.aspx?id=NG12 2FD,,,yes
Cotgrave Eyecare,01-14171,OPT,,"14, The Shopping Centre",off Candleby Lane,"Cotgrave,",Nottinghamshire,NG12 3JQ,Tel: 0115 9890018, - ,,,1 rating Rate it yourself - /Services/opticians/LeaveReview/DefaultView.aspx?id=01-14171,,,yes
Rayner Opticians,OP_5D2_7512__000001_LN67PX,OPT,5 Rookery Lane,,,Lincoln,Lincolnshire,LN6 7PX,Tel: 01522 527974, - ,,,No ratings yet Rate it yourself - /Services/opticians/LeaveReview/DefaultView.aspx?id=OP_5D2_7512__000001_LN67PX,0,0,yes
Yeomans Opticians Ltd,OP_5D2_13821__000003_LN60QQ,OPT,,"Unit 23, Birchwood Shopping Centre",Jasmin Road,Lincoln,Lincolnshire,LN6 0QQ,Tel: 01522 694548, - ,,,No ratings yet Rate it yourself - /Services/opticians/LeaveReview/DefaultView.aspx?id=OP_5D2_13821__000003_LN60QQ,0,0,yes
Specsavers Colwick,,OPT,,Sainsbury's Road No 3,,Nottingham,,NG4 2JN,Tel: 0115 6975899, - ,,,N/A - Data not available,,,
Specsavers,OP_5EH_5897__000004_LE131XH,OPT,22-24 Sherrard Street,,Melton Mowbray,Leicestershire,,LE13 1UT,Tel: 01664 503555, - ,,,No ratings yet Rate it yourself - /Services/opticians/LeaveReview/DefaultView.aspx?id=OP_5EH_5897__000004_LE131XH,0,0,
Thomas Bond & Partners,OP_5EC_2342__000002_NG42LA,OPT,37 Victoria Road,,,Netherfield,Nottinghamshire,NG4 2LA,Tel: 0115 961 6193, - ,,,No ratings yet Rate it yourself - /Services/opticians/LeaveReview/DefaultView.aspx?id=OP_5EC_2342__000002_NG42LA,0,0,
Boots-Melton Mowbray,OP_5EH_823__000002_LE130TP,OPT,6 Cheapside,,Leicester,Melton Mowbray,,LE13 0TP,Tel: 01664 562195, - ,,,No ratings yet Rate it yourself - /Services/opticians/LeaveReview/DefaultView.aspx?id=OP_5EH_823__000002_LE130TP,0,0,
Vision Express,OPL-01-22086-5PA__000002_LE130TR,OPT,3 High Street,,Melton Mowbray,Leicestershire,,LE13 0TR,Tel: 01664 566 645, - ,,,No ratings yet Rate it yourself - /Services/opticians/LeaveReview/DefaultView.aspx?id=OPL-01-22086-5PA__000002_LE130TR,0,0,
Graham Coe Opticians,OP_5PA_12201__000001_LE131AE,OPT,11 Burton Street,,,Melton Mowbray,,LE13 1AE,Tel: 01664 569722, - ,,,No ratings yet Rate it yourself - /Services/opticians/LeaveReview/DefaultView.aspx?id=OP_5PA_12201__000001_LE131AE,0,0,
Specsavers Opticians,OP_5D2_14302__000001_LN67QL,OPT,Unit 4,Morrisons Supermarket,Tritton Road,Lincoln,,LN6 7QL,Tel: 01522 572710, - ,,,No ratings yet Rate it yourself - /Services/opticians/LeaveReview/DefaultView.aspx?id=OP_5D2_14302__000001_LN67QL,0,0,yes
Specsavers Opticians,OP_5D2_2444__000001_LN57DW,OPT,324 High Street,,Lincoln,,,LN5 7DW,Tel: 01522 576655, - ,,,No ratings yet Rate it yourself - /Services/opticians/LeaveReview/DefaultView.aspx?id=OP_5D2_2444__000001_LN57DW,0,0,no
E R Dixon Ltd,OP_5D2_2970__000002_LN57AL,OPT,,194 High Street,,Lincoln,,LN5 7AL,Tel: 01522 523786, - ,,,No ratings yet Rate it yourself - /Services/opticians/LeaveReview/DefaultView.aspx?id=OP_5D2_2970__000002_LN57AL,0,0,no
Boots-Lincoln - High St,OP_5D2_7188__000001_LN57AL,OPT,192 High Street,,,Lincoln,Lincolnshire,LN5 7AL,Tel: 01522 523 960, - ,,,1 rating Rate it yourself - /Services/opticians/LeaveReview/DefaultView.aspx?id=OP_5D2_7188__000001_LN57AL,,,
J A Higson Opticians,56789__000004_NG41GD,OPT,318 Carlton Hill,Carlton,Nottingham,,,NG4 1GD,, - ,,,No ratings yet Rate it yourself - /Services/opticians/LeaveReview/DefaultView.aspx?id=56789__000004_NG41GD,0,0,
Carlton Opticians,OP_5AP_14063__000001_NG241JR,OPT,318 Carlton Hill,Carlton,Nottingham,,,NG4 1GD,Tel: 0115 9873125, - ,,,No ratings yet Rate it yourself - /Services/opticians/LeaveReview/DefaultView.aspx?id=OP_5AP_14063__000001_NG241JR,0,0,
Boots-Lincoln - High St (in Boots UK),OP_5D2_6992__000002_LN57DZ,OPT,311-312 High Street,,,Lincoln,Lincolnshire,LN5 7DZ,Tel: 01522 536982, - ,,,1 rating Rate it yourself - /Services/opticians/LeaveReview/DefaultView.aspx?id=OP_5D2_6992__000002_LN57DZ,,,
Eye 2 Eye Opticians,C-0084/5N8__000001_NG41JD,OPT,346 Carlton Hill,Carlton,Nottingham,Nottinghamshire,,NG4 1JD,Tel: 01159 877378, - ,,,No ratings yet Rate it yourself - /Services/opticians/LeaveReview/DefaultView.aspx?id=C-0084/5N8__000001_NG41JD,0,0,
Water Lane Opticians,OP_5D2_13818__000001_LN11TY,OPT,5 Water Lane,Lincoln,,,,LN1 1TY,Tel: 01522 525395, - ,,,No ratings yet Rate it yourself - /Services/opticians/LeaveReview/DefaultView.aspx?id=OP_5D2_13818__000001_LN11TY,0,0,
Vision Express (UK) Ltd,OP_5D2_10307__000003_LN21AP,OPT,Unit 8 Waterside Shopping Centre,High Street,Lincoln,Lincolnshire,,LN2 1AP,Tel: 01522 560111, - ,,,No ratings yet Rate it yourself - /Services/opticians/LeaveReview/DefaultView.aspx?id=OP_5D2_10307__000003_LN21AP,0,0,
Martin Smith Opticians Ltd,OP_5D2_2805__000001_LN21DH,OPT,22 Saltergate,,Lincoln,,,LN2 1DH,Tel: 01522 521100, - ,,,No ratings yet Rate it yourself - /Services/opticians/LeaveReview/DefaultView.aspx?id=OP_5D2_2805__000001_LN21DH,0,0,yes
Optique Vision,C/0117-Q59_LN2 1DH,OPT,The Stonebow,224 High Street,,Lincoln,Lincolnshire,LN2 1AH,Tel: 01522244390, - ,,,1 rating Rate it yourself - /Services/opticians/LeaveReview/DefaultView.aspx?id=C/0117-Q59_LN2 1DH,,,yes
Opticial Express,OP_12345_LN1 1XP,OPT,"2nd Floor, Lincoln House",37 Newland,,Lincoln,Lincolnshire,LN1 1XP,Tel: 0800 023 2020, - ,,,No ratings yet Rate it yourself - /Services/opticians/LeaveReview/DefaultView.aspx?id=OP_12345_LN1 1XP,0,0,
Keyworth Optical Ltd,CO-0066/5N8__000001_NG125FT,OPT,"75 The Parade, Wolds Drive",Keyworth,Nottingham,,,NG12 5FT,Tel: 0115 937 3635, - ,,,No ratings yet Rate it yourself - /Services/opticians/LeaveReview/DefaultView.aspx?id=CO-0066/5N8__000001_NG125FT,0,0,
Keyworth Optical,GOC01-15045__000002_NG125FT,OPT,75 The Parade,Wolds Drive,Keyworth,Nottinghamshire,,NG12 5FT,Tel: 0115 937 3635, - ,,,No ratings yet Rate it yourself - /Services/opticians/LeaveReview/DefaultView.aspx?id=GOC01-15045__000002_NG125FT,0,0,
C E Lea,OP_5EC_14900__000002_NG35JU,OPT,33 Plains Road,Mapperley,Nottingham,,,NG3 5JU,Tel: 01159 606526, - ,,,No ratings yet Rate it yourself - /Services/opticians/LeaveReview/DefaultView.aspx?id=OP_5EC_14900__000002_NG35JU,0,0,
Vision Care @ No 8 (Julian Gunn & Jason Rickaby),OP_5D2_14304__000001_LN13AJ,OPT,3 Gordon Road,8 Gordon Road,,Lincoln,,LN1 3AJ,Tel: 01522 530088, - ,,,No ratings yet Rate it yourself - /Services/opticians/LeaveReview/DefaultView.aspx?id=OP_5D2_14304__000001_LN13AJ,0,0,
Mucklow & Hardy,OP_5D2_13819__000001_LN21QA,OPT,Clear View Opticians,6a Eastgate,,Lincoln,Lincolnshire,LN2 1QA,Tel: 01522 538889, - ,,,No ratings yet Rate it yourself - /Services/opticians/LeaveReview/DefaultView.aspx?id=OP_5D2_13819__000001_LN21QA,0,0,no
Dale Opticians,MOB/0091/5N8__000003_NG24LW,OPT,133 Sneiton Dale,,Nottingham,Nottinghamshire,,NG2 4LW,, - ,,,No ratings yet Rate it yourself - /Services/opticians/LeaveReview/DefaultView.aspx?id=MOB/0091/5N8__000003_NG24LW,0,0,
Dale Opticians,OP_5EM_14882__000001_NG24LW,OPT,133 Sneinton Dale,Sneinton,Nottingham,,,NG2 4LW,Tel: 0115 9580023, - ,,,No ratings yet Rate it yourself - /Services/opticians/LeaveReview/DefaultView.aspx?id=OP_5EM_14882__000001_NG24LW,0,0,
Clear View Vision Ltd (Mrs Annabelle Magee),LN1_3LW_1,OPT,Clear View Opticians,169 Burton Road,,Lincoln,Lincolnshire,LN1 3LW,Tel: 01522 542121, - ,,,No ratings yet Rate it yourself - /Services/opticians/LeaveReview/DefaultView.aspx?id=LN1_3LW_1,0,0,yes
Specsavers Opticians,OP_5EC_11181__000001_NG57EG,OPT,118 Front Street,Arnold,Nottingham,,,NG5 7EG,Tel: 0115 9670856, - ,,,No ratings yet Rate it yourself - /Services/opticians/LeaveReview/DefaultView.aspx?id=OP_5EC_11181__000001_NG57EG,0,0,
Eyestyle Co,OP_5EC_14905__000001_NG57ED,OPT,155 Front Street,Arnold,Nottingham,,,NG5 7ED,Tel: 0115 9536526, - ,,,No ratings yet Rate it yourself - /Services/opticians/LeaveReview/DefaultView.aspx?id=OP_5EC_14905__000001_NG57ED,0,0,
Winson Opticians,OP_5FC_803__000001_NG25HU,OPT,2 Priory Road,West Bridgford,,Nottingham,Nottinghamshire,NG2 5HU,Tel: 0115 981 6932, - ,,,No ratings yet Rate it yourself - /Services/opticians/LeaveReview/DefaultView.aspx?id=OP_5FC_803__000001_NG25HU,0,0,yes
Thomas Bond & Partners,OP_5EC_3208__000002_NG57DJ,OPT,77b High Street,,,Arnold,Nottinghamshire,NG5 7DJ,Tel: 0115 926 7455, - ,,,No ratings yet Rate it yourself - /Services/opticians/LeaveReview/DefaultView.aspx?id=OP_5EC_3208__000002_NG57DJ,0,0,
Harold Barnaby Optical Services,OP_5D2_13817__000001_LN24BL,OPT,,31 Mainwaring Road,,Lincoln,,LN2 4BL,Tel: 01522 524732, - ,,,No ratings yet Rate it yourself - /Services/opticians/LeaveReview/DefaultView.aspx?id=OP_5D2_13817__000001_LN24BL,0,0,yes
Adams Opticians,OP_5EC_8895__000001_NG57DE,OPT,19 High Street,Arnold,Nottingham,Nottingham,,NG5 7DE,Tel: 0115 9555520, - ,,,No ratings yet Rate it yourself - /Services/opticians/LeaveReview/DefaultView.aspx?id=OP_5EC_8895__000001_NG57DE,0,0,
Winson Opticians,OP_5FC_1857__000001_NG125JW,OPT,9 Bunny Lane,Keyworth,Nottingham,,,NG12 5JU,Tel: 0115 937 5521, - ,,,No ratings yet Rate it yourself - /Services/opticians/LeaveReview/DefaultView.aspx?id=OP_5FC_1857__000001_NG125JW,0,0,
Johns Opticians,OP_5FC_4561__000001_NG22NL,OPT,34 Gordon Road,West Bridgford,Nottingham,,,NG2 5LN,Tel: 01159 814788, - ,,,No ratings yet Rate it yourself - /Services/opticians/LeaveReview/DefaultView.aspx?id=OP_5FC_4561__000001_NG22NL,0,0,
Specsavers Opticians,NCTPCT79__000001_NG25GQ,OPT,25-27 Central Avenue,West Bridgeford,Nottingham,Nottinghamshire,,NG2 5GQ,, - ,,,No ratings yet Rate it yourself - /Services/opticians/LeaveReview/DefaultView.aspx?id=NCTPCT79__000001_NG25GQ,0,0,
Vision Express,OP_5EV_3794__000001_NG96EH,OPT,32 Central Avenue,West Bridgeford,Nottingham,,,NG2 5GR,Tel: 0115 945 5877, - ,,,No ratings yet Rate it yourself - /Services/opticians/LeaveReview/DefaultView.aspx?id=OP_5EV_3794__000001_NG96EH,0,0,
Kopacz and Barlow,OP_5EA_14809__000001_NG54GB,OPT,30a Marlborough Road,Woodthorpe,Nottingham,,,NG5 4GB,Tel: 0115 926 1694, - ,,,No ratings yet Rate it yourself - /Services/opticians/LeaveReview/DefaultView.aspx?id=OP_5EA_14809__000001_NG54GB,0,0,
Tesco Opticians,TP6NY,OPT,,Wragby Road,,Lincoln,,LN2 4QQ,, - ,,,No ratings yet Rate it yourself - /Services/opticians/LeaveReview/DefaultView.aspx?id=TP6NY,0,0,
Thomas Bond & Partners,OP_5FC_3207__000001_NG26ER,OPT,130 Melton Road,,,West Bridgford,Nottinghamshire,NG2 6ER,Tel: 0115 981 2844, - ,,,No ratings yet Rate it yourself - /Services/opticians/LeaveReview/DefaultView.aspx?id=OP_5FC_3207__000001_NG26ER,0,0,
J Yeomans & Partners,OP_5EM_8797__000001_NG24PB,OPT,19 Manvers Street,,Nottingham,,,NG2 4PB,Tel: 0115 9505477, - ,,,No ratings yet Rate it yourself - /Services/opticians/LeaveReview/DefaultView.aspx?id=OP_5EM_8797__000001_NG24PB,0,0,
One Stop Eye Care Centre,OP_5D3_14935__000002_PE109NE,OPT,2 West Street,Bourne,,,,PE10 9NE,Tel: 01778 421188, - ,,,No ratings yet Rate it yourself - /Services/opticians/LeaveReview/DefaultView.aspx?id=OP_5D3_14935__000002_PE109NE,0,0,
Scrivens Ltd,OP_5D3_5467__000001_PE109NE,OPT,Unit 1 Crown Walk,West Street,,Bourne,Lincolnshire,PE10 9NE,Tel: 01778 425995, - ,,,No ratings yet Rate it yourself - /Services/opticians/LeaveReview/DefaultView.aspx?id=OP_5D3_5467__000001_PE109NE,0,0,
"Specsavers Bourne (I Stradling, N Stradling & K Stradlling)",OP_5D3_3252__000001_PE109NS,OPT,,Unit 11,The Burghley Centre,Bourne,Lincolnshire,PE10 9EG,Tel: 01778 422402, - ,,,1 rating Rate it yourself - /Services/opticians/LeaveReview/DefaultView.aspx?id=OP_5D3_3252__000001_PE109NS,,,
Trent Eye-Care Ltd,TP9DK,OPT,,680 Mansfield Road,,Nottingham,,NG5 2GE,Tel: 0115 8224822, - ,,,No ratings yet Rate it yourself - /Services/opticians/LeaveReview/DefaultView.aspx?id=TP9DK,0,0,
Woolcott Opticians,34567__000004_NG52GE,OPT,672 Mansfield Road,,Nottingham,,,NG5 2GE,, - ,,,No ratings yet Rate it yourself - /Services/opticians/LeaveReview/DefaultView.aspx?id=34567__000004_NG52GE,0,0,
K D Mistry,OP_5EM_3645__000001_NG23JD,OPT,17 Bridgeway Centre,The Meadows,Nottingham,,,NG2 3JD,Tel: 0115 986 4010, - ,,,No ratings yet Rate it yourself - /Services/opticians/LeaveReview/DefaultView.aspx?id=OP_5EM_3645__000001_NG23JD,0,0,
Allen A C,MOB/0013/5N8__000002_NG52GA,OPT,660 Mansfield Road,Sherwood,Nottingham,Nottinghamshire,,NG5 2GA,Tel: 01159 603594, - ,,,No ratings yet Rate it yourself - /Services/opticians/LeaveReview/DefaultView.aspx?id=MOB/0013/5N8__000002_NG52GA,0,0,
A C Allen,OP_5EM_5859__000001_NG52GA,OPT,660 Mansfield Road,Sherwood,Nottingham,,,NG5 2GA,Tel: 0115 960 3594, - ,,,No ratings yet Rate it yourself - /Services/opticians/LeaveReview/DefaultView.aspx?id=OP_5EM_5859__000001_NG52GA,0,0,
Craig Leaver Eyecare,OP_5D2_13820__000001_LN24QP,OPT,2 Bunkers Hill,Lincoln,,",",,LN2 4QP,Tel: 01522 522088, - ,,,No ratings yet Rate it yourself - /Services/opticians/LeaveReview/DefaultView.aspx?id=OP_5D2_13820__000001_LN24QP,0,0,
Johns Opticians,MOB/0011/5N8__000002_NG11NL,OPT,7 Carlton Street,Hockley,Nottingham,Nottinghamshire,,NG1 1NL,, - ,,,1 rating Rate it yourself - /Services/opticians/LeaveReview/DefaultView.aspx?id=MOB/0011/5N8__000002_NG11NL,,,
Johns Opticians,OP_5EM_4560__000001_NG11NL,OPT,7 Carlton Street,Hockley,Nottingham,,,NG1 1NL,Tel: 0115 9475858, - ,,,No ratings yet Rate it yourself - /Services/opticians/LeaveReview/DefaultView.aspx?id=OP_5EM_4560__000001_NG11NL,0,0,
Boots-Nottingham -  Victoria Centre (in Boots UK),OP_5EM_427__000002_NG13QS,OPT,11-19 Lower Parliament Street,,,Nottingham,Nottinghamshire,NG1 3QS,Tel: 0845 123 1000, - ,,,2 ratings Rate it yourself - /Services/opticians/LeaveReview/DefaultView.aspx?id=OP_5EM_427__000002_NG13QS,,,
Gray & Bull,OP_5EM_7898__000001_NG12EH,OPT,,5 Pelham Street,,Nottingham,Nottinghamshire,NG1 2EH,Tel: 01159418121, - ,,,2 ratings Rate it yourself - /Services/opticians/LeaveReview/DefaultView.aspx?id=OP_5EM_7898__000001_NG12EH,,,
Boots-Nottingham - Victoria Centre,OP_5EM_2831__000001_NG13QG,OPT,165 Victoria Centre,Nottingham,,Nottinghamshire,,NG1 3QG,Tel: 0115 947 4807, - ,,,1 rating Rate it yourself - /Services/opticians/LeaveReview/DefaultView.aspx?id=OP_5EM_2831__000001_NG13QG,,,
Optique,OO/S1349__000001_NG12ET,OPT,6 High Street,Exchange Arcade,Nottingham,Notts,,NG1 2ET,Tel: 0115 950 1499, - ,,,No ratings yet Rate it yourself - /Services/opticians/LeaveReview/DefaultView.aspx?id=OO/S1349__000001_NG12ET,0,0,
Optique Vision,MOB/0085/5N8__000002_NG12ET,OPT,6 High Street,The Exchange,Nottingham,Nottinghamshire,Nottinghamshire,NG1 2ET,Tel: 01159 501499, - ,,,No ratings yet Rate it yourself - /Services/opticians/LeaveReview/DefaultView.aspx?id=MOB/0085/5N8__000002_NG12ET,0,0,yes
Specdeals,OP_5EM_9019__000001_NG17LE,OPT,Unit 18 Broad Walk,Broad Marsh Centre,Nottingham,,,NG1 7LE,Tel: 0115 9473734, - ,,,No ratings yet Rate it yourself - /Services/opticians/LeaveReview/DefaultView.aspx?id=OP_5EM_9019__000001_NG17LE,0,0,
Asda Opticians,CO-0001/1/5N8__000002_NG27JA,OPT,184 Loughborough Road,West Bridgeford,Nottingham,Nottinghamshire,,NG2 7JA,Tel: 0115 969 4200, - ,,,No ratings yet Rate it yourself - /Services/opticians/LeaveReview/DefaultView.aspx?id=CO-0001/1/5N8__000002_NG27JA,0,0,
Lancaster & Thorpe Ltd,OP_5EM_3713__000001_NG14AF,OPT,7-9 Trinity Square,,Nottingham,,,NG1 4AF,Tel: 0115 947 5463, - ,,,No ratings yet Rate it yourself - /Services/opticians/LeaveReview/DefaultView.aspx?id=OP_5EM_3713__000001_NG14AF,0,0,
Lancaster & Thorpe Opticians,MOB/0009/5N8__000002_NG14AF,OPT,7 Trinity Square,,,Nottingham,Nottinghamshire,NG1 4AF,Tel: 0115 9475463, - ,,,No ratings yet Rate it yourself - /Services/opticians/LeaveReview/DefaultView.aspx?id=MOB/0009/5N8__000002_NG14AF,0,0,no
Eyecatchers Opticians,OP_5EM 21809__000004_NG17FF,OPT,20 Carrington Street,,,Nottingham,,NG1 7FF,, - ,,,No ratings yet Rate it yourself - /Services/opticians/LeaveReview/DefaultView.aspx?id=OP_5EM 21809__000004_NG17FF,0,0,
Eyecatchers Opticians,MOB/01-21809/5N8__000005_NG17FF,OPT,20 Carrington Street,,Nottingham,Nottinghamshire,,NG1 7FF,, - ,,,No ratings yet Rate it yourself - /Services/opticians/LeaveReview/DefaultView.aspx?id=MOB/01-21809/5N8__000005_NG17FF,0,0,