Organisation Name,NACS Code,Organisation Type,Address1,Address2,Address3,Address4,Address5,PostCode,Telephone Number,Opening time,Value  (Opening time),Banding Classification  (Opening time),NHS.UK users rating,Value  (NHS.UK users rating),Banding Classification  (NHS.UK users rating),Car parking (Is there car parking at this organisation?)
Bude Eye Centre,5KR  0118404__000001_EX238AY,OPT,13 Queen Street,,Bude,Cornwall,,EX23 0AY,Tel: 01288 350041, - ,,,No ratings yet Rate it yourself - /Services/opticians/LeaveReview/DefaultView.aspx?id=5KR  0118404__000001_EX238AY,0,0,
Bude Eye Centre,C/0002/5QQ/A__000002_EX238AY,OPT,7 Queen Street,,Bude,Cornwall,,EX23 8AY,Tel: 01288 350041, - ,,,No ratings yet Rate it yourself - /Services/opticians/LeaveReview/DefaultView.aspx?id=C/0002/5QQ/A__000002_EX238AY,0,0,
Vision Express (UK) Ltd,OP_5KR_607__000002_EX238JS,OPT,22 Belle Vue,Bude,Cornwall,,,EX23 8JS,Tel: 01288 352302, - ,,,No ratings yet Rate it yourself - /Services/opticians/LeaveReview/DefaultView.aspx?id=OP_5KR_607__000002_EX238JS,0,0,
Vision Express (UK) Ltd,OP_5KR_5157__000001_PL158AP,OPT,16 Church Street,Launceston,Cornwall,,,PL15 8AP,Tel: 01566 775544, - ,,,No ratings yet Rate it yourself - /Services/opticians/LeaveReview/DefaultView.aspx?id=OP_5KR_5157__000001_PL158AP,0,0,
Specsavers Opticians,OP_5KR_1112__000002_PL158AP,OPT,12 Church Street,Launceston,Cornwall,,,PL15 8AP,Tel: 01566 774354, - ,,,No ratings yet Rate it yourself - /Services/opticians/LeaveReview/DefaultView.aspx?id=OP_5KR_1112__000002_PL158AP,0,0,
Vision Express Ltd,C/0047/5QQ/M(2)__000004_EX226BB,OPT,4 Bodmin Street,,Holsworthy,Devon,,EX22 6BB,, - ,,,No ratings yet Rate it yourself - /Services/opticians/LeaveReview/DefaultView.aspx?id=C/0047/5QQ/M(2)__000004_EX226BB,0,0,
G C Bateman Ltd,OP_5FQ_3241__000001_EX226BB,OPT,4 Bodmin Street,,Holsworthy,,,EX22 6BB,Tel: 01409 253215, - ,,,No ratings yet Rate it yourself - /Services/opticians/LeaveReview/DefaultView.aspx?id=OP_5FQ_3241__000001_EX226BB,0,0,
Sanders Opticians,OP_5KR_9297__000001_PL277DR,OPT,53a Molesworth Street,Wadebridge,Cornwall,,,PL27 7DR,Tel: 01208 812854, - ,,,1 rating Rate it yourself - /Services/opticians/LeaveReview/DefaultView.aspx?id=OP_5KR_9297__000001_PL277DR,,,
Specsavers Opticians,OP_5KR_2712__000001_PL312JB,OPT,51 Fore Street,Bodmin,Cornwall,,,PL31 2JB,Tel: 01208 72959, - ,,,2 ratings Rate it yourself - /Services/opticians/LeaveReview/DefaultView.aspx?id=OP_5KR_2712__000001_PL312JB,,,
Boots-Bodmin,OP_5KR_205__000001_PL312HQ,OPT,12 Fore Street,,,Bodmin,Cornwall,PL31 2HQ,Tel: 01208 72815, - ,,,No ratings yet Rate it yourself - /Services/opticians/LeaveReview/DefaultView.aspx?id=OP_5KR_205__000001_PL312HQ,0,0,
Andrew Keirl,OP_5KR_4558__000001_PL146AF,OPT,The Parade,Liskeard,Cornwall,,,PL14 6AF,Tel: 01579 346694, - ,,,No ratings yet Rate it yourself - /Services/opticians/LeaveReview/DefaultView.aspx?id=OP_5KR_4558__000001_PL146AF,0,0,
Thompsons Opticians - Pike Street,TP3P9,OPT,Thompsons Opticians,4a Pike Street,,Liskeard,Cornwall,PL14 3JE,Tel: 01579 343348, - ,,,No ratings yet Rate it yourself - /Services/opticians/LeaveReview/DefaultView.aspx?id=TP3P9,0,0,
Noakes Habermehl & Kerr,OP_5KR_4041__000001_PL177AQ,OPT,49 Fore Street,,,Callington,Cornwall,PL17 7AQ,Tel: 01579 382345, - ,,,No ratings yet Rate it yourself - /Services/opticians/LeaveReview/DefaultView.aspx?id=OP_5KR_4041__000001_PL177AQ,0,0,
Vision Express Ltd,C/0047/5QQ/M(5)__000003_PL198AD,OPT,5 West Street,,Tavistock,Devon,,PL19 8AD,, - ,,,No ratings yet Rate it yourself - /Services/opticians/LeaveReview/DefaultView.aspx?id=C/0047/5QQ/M(5)__000003_PL198AD,0,0,
Specsavers Opticians,OP_5CV_14781__000002_PL198AD,OPT,3 West Street,Tavistock,Devon,,,PL19 8AD,Tel: 01822 619 910, - ,,,No ratings yet Rate it yourself - /Services/opticians/LeaveReview/DefaultView.aspx?id=OP_5CV_14781__000002_PL198AD,0,0,
G C Bateman Ltd,OP_5CV_4082__000001_PL198AD,OPT,5 West Street,,Tavistock,,,PL19 8AD,Tel: 01822 612759, - ,,,No ratings yet Rate it yourself - /Services/opticians/LeaveReview/DefaultView.aspx?id=OP_5CV_4082__000001_PL198AD,0,0,
Mcphie Angus,OP_5CV_8537__000001_PL198AU,OPT,7 Market Street,,Tavistock,,,PL19 8AU,Tel: 01822 612863, - ,,,No ratings yet Rate it yourself - /Services/opticians/LeaveReview/DefaultView.aspx?id=OP_5CV_8537__000001_PL198AU,0,0,
Luke Pascoe Mobile Optician,01-17801__000001_PL231EN,OPT,10 Hill Hay Close,Fowey,St Austell,Cornwall,,PL23 1EN,Tel: 01726 833223, - ,,,No ratings yet Rate it yourself - /Services/opticians/LeaveReview/DefaultView.aspx?id=01-17801__000001_PL231EN,0,0,
Thompsons Opticians - The Quay,TP9JF,OPT,,2 The Quay,,West Looe,,PL13 2BX,, - ,,,No ratings yet Rate it yourself - /Services/opticians/LeaveReview/DefaultView.aspx?id=TP9JF,0,0,
Asda Stores Ltd,OP_5KT_14200__000001_PL254PR,OPT,Cromwell Road,,St Austell,Cornwall,,PL25 4PR,Tel: 01726 223812, - ,,,No ratings yet Rate it yourself - /Services/opticians/LeaveReview/DefaultView.aspx?id=OP_5KT_14200__000001_PL254PR,0,0,
Grant Reid Optometrist Ltd,OP_5KT_3763__000001_PL255AA,OPT,9 Grants Walk,St. Austell,Cornwall,,,PL25 5AA,Tel: 01726 73614, - ,,,2 ratings Rate it yourself - /Services/opticians/LeaveReview/DefaultView.aspx?id=OP_5KT_3763__000001_PL255AA,,,
Boots-St Austell - Fore St,OP_5KT_11626__000001_PL255PY,OPT,29 Fore Street,,,St Austell,Cornwall,PL25 5EP,Tel: 01726 75615, - ,,,1 rating Rate it yourself - /Services/opticians/LeaveReview/DefaultView.aspx?id=OP_5KT_11626__000001_PL255PY,,,
Specsavers Opticians,OP_5KT_6991__000002_PL255PY,OPT,39 Fore Street,St. Austell,,Cornwall,,PL25 5PY,Tel: 01726 69633, - ,,,1 rating Rate it yourself - /Services/opticians/LeaveReview/DefaultView.aspx?id=OP_5KT_6991__000002_PL255PY,,,
Boots Opticians Professional Services Ltd,OP_5KT_85__000001_PL255LJ,OPT,55 Aylmer Square,St. Austell,Cornwall,,,PL25 5LJ,Tel: 01726 73302, - ,,,1 rating Rate it yourself - /Services/opticians/LeaveReview/DefaultView.aspx?id=OP_5KT_85__000001_PL255LJ,,,
Noakes Habermehl & Kerr,OP_5KR_4196__000002_PL126AF,OPT,101 Fore Street,,,Saltash,Cornwall,PL12 6AE,Tel: 01752 847477, - ,,,No ratings yet Rate it yourself - /Services/opticians/LeaveReview/DefaultView.aspx?id=OP_5KR_4196__000002_PL126AF,0,0,
Saltash Specsavers Ltd,OP_PL126AF_29712,OPT,,27/29 Fore Street,,Saltash,,PL12 6AF,Tel: 01752 850120, - ,,,No ratings yet Rate it yourself - /Services/opticians/LeaveReview/DefaultView.aspx?id=OP_PL126AF_29712,0,0,
A & J Opticians,OP_EX388HQ_34233,OPT,,10 Fore Street,,Torrington,,EX38 8HQ,Tel: 01805 628271, - ,,,No ratings yet Rate it yourself - /Services/opticians/LeaveReview/DefaultView.aspx?id=OP_EX388HQ_34233,0,0,
N Gainey,OP_5F1_5774__000001_PL51RX,OPT,109 Victoria Road,St Budeaux,Plymouth,Devon,,PL5 1RX,Tel: 01752 366022, - ,,,No ratings yet Rate it yourself - /Services/opticians/LeaveReview/DefaultView.aspx?id=OP_5F1_5774__000001_PL51RX,0,0,
Complete Community Care South Devon Ltd,OP_PL66LU_29681,OPT,,Moor View House,,Plymouth,,PL6 6LU,, - ,,,No ratings yet Rate it yourself - /Services/opticians/LeaveReview/DefaultView.aspx?id=OP_PL66LU_29681,0,0,
Varnals Opticians Ltd,OP_5KT_3947__000001_TR71DN,OPT,25 East Street,Newquay,Cornwall,,,TR7 1DN,Tel: 01637 872000, - ,,,No ratings yet Rate it yourself - /Services/opticians/LeaveReview/DefaultView.aspx?id=OP_5KT_3947__000001_TR71DN,0,0,
Specsavers Opticians,5KT 2798__000001_TR71DJ,OPT,37 Bank Street,,,Newquay,,TR7 1DJ,Tel: 01637 854400, - ,,,No ratings yet Rate it yourself - /Services/opticians/LeaveReview/DefaultView.aspx?id=5KT 2798__000001_TR71DJ,0,0,
Specsavers Bideford,OP_EX392AA_34236,OPT,,85 High Street,,Bideford,,EX39 2AA,Tel: 01237 420042, - ,,,1 rating Rate it yourself - /Services/opticians/LeaveReview/DefaultView.aspx?id=OP_EX392AA_34236,,,
Vision Express Ltd,C/0047/5QQ/M(1)__000001_EX292PZ,OPT,79 High Street,,,Bideford,Devon,EX39 2AA,Tel: 01237472640, - ,,,No ratings yet Rate it yourself - /Services/opticians/LeaveReview/DefaultView.aspx?id=C/0047/5QQ/M(1)__000001_EX292PZ,0,0,
D B Hughes Opticians,OP_5FQ_2384__000001_EX392QE,OPT,16 Bridgeland Street,,,Bideford,Devon,EX39 2QE,Tel: 01237 472669, - ,,,1 rating Rate it yourself - /Services/opticians/LeaveReview/DefaultView.aspx?id=OP_5FQ_2384__000001_EX392QE,,,
G C Bateman Ltd,OP_5FQ_4211__000001_EX392PZ,OPT,6 Bridgeland Street,,Bideford,,,EX39 2PZ,Tel: 01237 472640, - ,,,No ratings yet Rate it yourself - /Services/opticians/LeaveReview/DefaultView.aspx?id=OP_5FQ_4211__000001_EX392PZ,0,0,
Noakes Habermehl & Kerr,OP_5F1_826__000001_PL53BW,OPT,2 Meavy Way,Crownhill,,Plymouth,Devon,PL5 3BW,Tel: 01752 772116, - ,,,No ratings yet Rate it yourself - /Services/opticians/LeaveReview/DefaultView.aspx?id=OP_5F1_826__000001_PL53BW,0,0,yes
S Laws Lascelles Opticians,OP_5F1_14779__000002_PL46LA,OPT,2a Mutley Plain,,Plymouth,Devon,,PL4 6LA,Tel: 01752 660087, - ,,,1 rating Rate it yourself - /Services/opticians/LeaveReview/DefaultView.aspx?id=OP_5F1_14779__000002_PL46LA,,,
Specsavers Opticians,OP_5F1_11970__000001_PL11NF,OPT,120-122 Cornwall Street,,Plymouth,Devon,,PL1 1NF,Tel: 01752 662 847, - ,,,No ratings yet Rate it yourself - /Services/opticians/LeaveReview/DefaultView.aspx?id=OP_5F1_11970__000001_PL11NF,0,0,
Boots-Plymouth - Cornwall St,OP_5F1_5325__000003_PL11LP,OPT,30 Cornwall Street,,Plymouth,Devon,,PL1 1LR,Tel: 01752 663320, - ,,,1 rating Rate it yourself - /Services/opticians/LeaveReview/DefaultView.aspx?id=OP_5F1_5325__000003_PL11LP,,,
Iconic Opticians,CO- 5170,OPT,,73 Cornwall street,,Plymouth,,PL1 1NS,Tel: 01752415490, - ,,,2 ratings Rate it yourself - /Services/opticians/LeaveReview/DefaultView.aspx?id=CO- 5170,,,
Specsavers Opticians,OP_5F1_12269__000001_PL11LB,OPT,152-154 Armada Way,,Plymouth,Devon,,PL1 1LB,Tel: 01752 253434, - ,,,2 ratings Rate it yourself - /Services/opticians/LeaveReview/DefaultView.aspx?id=OP_5F1_12269__000001_PL11LB,,,
S Chatterjee Opticians,OP_5F1_14802__000002_PL11QJ,OPT,31 Mayflower Street,,Plymouth,Devon,,PL1 1QJ,Tel: 01752 660831, - ,,,No ratings yet Rate it yourself - /Services/opticians/LeaveReview/DefaultView.aspx?id=OP_5F1_14802__000002_PL11QJ,0,0,
M&S Opticians - Plymouth,L6D2E,OPT,,1 Cornwall Street,,Plymouth,Devon,PL1 1DH,Tel: 01752 279 756, - ,,,2 ratings Rate it yourself - /Services/opticians/LeaveReview/DefaultView.aspx?id=L6D2E,,,
Centre Eyecare Excellence,,OPT,,41 Gibbon Street,Plymouth,Plymouth,Devon,PL4 8BZ,Tel: 01752 583100, - ,,,N/A - Data not available,,,
Vision Express Opticians ,OP_5F1_10000__000002_PL12LB,OPT,8 New George Street,,Plymouth,Devon,,PL1 1RL,Tel: 01752 253453, - ,,,No ratings yet Rate it yourself - /Services/opticians/LeaveReview/DefaultView.aspx?id=OP_5F1_10000__000002_PL12LB,0,0,
Boots-Plymouth - Drake Circus,OP_5F1_5714__000001_PL11DL,OPT,MSU2 & SU1 Drake Circus Shopping Centre,,,Plymouth,Devon,PL1 1EA,Tel: 01752 666546, - ,,,2 ratings Rate it yourself - /Services/opticians/LeaveReview/DefaultView.aspx?id=OP_5F1_5714__000001_PL11DL,,,
Opticial Express,OP_12345_PL1 2EX,OPT,"3rd Floor, Princess Court",23 Princess Street,,Plymouth,Devon,PL1 2EX,Tel: 0800 023 2020, - ,,,No ratings yet Rate it yourself - /Services/opticians/LeaveReview/DefaultView.aspx?id=OP_12345_PL1 2EX,0,0,
Visualeyes (The Barbican) Ltd,55555__000004_PL12LB,OPT,54 Southside Street,The Barbican,Plymouth,Devon,,PL1 2LB,Tel: 01752 223873, - ,,,No ratings yet Rate it yourself - /Services/opticians/LeaveReview/DefaultView.aspx?id=55555__000004_PL12LB,0,0,
MEE Healthcare,PL36RL,OPT,,"J Sainsbury, Marsh Mills, Plymouth Road, ",,"Crabtree, Plymouth",,PL3 6RL,, - ,,,No ratings yet Rate it yourself - /Services/opticians/LeaveReview/DefaultView.aspx?id=PL36RL,0,0,
The Sight Centre,OP_5F1_14801__000004_PL72AW,OPT,79a The Ridgeway,Plympton,Plymouth,Devon,,PL7 2AW,Tel: 01752 331717, - ,,,No ratings yet Rate it yourself - /Services/opticians/LeaveReview/DefaultView.aspx?id=OP_5F1_14801__000004_PL72AW,0,0,
Noakes Habermehl & Kerr,OP_5F1_6190__000001_PL72AL,OPT,62 Ridgeway,,Plympton,Plymouth,Devon,PL7 2AL,Tel: 01752 345269, - ,,,No ratings yet Rate it yourself - /Services/opticians/LeaveReview/DefaultView.aspx?id=OP_5F1_6190__000001_PL72AL,0,0,no
Specsavers Opticians,OP_5F1_14780__000002_PL97AN,OPT,,39-41 The Broadway,,Plymstock,,PL9 7AN,Tel: 01752 402241, - ,,,No ratings yet Rate it yourself - /Services/opticians/LeaveReview/DefaultView.aspx?id=OP_5F1_14780__000002_PL97AN,0,0,
