Organisation Name,NACS Code,Organisation Type,Address1,Address2,Address3,Address4,Address5,PostCode,Telephone Number,Opening time,Value  (Opening time),Banding Classification  (Opening time),NHS.UK users rating,Value  (NHS.UK users rating),Banding Classification  (NHS.UK users rating),Car parking (Is there car parking at this organisation?)
A. B. Optics,OP5M242__000002_SY66BW,OPT,20 Sandford Avenue,20,Church Stretton,Shropshire,,SY6 6BW,Tel: 01694 723039, - ,,,63 ratings Rate it yourself - /Services/opticians/LeaveReview/DefaultView.aspx?id=OP5M242__000002_SY66BW,,,
Suzanne Floyd (Opticians),OP_5M2_8357__000001_SY79NY,OPT,Suzanne Floyd Optometrist,5 Dale Street West,Craven Arms,Shropshire,,SY7 9PB,Tel: 01588 673048, - ,,,No ratings yet Rate it yourself - /Services/opticians/LeaveReview/DefaultView.aspx?id=OP_5M2_8357__000001_SY79NY,0,0,yes
Bishops Castle Eyecare LLP,OP_5M2_7710__000002_SY95AE,OPT,The Pharmacy,Church Street,Bishops Castle,Shropshire,,SY9 5AE,Tel: 01588 630542, - ,,,No ratings yet Rate it yourself - /Services/opticians/LeaveReview/DefaultView.aspx?id=OP_5M2_7710__000002_SY95AE,0,0,
Sarah Banks Ltd T/A The Optician,OP5M280__000001_SY95BE,OPT,29 Church Street,,Bishops Castle,Shropshire,,SY9 5AD,Tel: 01588 638833, - ,,,No ratings yet Rate it yourself - /Services/opticians/LeaveReview/DefaultView.aspx?id=OP5M280__000001_SY95BE,0,0,
Specs-at-Home,OP5M267__000001_TF136LF,OPT,The Thatch Cottage,Shipton,Much Wenlock,Shropshire,,TF13 6LF,Tel: 01746 785141, - ,,,No ratings yet Rate it yourself - /Services/opticians/LeaveReview/DefaultView.aspx?id=OP5M267__000001_TF136LF,0,0,
Suzanne Floyd Optometrist,OP_5M2_8358__000001_SY78HZ,OPT,The New Surgery,Clun,Craven Arms,Shropshire,,SY7 8JE,Tel: 01588 673048, - ,,,No ratings yet Rate it yourself - /Services/opticians/LeaveReview/DefaultView.aspx?id=OP_5M2_8358__000001_SY78HZ,0,0,
Ludlow Specsavers,OP5M2_147__000002_SY81AA,OPT,10 Bull Ring,,Ludlow,Shropshire,,SY8 1AD,Tel: 01584 871210, - ,,,1 rating Rate it yourself - /Services/opticians/LeaveReview/DefaultView.aspx?id=OP5M2_147__000002_SY81AA,,,
Peter Meredith Optometrist,OP5M268__000001_SY82PG,OPT,,9 Church Street,Ludlow,Shropshire,,SY8 1AP,Tel: 01584 876266, - ,,,No ratings yet Rate it yourself - /Services/opticians/LeaveReview/DefaultView.aspx?id=OP5M268__000001_SY82PG,0,0,
Vision Express,OP_5M2_9308__000001_SY81BS,OPT,,6-7 High Street,,Ludlow,Shropshire,SY8 1BS,Tel: 01584 872771, - ,,,No ratings yet Rate it yourself - /Services/opticians/LeaveReview/DefaultView.aspx?id=OP_5M2_9308__000001_SY81BS,0,0,
Clare Darbyshire,OP5M251__000001_TF136HH,OPT,2 Wilmore Street,,Much Wenlock,Shropshire,,TF13 6HR,Tel: 01952 727442, - ,,,No ratings yet Rate it yourself - /Services/opticians/LeaveReview/DefaultView.aspx?id=OP5M251__000001_TF136HH,0,0,
Martin Haynes Eyecare Ltd,OP_5M2_3471__000001_SY11JD,OPT,3-4 St. Johns Hill,,Shrewsbury,Shropshire,,SY1 1JD,Tel: 01743 236777, - ,,,No ratings yet Rate it yourself - /Services/opticians/LeaveReview/DefaultView.aspx?id=OP_5M2_3471__000001_SY11JD,0,0,
Joseph Hayes Opticians,OP_5M2_6635__000001_SY11UT,OPT,Joseph Hayes Opticians,2 Wyle Cop,,Shrewsbury,Shropshire,SY1 1UT,Tel: 01743 354468, - ,,,No ratings yet Rate it yourself - /Services/opticians/LeaveReview/DefaultView.aspx?id=OP_5M2_6635__000001_SY11UT,0,0,
Shrewsbury Optometry,OP_5M2_1365__000001_SY11EN,OPT,4 & 5 Dogpole,,Shrewsbury,Shropshire,Shropshire,SY1 1EN,Tel: 01743 233486, - ,,,5 ratings Rate it yourself - /Services/opticians/LeaveReview/DefaultView.aspx?id=OP_5M2_1365__000001_SY11EN,,,
Specsavers Opticians Ltd,OP_5M2_613__000001_SY11QG,OPT,24 Claremont Street,,Shrewsbury,Shropshire,,SY1 1QG,Tel: 01743 246360, - ,,,No ratings yet Rate it yourself - /Services/opticians/LeaveReview/DefaultView.aspx?id=OP_5M2_613__000001_SY11QG,0,0,
Haywood & Ward Opticians,OP_5M2_11178__000001_SY11DZ,OPT,11 St. Marys Place,,Shrewsbury,Shropshire,,SY1 1DZ,Tel: 01743 236111, - ,,,No ratings yet Rate it yourself - /Services/opticians/LeaveReview/DefaultView.aspx?id=OP_5M2_11178__000001_SY11DZ,0,0,
Vision Express Ltd Shrewsbury,OP_5M2_1902__000001_SY11BU,OPT,Opticians,Unit 5,Pride Hill Centre,Shrewsbury,Shropshire,SY1 1BU,Tel: 01743 231111, - ,,,No ratings yet Rate it yourself - /Services/opticians/LeaveReview/DefaultView.aspx?id=OP_5M2_1902__000001_SY11BU,0,0,
Boots-Shrewsbury - Pride Hill,OP_5M2_1831__000001_SY11DQ,OPT,15 Pride Hill,,,Shrewsbury,Shropshire,SY1 1DQ,Tel: 01743 365 294, - ,,,No ratings yet Rate it yourself - /Services/opticians/LeaveReview/DefaultView.aspx?id=OP_5M2_1831__000001_SY11DQ,0,0,
Ellerker Opticians,OP5M256__000001_SY11PJ,OPT,,62-63 Mardol,,Shrewsbury,Shropshire,SY1 1PP,Tel: 01743 344455, - ,,,No ratings yet Rate it yourself - /Services/opticians/LeaveReview/DefaultView.aspx?id=OP5M256__000001_SY11PJ,0,0,
Boots-Shrewsbury - Darwin Centre,OP_5M2_11602__000001_SY11BN,OPT,"Unit 17, The Darwin Centre",,,Shrewsbury,Shropshire,SY1 1BN,Tel: 01743 232569, - ,,,No ratings yet Rate it yourself - /Services/opticians/LeaveReview/DefaultView.aspx?id=OP_5M2_11602__000001_SY11BN,0,0,
A C Jelley,OP_5MT_4555__000001_WR158BA,OPT,14 Teme Street,,Tenbury Wells,,,WR15 8BA,Tel: 01584 811445, - ,,,No ratings yet Rate it yourself - /Services/opticians/LeaveReview/DefaultView.aspx?id=OP_5MT_4555__000001_WR158BA,0,0,
Cleobury Opticians,CO-5117,OPT,,16 Church Street,,Kidderminster,,DY14 8BX,, - ,,,No ratings yet Rate it yourself - /Services/opticians/LeaveReview/DefaultView.aspx?id=CO-5117,0,0,
Evenett Opticians Ltd,OP_5M2_8312__000001_WV164AW,OPT,3 Listley Street,,Bridgnorth,Shropshire,,WV16 4AW,Tel: 01746 763330, - ,,,No ratings yet Rate it yourself - /Services/opticians/LeaveReview/DefaultView.aspx?id=OP_5M2_8312__000001_WV164AW,0,0,
Bridgnorth Specsavers,OP5M2_3320__000001_WV164DX,OPT,60 High Street,,Bridgnorth,Shropshire,,WV16 4DB,Tel: 01746 713950, - ,,,2 ratings Rate it yourself - /Services/opticians/LeaveReview/DefaultView.aspx?id=OP5M2_3320__000001_WV164DX,,,
Biddle + Liage Opticians,OP_5M2_790__000001_WV164QN,OPT,,59 High Street,,Bridgnorth,Shropshire,WV16 4DX,Tel: 01746 762895, - ,,,No ratings yet Rate it yourself - /Services/opticians/LeaveReview/DefaultView.aspx?id=OP_5M2_790__000001_WV164QN,0,0,
Trevor Phillips Opticians,OP_5M2_4743__000001_WV164EG,OPT,8 Waterloo Terrace,,Bridgnorth,Shropshire,,WV16 4EG,Tel: 01746 766227, - ,,,No ratings yet Rate it yourself - /Services/opticians/LeaveReview/DefaultView.aspx?id=OP_5M2_4743__000001_WV164EG,0,0,
Vivid Optical Ltd,06266214,OPT,,Faraday Drive,,"Bridgnorth, Shropshire",,WV15 5BA,, - ,,,1 rating Rate it yourself - /Services/opticians/LeaveReview/DefaultView.aspx?id=06266214,,,
John Biddle Opticians,OP_5MK_12496__000001_TF75AS,OPT,39 High Street,Madeley,,Telford,Shropshire,TF7 5AS,Tel: 01952 586267, - ,,,No ratings yet Rate it yourself - /Services/opticians/LeaveReview/DefaultView.aspx?id=OP_5MK_12496__000001_TF75AS,0,0,
Lawrence Shinn & Partners,OP_5MK_2290__000001_TF11ED,OPT,"Spectrum House, Bridge Road",Wellington,Telford,Shropshire,,TF1 1ED,Tel: 01952 223144, - ,,,No ratings yet Rate it yourself - /Services/opticians/LeaveReview/DefaultView.aspx?id=OP_5MK_2290__000001_TF11ED,0,0,
Eye Wise Opticians,OP_5MK_50__000001_TF34NL,OPT,Eyewise Opticians,53a High Street,Dawley,Telford,,TF4 2EX,Tel: 01952 502502, - ,,,No ratings yet Rate it yourself - /Services/opticians/LeaveReview/DefaultView.aspx?id=OP_5MK_50__000001_TF34NL,0,0,
Rayner Opticians,OP_5MK_10732__000001_TF11BD,OPT,6 Walker Street,,,Wellington,Shropshire,TF1 1BD,Tel: 01952 242205, - ,,,No ratings yet Rate it yourself - /Services/opticians/LeaveReview/DefaultView.aspx?id=OP_5MK_10732__000001_TF11BD,0,0,
John Biddle Opticians,OP_5MK_24__000001_TF11DT,OPT,38 Market Street,Wellington,Telford,Wellington,,TF1 1DT,Tel: 01952 246121, - ,,,No ratings yet Rate it yourself - /Services/opticians/LeaveReview/DefaultView.aspx?id=OP_5MK_24__000001_TF11DT,0,0,
HD eyes Ltd,C/166/Q60,OPT,,8 Birchfield Way,Lawley,Telford,Shropshire,TF3 5BZ,Tel: 01952 502970, - ,,,No ratings yet Rate it yourself - /Services/opticians/LeaveReview/DefaultView.aspx?id=C/166/Q60,0,0,yes
Wellington Specsavers Ltd,OP_5MK_45__000002_TF11LU,OPT,53 New Street,Wellington,Telford,Shropshire,,TF1 1LU,Tel: 01952 245577, - ,,,No ratings yet Rate it yourself - /Services/opticians/LeaveReview/DefaultView.aspx?id=OP_5MK_45__000002_TF11LU,0,0,
Visual Eyes(KB) Ltd,OP_5MK_11989__000003_TF11LU,OPT,35 New Street,Wellington,Telford,Shropshire,,TF1 1LU,Tel: 01952 249500, - ,,,No ratings yet Rate it yourself - /Services/opticians/LeaveReview/DefaultView.aspx?id=OP_5MK_11989__000003_TF11LU,0,0,
Scrivens Opticians & Hearing Care,OP_5CN_10727__000002_HR68EP,OPT,,27 West Street,,Leominster,Herefordshire,HR6 8EP,Tel: 01568 616434, - ,,,No ratings yet Rate it yourself - /Services/opticians/LeaveReview/DefaultView.aspx?id=OP_5CN_10727__000002_HR68EP,0,0,
Gay G.R,OP_5CN_13272__000001_HR68LX,OPT,8 Corn Street,Leominster,Herefordshire,,,HR6 8LX,Tel: 01568 612994, - ,,,No ratings yet Rate it yourself - /Services/opticians/LeaveReview/DefaultView.aspx?id=OP_5CN_13272__000001_HR68LX,0,0,
P Meredith Optometrist,OP_5CN_3626__000001_HR68HU,OPT,1 Black Swan Walk,Leominster,Herefordshire,,,HR6 8HU,Tel: 01568 616332, - ,,,No ratings yet Rate it yourself - /Services/opticians/LeaveReview/DefaultView.aspx?id=OP_5CN_3626__000001_HR68HU,0,0,
Asda Opticians,OPT_TF3 4HZ,OPT,,MALINSGATE,,TELFORD,,TF3 4HZ,Tel: 01952 741025, - ,,,No ratings yet Rate it yourself - /Services/opticians/LeaveReview/DefaultView.aspx?id=OPT_TF3 4HZ,0,0,
Boots Opticians Ltd,OP_5MK_8669__000001_TF34BP,OPT,,128 New Street,,Telford,,TF3 4PB,Tel: 01952 291896, - ,,,No ratings yet Rate it yourself - /Services/opticians/LeaveReview/DefaultView.aspx?id=OP_5MK_8669__000001_TF34BP,0,0,
Vision Express (UK) Ltd,OP_5MK_6178__000003_TF34BT,OPT,234 New Row,Telford Shopping Centre,Telford,Shropshire,,TF3 4BS,Tel: 01952 290066, - ,,,No ratings yet Rate it yourself - /Services/opticians/LeaveReview/DefaultView.aspx?id=OP_5MK_6178__000003_TF34BT,0,0,
Telford Specsavers Ltd ,OP_5MK_11802__000001_TF34AE,OPT,46 Southwater Way,Southwater Way,Telford Shopping Centre,Telford,Shropshire,TF3 4BX,Tel: 01952 200 100, - ,,,55 ratings Rate it yourself - /Services/opticians/LeaveReview/DefaultView.aspx?id=OP_5MK_11802__000001_TF34AE,,,
Boots-Telford - New St,TF3 4BP_19282,OPT,,157 New Street,,Telford Centre,Shropshire,TF3 4BP,Tel: 01952 200683, - ,,,No ratings yet Rate it yourself - /Services/opticians/LeaveReview/DefaultView.aspx?id=TF3 4BP_19282,0,0,
Boots-Telford - Thetford Chase,OP_5MK_6318__000001_TF34BY,OPT,135 Thetford Chase,,,Telford,Shropshire,TF3 4BY,Tel: 01952 291 952, - ,,,No ratings yet Rate it yourself - /Services/opticians/LeaveReview/DefaultView.aspx?id=OP_5MK_6318__000001_TF34BY,0,0,
Giles Opticians,OP_5MK_1266__000001_TF26EL,OPT,8 Market Street,,Telford,Shropshire,,TF2 6ED,Tel: 01952 614143, - ,,,1 rating Rate it yourself - /Services/opticians/LeaveReview/DefaultView.aspx?id=OP_5MK_1266__000001_TF26EL,,,
Shropshire Eyecare,OP5MK18__000002_TF28EQ,OPT,10 The Parade,Donnington,Telford,Shropshire,,TF2 8EB,Tel: 01952 670999, - ,,,No ratings yet Rate it yourself - /Services/opticians/LeaveReview/DefaultView.aspx?id=OP5MK18__000002_TF28EQ,0,0,
Tim Vanes Dispensing Optician,OP_5MK_4742__000002_TF42EX,OPT,5a Park Street,Shifnal,,Shropshire,,TF11 9BA,Tel: 01952 461387, - ,,,No ratings yet Rate it yourself - /Services/opticians/LeaveReview/DefaultView.aspx?id=OP_5MK_4742__000002_TF42EX,0,0,
Edmund Proctor & Associates,00000066__000002_DY102BX,OPT,Coppice Gate,Tanners Hill,Bewdley,Worcestershire,,DY12 2LP,Tel: 07701 281081, - ,,,1 rating Rate it yourself - /Services/opticians/LeaveReview/DefaultView.aspx?id=00000066__000002_DY102BX,,,
Chris Coates Optometrist,OP_HR53DL_45788,OPT,8 Bridge Street,,,Kington,,HR5 3DL,Tel: 01544 230219, - ,,,1 rating Rate it yourself - /Services/opticians/LeaveReview/DefaultView.aspx?id=OP_HR53DL_45788,,,
Scotts Opticians,OP_5CN_4599__000001_HR53AX,OPT,16 High Street,Kington,Herefordshire,,,HR5 3AX,Tel: 01544 231330, - ,,,1 rating Rate it yourself - /Services/opticians/LeaveReview/DefaultView.aspx?id=OP_5CN_4599__000001_HR53AX,,,
MC Perrigo,00000065__000002_DY122AW,OPT,71 Load Street,,Bewdley,Worcestershire,,DY12 2AW,Tel: 01299 403722, - ,,,No ratings yet Rate it yourself - /Services/opticians/LeaveReview/DefaultView.aspx?id=00000065__000002_DY122AW,0,0,
Nusyte Optical (wem) Ltd ,OP_5M2_11139__000002_SY45DG,OPT,Nusyte Opticians (Wem),10 High street,,Wem,Shropshire,SY4 5AA,Tel: 01939 232016, - ,,,No ratings yet Rate it yourself - /Services/opticians/LeaveReview/DefaultView.aspx?id=OP_5M2_11139__000002_SY45DG,0,0,
Albrighton Eye Clinic,P6X7L,OPT,,"2 Station Road, Albrighton",,Wolverhampton,,WV7 3QG,Tel: 01902 374727, - ,,,1 rating Rate it yourself - /Services/opticians/LeaveReview/DefaultView.aspx?id=P6X7L,,,
Evenett & Bishop Opticians,OP_5M2_10687__000002_WV73JA,OPT,67 High Street,Albrighton,Wolverhampton,,,WV7 3JP,Tel: 01902 372141, - ,,,No ratings yet Rate it yourself - /Services/opticians/LeaveReview/DefaultView.aspx?id=OP_5M2_10687__000002_WV73JA,0,0,
Blink Vision,TP80T,OPT,,201-203 Park Lane,,Kidderminster,,DY11 6TQ,Tel: 0000000000, - ,,,No ratings yet Rate it yourself - /Services/opticians/LeaveReview/DefaultView.aspx?id=TP80T,0,0,
Clive G Stephens,OP_5DR_4342__000001_DY102AD,OPT,2 Church Street,,Kidderminster,,,DY10 2AD,Tel: 01562 822803, - ,,,No ratings yet Rate it yourself - /Services/opticians/LeaveReview/DefaultView.aspx?id=OP_5DR_4342__000001_DY102AD,0,0,
Boots-Kidderminster,DY10 1AA_19172,OPT,,"Unit 15, Weavers Wharf Retail Park",,Kidderminster,Worcestershire,DY10 1AA,Tel: 01562 824474, - ,,,1 rating Rate it yourself - /Services/opticians/LeaveReview/DefaultView.aspx?id=DY10 1AA_19172,,,
Vision Express Ltd,000000063__000001_DY102DQ,OPT,6 High Street,,Kidderminster,Worcestershire,,DY10 2DQ,Tel: 01562 824846, - ,,,No ratings yet Rate it yourself - /Services/opticians/LeaveReview/DefaultView.aspx?id=000000063__000001_DY102DQ,0,0,
Specsavers Opticians,OP_5DR_9273__000002_DY102DG,OPT,2 Coventry Street,Swan Centre,Kidderminster,,,DY10 2DG,Tel: 01562 823 552, - ,,,No ratings yet Rate it yourself - /Services/opticians/LeaveReview/DefaultView.aspx?id=OP_5DR_9273__000002_DY102DG,0,0,
Chapman & Myers Opticians,OP_5DR_11705__000001_DY101EJ,OPT,,5 Vicar Street,Kidderminster,Worcestershire,,DY10 1DE,Tel: 01562 822276, - ,,,2 ratings Rate it yourself - /Services/opticians/LeaveReview/DefaultView.aspx?id=OP_5DR_11705__000001_DY101EJ,,,
Scrivens Opticians & Hearing Care,OP_5CN_5439__000001_HR74EB,OPT,,10 Broad Street,,Bromyard,Herefordshire,HR7 4BT,Tel: 01885 482492, - ,,,No ratings yet Rate it yourself - /Services/opticians/LeaveReview/DefaultView.aspx?id=OP_5CN_5439__000001_HR74EB,0,0,
Spectacle Wearhouse,OP_5DR_2669__000001_DY139EH,OPT,29 York Street,,Stourport-on-Severn,,,DY13 9EH,Tel: 01299 826688, - ,,,No ratings yet Rate it yourself - /Services/opticians/LeaveReview/DefaultView.aspx?id=OP_5DR_2669__000001_DY139EH,0,0,
Specsavers Opticians,OP_5DR_12005__000001_DY138BL,OPT,45 High Street,Stourport-on-Severn,Worcestershire,,,DY13 8BX,Tel: 01299 877999, - ,,,No ratings yet Rate it yourself - /Services/opticians/LeaveReview/DefaultView.aspx?id=OP_5DR_12005__000001_DY138BL,0,0,
Specsavers Opticians,5PL 00000__000001_DY139JW,OPT,45 The High Street,,Stourport On Severn,Worcestershire,,DY13 8BX,Tel: 01299 877999, - ,,,1 rating Rate it yourself - /Services/opticians/LeaveReview/DefaultView.aspx?id=5PL 00000__000001_DY139JW,,,
P Crawford,OP_5DR_3243__000001_DY101BB,OPT,8 Oxford Street,,Kidderminster,,,DY10 1BB,Tel: 01562 822577, - ,,,No ratings yet Rate it yourself - /Services/opticians/LeaveReview/DefaultView.aspx?id=OP_5DR_3243__000001_DY101BB,0,0,
Seymour & Easlea Ltd.,(5DR)__000001_DY138DJ,OPT,2a High Street,,Stourport On Severn,Worcestershire,,DY13 8DJ,Tel: 01299 877171, - ,,,No ratings yet Rate it yourself - /Services/opticians/LeaveReview/DefaultView.aspx?id=(5DR)__000001_DY138DJ,0,0,
The Factory Opticians,00000064__000001_DY101HJ,OPT,Dixon Street,,Kidderminster,Worcestershire,,DY10 1HJ,Tel: 01562 747087, - ,,,No ratings yet Rate it yourself - /Services/opticians/LeaveReview/DefaultView.aspx?id=00000064__000001_DY101HJ,0,0,
Eyecare Kidderminster Ltd,M2B9S,OPT,,"Unit 1 in Morrisons Supermarket, Green Street",,Kidderminster,,DY10 1AZ,, - ,,,No ratings yet Rate it yourself - /Services/opticians/LeaveReview/DefaultView.aspx?id=M2B9S,0,0,
Glass House Eye Care Centre,OP_5MK_6162__000002_TF107AT,OPT,43 High Street,,Newport,,,TF10 7AT,Tel: 01952 812009, - ,,,1 rating Rate it yourself - /Services/opticians/LeaveReview/DefaultView.aspx?id=OP_5MK_6162__000002_TF107AT,,,
Evenett & Bishop Opticians,OP_5MK_5867__000001_TF107AT,OPT,35 High Street,,Newport,Shropshire,,TF10 7AT,Tel: 01952 810808, - ,,,No ratings yet Rate it yourself - /Services/opticians/LeaveReview/DefaultView.aspx?id=OP_5MK_5867__000001_TF107AT,0,0,
Partridge Opticians,OP_5MK_9908__000001_TF107AY,OPT,Partridge Opticians,81 High Street,,Newport,Shropshire,TF10 7AY,Tel: 01952 811750, - ,,,No ratings yet Rate it yourself - /Services/opticians/LeaveReview/DefaultView.aspx?id=OP_5MK_9908__000001_TF107AY,0,0,
Specsavers,TP9EM,OPT,,"Unit 9 Baddeley Court , Newport ",,Shropshire,,TF10 7GQ,, - ,,,No ratings yet Rate it yourself - /Services/opticians/LeaveReview/DefaultView.aspx?id=TP9EM,0,0,
Duignan Phelps Opticians,OP5MK49__000001_TF107AB,OPT,10 St Mary's Street,,Newport,Shropshire,,TF10 7AB,Tel: 01952 812820, - ,,,No ratings yet Rate it yourself - /Services/opticians/LeaveReview/DefaultView.aspx?id=OP5MK49__000001_TF107AB,0,0,yes
N. Lloyd-Thomas Opticians ,OP_5M2_13242__000003_SY112SU,OPT,15 Church Street,,Oswestry,Shropshire,,SY11 2SU,Tel: 01691 655858, - ,,,1 rating Rate it yourself - /Services/opticians/LeaveReview/DefaultView.aspx?id=OP_5M2_13242__000003_SY112SU,,,
BBR Opticians,OP5M252__000001_SY112NN,OPT,BBR Opticians Ltd,23 Leg Street,,Oswestry,Shropshire,SY11 2NN,Tel: 01691 654327, - ,,,No ratings yet Rate it yourself - /Services/opticians/LeaveReview/DefaultView.aspx?id=OP5M252__000001_SY112NN,0,0,
Specsavers Oswestry,OP5M254__000002_SY111PU,OPT,24 Bailey Street,,Oswestry,Shropshire,,SY11 1PU,Tel: 01691 684820, - ,,,1 rating Rate it yourself - /Services/opticians/LeaveReview/DefaultView.aspx?id=OP5M254__000002_SY111PU,,,
Rayner Opticians ,OP_5M2_1951__000001_SY111PU,OPT,,26 Bailey Street,,Oswestry,Shropshire,SY11 1PU,Tel: 01691 653936, - ,,,No ratings yet Rate it yourself - /Services/opticians/LeaveReview/DefaultView.aspx?id=OP_5M2_1951__000001_SY111PU,0,0,no
S R Drinnan,OP_5M2_5706__000001_SY111AD,OPT,28 Willow Street,,Oswestry,Shropshire,,SY11 1AD,Tel: 01691 652875, - ,,,No ratings yet Rate it yourself - /Services/opticians/LeaveReview/DefaultView.aspx?id=OP_5M2_5706__000001_SY111AD,0,0,
"Goodwin & Edge Ltd, T/A Mincher-Lockett Optometric Group",5PK_ST20 0EZ__000001_ST200EZ,OPT,Station Road,Gnosall,,Stafford,,ST20 0EZ,Tel: 01785 823790, - ,,,No ratings yet Rate it yourself - /Services/opticians/LeaveReview/DefaultView.aspx?id=5PK_ST20 0EZ__000001_ST200EZ,0,0,
Geoffrey Roberts,OP_5MT_14399__000001_WR25AJ,OPT,38 St Johns,,Worcester,Worcestershire,,WR2 5AJ,Tel: 01905 423217, - ,,,No ratings yet Rate it yourself - /Services/opticians/LeaveReview/DefaultView.aspx?id=OP_5MT_14399__000001_WR25AJ,0,0,
Malcolm Gray & Associates,OP_5MN_1689__000001_ST216BZ,OPT,56 High Street,,Stafford,Eccleshall,Staffordshire,ST21 6BZ,Tel: 01785 851015, - ,,,2 ratings Rate it yourself - /Services/opticians/LeaveReview/DefaultView.aspx?id=OP_5MN_1689__000001_ST216BZ,,,
