Organisation Name,NACS Code,Organisation Type,Address1,Address2,Address3,Address4,Address5,PostCode,Telephone Number,Opening time,Value  (Opening time),Banding Classification  (Opening time),NHS.UK users rating,Value  (NHS.UK users rating),Banding Classification  (NHS.UK users rating),Car parking (Is there car parking at this organisation?)
20/20 Eyecare,090220171022,OPT,,20 Station Road,,Harpenden,,AL5 4SE,Tel: 01582 766613, - ,,,No ratings yet Rate it yourself - /Services/opticians/LeaveReview/DefaultView.aspx?id=090220171022,0,0,
Allders Opticians,OP_5P2_1__000002_AL54SQ,OPT,17a Station Road,,Harpenden,Herts,,AL5 4SQ,Tel: 01582 767524, - ,,,No ratings yet Rate it yourself - /Services/opticians/LeaveReview/DefaultView.aspx?id=OP_5P2_1__000002_AL54SQ,0,0,
Skye Opticians,OP_5GX_3131__000001_AL52SH,OPT,,1 Bowers Parade,,Harpenden,Hertfordshire,AL5 2SH,Tel: 01582 712845, - ,,,2 ratings Rate it yourself - /Services/opticians/LeaveReview/DefaultView.aspx?id=OP_5GX_3131__000001_AL52SH,,,
Harpenden Eye Centre,TPOGT,OPT,,1A Leyton Road,,Harpenden,,AL5 2TJ,Tel: 01582 766668, - ,,,2 ratings Rate it yourself - /Services/opticians/LeaveReview/DefaultView.aspx?id=TPOGT,,,yes
Redbourn Eyecare,2005191421,OPT,,78 High Street,Redbourn,St. Albans,Hertfordshire,AL3 7LN,Tel: 01582965575, - ,,,No ratings yet Rate it yourself - /Services/opticians/LeaveReview/DefaultView.aspx?id=2005191421,0,0,
"Charrington, Cross, Liversidge & Partners",OP_5GX_9907__000002_AL49RB,OPT,47 The Quadrant,,St. Albans,,,AL4 9RB,Tel: 01727 858405, - ,,,No ratings yet Rate it yourself - /Services/opticians/LeaveReview/DefaultView.aspx?id=OP_5GX_9907__000002_AL49RB,0,0,
Vision Express St Albans,A6W1I,OPT,,31 St Peter's Street,,Hertfordshire,,AL1 3DP,Tel: 01727 739614, - ,,,No ratings yet Rate it yourself - /Services/opticians/LeaveReview/DefaultView.aspx?id=A6W1I,0,0,
David Clulow Opticians,CO-4131,OPT,,"2ND FLOOR, VERULAM POINT",,ST ALBANS,,AL1 5HE,, - ,,,No ratings yet Rate it yourself - /Services/opticians/LeaveReview/DefaultView.aspx?id=CO-4131,0,0,
John Snelgrove,OP_5GX_1843__000001_AL40UH,OPT,Enhanced Optical Services,209 Hatfield Road,,St Albans,Hertfordshire,AL1 4SY,Tel: 01727 817132, - ,,,No ratings yet Rate it yourself - /Services/opticians/LeaveReview/DefaultView.aspx?id=OP_5GX_1843__000001_AL40UH,0,0,
Leightons Opticians & Hearing Care,1017110516,OPT,,5 The Broadway,St. Peters Street,St Albans,Herefordshire,AL1 3LH,Tel: 01727 865 348, - ,,,No ratings yet Rate it yourself - /Services/opticians/LeaveReview/DefaultView.aspx?id=1017110516,0,0,
Boots-St Albans - St Peters St,OP_5GX_5330__000003_AL13DH,OPT,1 St Peters Street,,,St Albans,Hertfordshire,AL1 3DH,Tel: 01727 853 893, - ,,,No ratings yet Rate it yourself - /Services/opticians/LeaveReview/DefaultView.aspx?id=OP_5GX_5330__000003_AL13DH,0,0,
Boots-St Albans - St Peters St (in Boots UK),OP_5GX_6360__000002_AL13DH,OPT,9 St Peters Street,,,St Albans,Hertfordshire,AL1 3DH,Tel: 01727 850288, - ,,,1 rating Rate it yourself - /Services/opticians/LeaveReview/DefaultView.aspx?id=OP_5GX_6360__000002_AL13DH,,,
Eyecare at Morrisons,Y7E1Y,OPT,,244 Hatfield Road,,St Albans,Hertfordshire,AL1 4SU,Tel: 01727 863862, - ,,,No ratings yet Rate it yourself - /Services/opticians/LeaveReview/DefaultView.aspx?id=Y7E1Y,0,0,
Specsavers Opticians,OP_5GX_4672__000002_AL35DP,OPT,17 Market Place,,St. Albans,,,AL3 5DP,Tel: 01727 848020, - ,,,No ratings yet Rate it yourself - /Services/opticians/LeaveReview/DefaultView.aspx?id=OP_5GX_4672__000002_AL35DP,0,0,
Dollond & Aitchison ,OP_5GG_8026__000001_AL86PW,OPT,24 Church Road,Welwyn Garden City,Hertfordshire,,,AL8 6PW,Tel: 01707 327130, - ,,,No ratings yet Rate it yourself - /Services/opticians/LeaveReview/DefaultView.aspx?id=OP_5GG_8026__000001_AL86PW,0,0,
Maltings Eyecare,OP_5GX_11389__000001_AL13HL,OPT,9 The Maltings,,St. Albans,,,AL1 3HL,Tel: 01727 853333, - ,,,2 ratings Rate it yourself - /Services/opticians/LeaveReview/DefaultView.aspx?id=OP_5GX_11389__000001_AL13HL,,,
Optical Express,AL1 3HZ_23847,OPT,"2nd Floor, Trident House",Victoria Street,,St Albans,Hertfordshire,AL1 3HR,Tel: 0800 023 2020, - ,,,No ratings yet Rate it yourself - /Services/opticians/LeaveReview/DefaultView.aspx?id=AL1 3HZ_23847,0,0,
Robert Roope,OP_5GX_8765__000001_AL34ES,OPT,20 George Street,,St. Albans,,,AL3 4ES,Tel: 01727 857798, - ,,,No ratings yet Rate it yourself - /Services/opticians/LeaveReview/DefaultView.aspx?id=OP_5GX_8765__000001_AL34ES,0,0,
Scrivens Opticians,OP_5GG_11792__000001_AL86AP,OPT,,47 Howardsgate,,Welwyn Garden City,,AL8 6AP,Tel: 01707 330077, - ,,,No ratings yet Rate it yourself - /Services/opticians/LeaveReview/DefaultView.aspx?id=OP_5GG_11792__000001_AL86AP,0,0,
Boots-Welwyn Garden City - Howard Gate,AL8 6PU_19283,OPT,,38-40 Howards Gate,,Welwyn Garden City,Hertfordshire,AL8 6PU,Tel: 01707 327 130, - ,,,No ratings yet Rate it yourself - /Services/opticians/LeaveReview/DefaultView.aspx?id=AL8 6PU_19283,0,0,
The St. Albans Contact Lens Centre,OP_5GX_9510__000001_AL11NG,OPT,38 London Road,,St. Albans,,,AL1 1NG,Tel: 01727 852841, - ,,,No ratings yet Rate it yourself - /Services/opticians/LeaveReview/DefaultView.aspx?id=OP_5GX_9510__000001_AL11NG,0,0,
Jeremy Solomon Opticians,OP_5GG_11321__000001_AL86BP,OPT,,62 Howardsgate,,Welwyn Garden City,,AL8 6BP,Tel: 01707 334455, - ,,,1 rating Rate it yourself - /Services/opticians/LeaveReview/DefaultView.aspx?id=OP_5GG_11321__000001_AL86BP,,,
Vision Express Welwyn Garden City,TP9K6,OPT,,61 Howardsgate,,Herts,,AL8 6BB,, - ,,,No ratings yet Rate it yourself - /Services/opticians/LeaveReview/DefaultView.aspx?id=TP9K6,0,0,
Vision Express Opticians Ltd - Welwyn Garden City,,OPT,, 61 Howardsgate ,,Welwyn Garden City,,AL8 6BB,, - ,,,N/A - Data not available,,,
Boots-Welwyn Garden City - Howard Centre,OP_5GG_1231__000002_AL86HA,OPT,15 The Howard Centre,Howardsgate,,Welwyn Garden City,Hertfordshire,AL8 6HA,Tel: 01707 322495, - ,,,1 rating Rate it yourself - /Services/opticians/LeaveReview/DefaultView.aspx?id=OP_5GG_1231__000002_AL86HA,,,
Bayfields Opticians,OP_5GG_6847__000001_AL86HA,OPT,39 The Howard Centre,Howardsgate,Welwyn Garden City,Hertfordshire,,AL8 6HA,Tel: 01707 392919, - ,,,7 ratings Rate it yourself - /Services/opticians/LeaveReview/DefaultView.aspx?id=OP_5GG_6847__000001_AL86HA,,,
Tesco Opticians,AL9 5JY,OPT,,Great North Road,,Hatfield,,AL9 5JY,Tel: 0345 601 3479, - ,,,No ratings yet Rate it yourself - /Services/opticians/LeaveReview/DefaultView.aspx?id=AL9 5JY,0,0,
Direkt Optik,OP_5GC___000002_LU12AA,OPT,3-5 George Street,,Luton,Beds,,LU1 2AA,Tel: 01582 455513, - ,,,No ratings yet Rate it yourself - /Services/opticians/LeaveReview/DefaultView.aspx?id=OP_5GC___000002_LU12AA,0,0,
Luton Optical Centre,OP_5GC_16__000001_LU12TA,OPT,32 Market Hall,The Arndale Centre,Luton,Beds,,LU1 2TA,Tel: 01582 402773, - ,,,1 rating Rate it yourself - /Services/opticians/LeaveReview/DefaultView.aspx?id=OP_5GC_16__000001_LU12TA,,,
iCareCentre Opticians,OP_5GC_489__000003_LU12TJ,OPT,Unit 16 The Mall,,,Luton,Bedfordshire,LU1 2TE,Tel: 01582 728731, - ,,,1 rating Rate it yourself - /Services/opticians/LeaveReview/DefaultView.aspx?id=OP_5GC_489__000003_LU12TJ,,,
Elcott Opticians,OP_5GC__000001_LU12AF,OPT,Elcott Opticians,19 George Street,,Luton,Bedfordshire,LU1 2AF,Tel: 01582 415379, - ,,,No ratings yet Rate it yourself - /Services/opticians/LeaveReview/DefaultView.aspx?id=OP_5GC__000001_LU12AF,0,0,
Boots-Luton - Arndale Centre (in Boots UK),OP_5GC_4768__000002_LU12BG,OPT,82-86 The Arndale Centre,,Luton,Beds,,LU1 2BG,Tel: 01582 424730, - ,,,3 ratings Rate it yourself - /Services/opticians/LeaveReview/DefaultView.aspx?id=OP_5GC_4768__000002_LU12BG,,,
Specsavers Opticians,OP_5GC_12037__000001_LU12AX,OPT,26 George Street,,Luton,Beds,,LU1 2AX,Tel: 01582 484300, - ,,,No ratings yet Rate it yourself - /Services/opticians/LeaveReview/DefaultView.aspx?id=OP_5GC_12037__000001_LU12AX,0,0,
Luton Vision Express,OP_5GC_12947__000004_LU12TJ,OPT,,94 The Mall,,Luton,Bedfordshire,LU1 2TQ,Tel: 01582 417417, - ,,,1 rating Rate it yourself - /Services/opticians/LeaveReview/DefaultView.aspx?id=OP_5GC_12947__000004_LU12TJ,,,
Boots-Hatfield,OP_5GG_2844__000002_AL100JW,OPT,70 Town Centre,,,Hatfield,Hertfordshire,AL10 0JW,Tel: 01707 263966, - ,,,No ratings yet Rate it yourself - /Services/opticians/LeaveReview/DefaultView.aspx?id=OP_5GG_2844__000002_AL100JW,0,0,
Specsavers Opticians,OP_5GG_5704__000001_AL100JW,OPT,80 Town Centre,,Hatfield,,,AL10 0JW,Tel: 01707 274991, - ,,,No ratings yet Rate it yourself - /Services/opticians/LeaveReview/DefaultView.aspx?id=OP_5GG_5704__000001_AL100JW,0,0,
Brown & White Opticians,OP_5GC_6142__000001_LU12RD,OPT,,172 The Mall,,Luton,Bedfordshire,LU1 2TL,Tel: 01582 720106, - ,,,No ratings yet Rate it yourself - /Services/opticians/LeaveReview/DefaultView.aspx?id=OP_5GC_6142__000001_LU12RD,0,0,
Paul Adler Optometrists,OP_AL34BH_29754,OPT,,41a Abbey Avenue,,St Albans,Hertfordshire,AL3 4BH,Tel: 01727 842232, - ,,,No ratings yet Rate it yourself - /Services/opticians/LeaveReview/DefaultView.aspx?id=OP_AL34BH_29754,0,0,
Allders Opticians,OP_5GC_10407__000002_LU11EH,OPT,88 Dunstable Road,,Luton,Beds,,LU1 1EH,Tel: 01582 725136, - ,,,No ratings yet Rate it yourself - /Services/opticians/LeaveReview/DefaultView.aspx?id=OP_5GC_10407__000002_LU11EH,0,0,
Kanzaria Opticians,OP_5GC_2101__000003_LU11EH,OPT,104 Dunstable Road,,Luton,Beds,,LU1 1EW,Tel: 01582 480776, - ,,,No ratings yet Rate it yourself - /Services/opticians/LeaveReview/DefaultView.aspx?id=OP_5GC_2101__000003_LU11EH,0,0,
Christopher's Opticians,5GH_02012006__000002_SG36AP,OPT,7a Station Road,,Knebworth,Hertfordshire,,SG3 6AP,Tel: 01438 816306, - ,,,No ratings yet Rate it yourself - /Services/opticians/LeaveReview/DefaultView.aspx?id=5GH_02012006__000002_SG36AP,0,0,
Enhanced Optical Services,OP_AL22NZ_46760,OPT,,7 Ashley Road,,St Albans,,AL2 2NZ,Tel: 01727 873120, - ,,,No ratings yet Rate it yourself - /Services/opticians/LeaveReview/DefaultView.aspx?id=OP_AL22NZ_46760,0,0,
M&S Opticians,D7F2F,OPT,,5 Roaring Meg Retail Park,,Stevenage,,SG1 1XN,Tel: 01438576301, - ,,,No ratings yet Rate it yourself - /Services/opticians/LeaveReview/DefaultView.aspx?id=D7F2F,0,0,
Asda Opticians,OP_SG11LA_30695,OPT,,Monkswood Way,,Stevenage,,SG1 1LA,Tel: 01438 744912, - ,,,No ratings yet Rate it yourself - /Services/opticians/LeaveReview/DefaultView.aspx?id=OP_SG11LA_30695,0,0,
Adeyfield Eyecare,OP5M238__000003_HP24ET,OPT,2 The Queens Square,,Hemel Hempstead,Hertfordshire,,HP2 4ES,Tel: 01442 240004, - ,,,No ratings yet Rate it yourself - /Services/opticians/LeaveReview/DefaultView.aspx?id=OP5M238__000003_HP24ET,0,0,
Adeyfield Eyecare,OP_5GW_13215__000001_HP24ET,OPT,88 Longlands,Adeyfields,Hemel Hempstead,,,HP2 4ET,Tel: 01442 240004, - ,,,No ratings yet Rate it yourself - /Services/opticians/LeaveReview/DefaultView.aspx?id=OP_5GW_13215__000001_HP24ET,0,0,
Boots-Stevenage - Queenway,OP_5GH_6024__000001_SG11BS,OPT,35 Queensway,,,Stevenage,Hertfordshire,SG1 1DN,Tel: 01438 312263, - ,,,1 rating Rate it yourself - /Services/opticians/LeaveReview/DefaultView.aspx?id=OP_5GH_6024__000001_SG11BS,,,
Specsavers Opticians,OP_5GH_7474__000001_SG11EG,OPT,90 Queensway,,Stevenage,,,SG1 1EG,Tel: 01438 748900, - ,,,No ratings yet Rate it yourself - /Services/opticians/LeaveReview/DefaultView.aspx?id=OP_5GH_7474__000001_SG11EG,0,0,
GPC Opticians,OP_5GH_7785__000001_SG11EE,OPT,22 The Forum,,Stevenage,,,SG1 1EH,Tel: 01438 364168, - ,,,No ratings yet Rate it yourself - /Services/opticians/LeaveReview/DefaultView.aspx?id=OP_5GH_7785__000001_SG11EE,0,0,
Boots-London Colney,AL2 1AB_19217,OPT,,"4 Colney Fields Shopping Park, London Colney",,St Albans,Hertfordshire,AL2 1AB,Tel: 01727 824504, - ,,,1 rating Rate it yourself - /Services/opticians/LeaveReview/DefaultView.aspx?id=AL2 1AB_19217,,,
Dollond & Aitchison,OP_5GH_4998__000003_SG11ES,OPT,The Forum Centre,The Forum,Stevenage,Hertfordshire,,SG1 1ES,Tel: 01438 364656, - ,,,No ratings yet Rate it yourself - /Services/opticians/LeaveReview/DefaultView.aspx?id=OP_5GH_4998__000003_SG11ES,0,0,
S Robinson,OP-5GC__000004_LU32NJ,OPT,70 Marsh Road,,Luton,Beds,,LU3 2NJ,Tel: 01582 503616, - ,,,No ratings yet Rate it yourself - /Services/opticians/LeaveReview/DefaultView.aspx?id=OP-5GC__000004_LU32NJ,0,0,
Kanzaria Opticians,OP_5GC_180__000001_LU32QL,OPT,180 Marsh Road,,Luton,Beds,,LU3 2QL,Tel: 01582 575886, - ,,,1 rating Rate it yourself - /Services/opticians/LeaveReview/DefaultView.aspx?id=OP_5GC_180__000001_LU32QL,,,
Boots-Hemel Hempstead - Marlowes (in BUK),OP_5GW_1780__000004_HP11BH,OPT,149 Marlowes,,,Hemel Hempstead,Hertfordshire,HP1 1BB,Tel: 01442 231774, - ,,,1 rating Rate it yourself - /Services/opticians/LeaveReview/DefaultView.aspx?id=OP_5GW_1780__000004_HP11BH,,,
Hemel Opticians,OP_5GW_3024__000002_HP11BB,OPT,143 Marlowes,Hemel Hempstead,Hertfordshire,,,HP1 1BB,Tel: 01442 240607, - ,,,No ratings yet Rate it yourself - /Services/opticians/LeaveReview/DefaultView.aspx?id=OP_5GW_3024__000002_HP11BB,0,0,
Thies Optometrists,OP_5GW_9617__000001_HP11EF,OPT,24 Bridge Street,,Hemel Hempstead,,,HP1 1EF,Tel: 01442 253858, - ,,,No ratings yet Rate it yourself - /Services/opticians/LeaveReview/DefaultView.aspx?id=OP_5GW_9617__000001_HP11EF,0,0,
David Pressman Opticians,10072010__000002_HP11DX,OPT,Unit 52,Marlowes Centre,Hemel Hempstead,Hertfordshire,,HP1 1DX,Tel: 01442 255969, - ,,,No ratings yet Rate it yourself - /Services/opticians/LeaveReview/DefaultView.aspx?id=10072010__000002_HP11DX,0,0,
Vision Express (UK) Ltd,OP_5GW_5968__000001_HP11DZ,OPT,Unit 34 The Marlowes Shopping Centre,Hemel Hempstead,Hertfordshire,,,HP1 1DZ,Tel: 01442 266535, - ,,,No ratings yet Rate it yourself - /Services/opticians/LeaveReview/DefaultView.aspx?id=OP_5GW_5968__000001_HP11DZ,0,0,
Specsavers Opticians,OP_5GW_8295__000001_HP11DX,OPT,,252-254 Marlowes,,Hemel Hempstead,Hertfordshire,HP1 1BJ,Tel: 01442 212141, - ,,,2 ratings Rate it yourself - /Services/opticians/LeaveReview/DefaultView.aspx?id=OP_5GW_8295__000001_HP11DX,,,
Complete Community Care North London Limited,C8W5R,OPT,,36 Highbarns,,Hemel Hemstead,,HP3 8AF,Tel: 01442 910560, - ,,,No ratings yet Rate it yourself - /Services/opticians/LeaveReview/DefaultView.aspx?id=C8W5R,0,0,
Tesco Opticians,OP_5P2_98__000001_LU54JU,OPT,,Skimpot Road,,Dunstable,,LU5 4JU,Tel: 0345 601 3479, - ,,,No ratings yet Rate it yourself - /Services/opticians/LeaveReview/DefaultView.aspx?id=OP_5P2_98__000001_LU54JU,0,0,
A1 Optician Ltd,OP_HP39DD_85645,OPT,A1 Optician Ltd,24 Kingfisher Drive,,Hemel Hempstead,,HP3 9DD,Tel: 0800 023 4964, - ,,,13 ratings Rate it yourself - /Services/opticians/LeaveReview/DefaultView.aspx?id=OP_HP39DD_85645,,,
Kanzaria Opticians,OP_5GC_12944__000002_LU33SR,OPT,Purley Centre,Marsh Farm,Luton,Beds,,LU3 3SR,Tel: 01582 580310, - ,,,No ratings yet Rate it yourself - /Services/opticians/LeaveReview/DefaultView.aspx?id=OP_5GC_12944__000002_LU33SR,0,0,
Christopher's Opticians  ,OP_5GH_3618__000001_SG20DL,OPT,21 The Glebe,,Stevenage,,,SG2 0DL,Tel: 01438 314538, - ,,,No ratings yet Rate it yourself - /Services/opticians/LeaveReview/DefaultView.aspx?id=OP_5GH_3618__000001_SG20DL,0,0,
Thies Optometrists,OP_5GW_8916__000002_HP12QF,OPT,25 Stoneycroft,,Hemel Hempstead,,,HP1 2QF,Tel: 01442 264897, - ,,,No ratings yet Rate it yourself - /Services/opticians/LeaveReview/DefaultView.aspx?id=OP_5GW_8916__000002_HP12QF,0,0,
Shephard & Akay Optometrists,OP_5GH_7550__000001_SG51HR,OPT,,5 Churchyard,,Hitchin,Hertfordshire,SG5 1HR,Tel: 01462 432088, - ,,,No ratings yet Rate it yourself - /Services/opticians/LeaveReview/DefaultView.aspx?id=OP_5GH_7550__000001_SG51HR,0,0,
Boots-Hitchin,OP_5GH_6033__000001_SG51AT,OPT,22 High Street,,,Hitchin,Hertfordshire,SG5 1AT,Tel: 01462 432196, - ,,,5 ratings Rate it yourself - /Services/opticians/LeaveReview/DefaultView.aspx?id=OP_5GH_6033__000001_SG51AT,,,
Specsavers Opticians,OP_5GH_8355__000001_SG51DN,OPT,27 High Street,,Hitchin,,,SG5 1AT,Tel: 01462 422255, - ,,,No ratings yet Rate it yourself - /Services/opticians/LeaveReview/DefaultView.aspx?id=OP_5GH_8355__000001_SG51DN,0,0,
Vision Care,OP_5GH_700__000001_SG51JQ,OPT,3 Bancroft,Hitchin,Hertfordshire,,,SG5 1JQ,Tel: 01462 434888, - ,,,No ratings yet Rate it yourself - /Services/opticians/LeaveReview/DefaultView.aspx?id=OP_5GH_700__000001_SG51JQ,0,0,
Allders Opticians ,OP_5GH_5128__000001_SG51BT,OPT,15 Hermitage Road,,Hitchin,,,SG5 1BT,Tel: 01462 450549, - ,,,No ratings yet Rate it yourself - /Services/opticians/LeaveReview/DefaultView.aspx?id=OP_5GH_5128__000001_SG51BT,0,0,
I Kara,OP_5GC_12948__000001_LU33BH,OPT,8 The Parade,Sundon Park,,Luton,,LU3 3BH,Tel: 01582 571731, - ,,,No ratings yet Rate it yourself - /Services/opticians/LeaveReview/DefaultView.aspx?id=OP_5GC_12948__000001_LU33BH,0,0,
C A Leith,OP_5GV_4340__000001_WD50AW,OPT,72 High Street,,Abbots Langley,,,WD5 0AW,Tel: 01923 264986, - ,,,No ratings yet Rate it yourself - /Services/opticians/LeaveReview/DefaultView.aspx?id=OP_5GV_4340__000001_WD50AW,0,0,
Kings Langley Eyecare,OPT_WD48BH_2,OPT,,12 High Stree,,Kings Langley ,,WD4 8BH,, - ,,,No ratings yet Rate it yourself - /Services/opticians/LeaveReview/DefaultView.aspx?id=OPT_WD48BH_2,0,0,
Kings Langley Eyecare,01-22493,OPT,,12 High Street,,Kings Langley,,WD4 8BH,Tel: 01923 266132, - ,,,No ratings yet Rate it yourself - /Services/opticians/LeaveReview/DefaultView.aspx?id=01-22493,0,0,
Kings Langley Eyecare,OPT_WD48BH_1,OPT,,12 High Street,,Kings Langley ,,WD4 8BH,, - ,,,No ratings yet Rate it yourself - /Services/opticians/LeaveReview/DefaultView.aspx?id=OPT_WD48BH_1,0,0,
Dr DH Glover,OP_WD77ER_46758,OPT,,24 Canons Close,,Radlett,,WD7 7ER,Tel: 07887850987, - ,,,No ratings yet Rate it yourself - /Services/opticians/LeaveReview/DefaultView.aspx?id=OP_WD77ER_46758,0,0,
Dunstable Eye Centre,OP5P222__000002_LU63SN,OPT,,5a Queensway,,Dunstable,Bedfordshire,LU5 4DW,Tel: 01582 608449, - ,,,3 ratings Rate it yourself - /Services/opticians/LeaveReview/DefaultView.aspx?id=OP5P222__000002_LU63SN,,,
Radlett Opticians,OP_5CP_10814__000001_WD77AB,OPT,86 Watling Street,,Radlett,,,WD7 7AB,Tel: 01923 855888, - ,,,1 rating Rate it yourself - /Services/opticians/LeaveReview/DefaultView.aspx?id=OP_5CP_10814__000001_WD77AB,,,
Grant & Glass Opticians,OP_5CP_8337__000003_WD77LB,OPT,365-367 Watling Street,,Radlett,,,WD7 7LB,Tel: 01923 858222, - ,,,No ratings yet Rate it yourself - /Services/opticians/LeaveReview/DefaultView.aspx?id=OP_5CP_8337__000003_WD77LB,0,0,
Specsavers Opticians,OP_5GE_11767__000003_LU54RH,OPT,17-19  Broadwalk,Quadrant,Dunstable,Beds,,LU5 4RH,Tel: 01582 475404, - ,,,No ratings yet Rate it yourself - /Services/opticians/LeaveReview/DefaultView.aspx?id=OP_5GE_11767__000003_LU54RH,0,0,
Boots-Dunstable,OP_5GE_11942__000004_LU54RH,OPT,42 Broadwalk North,,,Dunstable,Bedfordshire,LU5 4RH,Tel: 01582 663777, - ,,,No ratings yet Rate it yourself - /Services/opticians/LeaveReview/DefaultView.aspx?id=OP_5GE_11942__000004_LU54RH,0,0,
Allders Opticians,OP_5GE_10409__000001_LU61LA,OPT,42 High Street North,,Dunstable,Beds,,LU6 1LA,Tel: 01582 664815, - ,,,No ratings yet Rate it yourself - /Services/opticians/LeaveReview/DefaultView.aspx?id=OP_5GE_10409__000001_LU61LA,0,0,
Grant & Glass Opticians,OP_5GE_11812__000001_LU63SN,OPT,,5a Queensway,,Dunstable,,LU5 4DW,Tel: 01582 608449, - ,,,No ratings yet Rate it yourself - /Services/opticians/LeaveReview/DefaultView.aspx?id=OP_5GE_11812__000001_LU63SN,0,0,
Brown & Wenman Opticians,OP_5GE_980__000001_LU61SA,OPT,,18 Albion Street,,Dunstable,Bedfordshire,LU6 1SA,Tel: 01582 663770, - ,,,No ratings yet Rate it yourself - /Services/opticians/LeaveReview/DefaultView.aspx?id=OP_5GE_980__000001_LU61SA,0,0,yes
Boots-Potters Bar,OP_5GG_10701__000001_AL97QT,OPT,144-146 Darkes Lane,,,Potters Bar,Hertfordshire,EN6 1AF,Tel: 01707 664321, - ,,,No ratings yet Rate it yourself - /Services/opticians/LeaveReview/DefaultView.aspx?id=OP_5GG_10701__000001_AL97QT,0,0,
Davidson Opticians,OP_5CP_12574__000001_EN61AE,OPT,106 Darkes Lane,,Potters Bar,,,EN6 1AE,Tel: 01707 642255, - ,,,No ratings yet Rate it yourself - /Services/opticians/LeaveReview/DefaultView.aspx?id=OP_5CP_12574__000001_EN61AE,0,0,
Alexander Kobrin Optometrists ,OP_5CP_10088__000001_EN61BW,OPT,177 Darkes Lane,,Potters Bar,,,EN6 1BW,Tel: 01707 652322, - ,,,No ratings yet Rate it yourself - /Services/opticians/LeaveReview/DefaultView.aspx?id=OP_5CP_10088__000001_EN61BW,0,0,
Brown & White Opticians,OP_5GE_8934__000002_LU55ES,OPT,1 Bedford Square,Houghton Regis,,Dunstable,Bedfordshire,LU5 5ES,Tel: 01582 865888, - ,,,No ratings yet Rate it yourself - /Services/opticians/LeaveReview/DefaultView.aspx?id=OP_5GE_8934__000002_LU55ES,0,0,
Eye Care Centre,OP_5CP_10176__000002_EN62HW,OPT,46 The Broadway,Darkes Lane,Potters Bar,,,EN6 2HW,Tel: 01707 650064, - ,,,No ratings yet Rate it yourself - /Services/opticians/LeaveReview/DefaultView.aspx?id=OP_5CP_10176__000002_EN62HW,0,0,
Asda Opticians,OPT_WD24 7RT,OPT,,ODHAMS TRADING ESTATE,ST ALBANS ROAD,WATFORD,,WD24 7RT,Tel: 01923 650720, - ,,,1 rating Rate it yourself - /Services/opticians/LeaveReview/DefaultView.aspx?id=OPT_WD24 7RT,,,
Boots-Hertford,OP_5GJ_4619__000001_SG141DW,OPT,27 Maidenhead Street,,,Hertford,Hertfordshire,SG14 1DW,Tel: 01992 583285, - ,,,No ratings yet Rate it yourself - /Services/opticians/LeaveReview/DefaultView.aspx?id=OP_5GJ_4619__000001_SG141DW,0,0,
Direct Opticians,OP_5GV_6722__000001_WD25PR,OPT,413 St. Albans Road,,,Watford,,WD24 6PR,Tel: 01923 243522, - ,,,No ratings yet Rate it yourself - /Services/opticians/LeaveReview/DefaultView.aspx?id=OP_5GV_6722__000001_WD25PR,0,0,
Stuart Davidson Opticians ,OP_5P3_1321__000002_SG141BN,OPT,22a Bircherley Green,Hertford,Herts,,,SG14 1BN,Tel: 01992 586 979, - ,,,No ratings yet Rate it yourself - /Services/opticians/LeaveReview/DefaultView.aspx?id=OP_5P3_1321__000002_SG141BN,0,0,
Hertford Opticians,OP_5GJ_3719__000001_SG137DZ,OPT,73 Railway Street,,Hertford,Hertfordshire,,SG14 1RP,Tel: 01992 551762, - ,,,No ratings yet Rate it yourself - /Services/opticians/LeaveReview/DefaultView.aspx?id=OP_5GJ_3719__000001_SG137DZ,0,0,
Eye Deal Eyes Opticians,OP_5CP_12057__000001_EN65AP,OPT,2 Kemble Parade,High Street,Potters Bar,,,EN6 5AP,Tel: 01707 660808, - ,,,No ratings yet Rate it yourself - /Services/opticians/LeaveReview/DefaultView.aspx?id=OP_5CP_12057__000001_EN65AP,0,0,
Allders Opticians,OP_5GE_5127__000003_MK454LL,OPT,79 Bedford Road,,Barton-le-Clay,Beds,,MK45 4LL,Tel: 01582 881478, - ,,,No ratings yet Rate it yourself - /Services/opticians/LeaveReview/DefaultView.aspx?id=OP_5GE_5127__000003_MK454LL,0,0,
Stewart-Dick Opticians,OP_5GV_8267__000002_WD25BH,OPT,213 St. Albans Road,,Watford,,,WD24 5BH,Tel: 01923 224008, - ,,,No ratings yet Rate it yourself - /Services/opticians/LeaveReview/DefaultView.aspx?id=OP_5GV_8267__000002_WD25BH,0,0,
Costco Wholesale UK Ltd,CO-1833-22,OPT,,Hartspring Lane,,"Watford, Hertfordshire",,WD25 8JS,Tel: 01923 699 815, - ,,,No ratings yet Rate it yourself - /Services/opticians/LeaveReview/DefaultView.aspx?id=CO-1833-22,0,0,
David Stern Opticians ,OP_5GH_8540__000001_SG63BY,OPT,10 Arena Parade,,Letchworth,,,SG6 3BY,Tel: 01462 683045, - ,,,No ratings yet Rate it yourself - /Services/opticians/LeaveReview/DefaultView.aspx?id=OP_5GH_8540__000001_SG63BY,0,0,
Allders Opticians,OP_5GK_10408__000001_SG90DX,OPT,15 Eastcheap,,Letchworth,,,SG6 3DA,Tel: 01462 673216, - ,,,No ratings yet Rate it yourself - /Services/opticians/LeaveReview/DefaultView.aspx?id=OP_5GK_10408__000001_SG90DX,0,0,
Boots-Berkhamstead,OP_5GW_9591__000002_HP41AG,OPT,,242 High Street,,Berkhamsted,,HP4 1AG,Tel: 01442 865911, - ,,,No ratings yet Rate it yourself - /Services/opticians/LeaveReview/DefaultView.aspx?id=OP_5GW_9591__000002_HP41AG,0,0,
David Paul,OP_5GW_7933__000003_HP41AG,OPT,236 High Street,,,Berkhamsted,,HP4 1AG,Tel: 01442 879303, - ,,,3 ratings Rate it yourself - /Services/opticians/LeaveReview/DefaultView.aspx?id=OP_5GW_7933__000003_HP41AG,,,