Organisation Name,NACS Code,Organisation Type,Address1,Address2,Address3,Address4,Address5,PostCode,Telephone Number,Opening time,Value  (Opening time),Banding Classification  (Opening time),NHS.UK users rating,Value  (NHS.UK users rating),Banding Classification  (NHS.UK users rating),Car parking (Is there car parking at this organisation?)
Werrington Health Care Ltd,5PN/3405__000002_PE46QF,OPT,Werrington Opticians,97 Church Street,Werrington Village,Peterborough,,PE4 6QF,Tel: 01733 576596, - ,,,No ratings yet Rate it yourself - /Services/opticians/LeaveReview/DefaultView.aspx?id=5PN/3405__000002_PE46QF,0,0,
Sask Optics,195PN__000003_PE12PH,OPT,293 Lincoln Road Millfield,,Peterborough,Cambridgeshire,,PE1 2PH,Tel: 01733 563845, - ,,,No ratings yet Rate it yourself - /Services/opticians/LeaveReview/DefaultView.aspx?id=195PN__000003_PE12PH,0,0,
Special Eyes,OP_5AF_7859__000001_PE11RE,OPT,34 North Street,,Peterborough,Cambridgeshire,,PE1 2RA,Tel: 01733 893998, - ,,,No ratings yet Rate it yourself - /Services/opticians/LeaveReview/DefaultView.aspx?id=OP_5AF_7859__000001_PE11RE,0,0,
Westgate Optical,OP_5AF_10333__000002_PE12TA,OPT,1st Floor Westgate House Park Road,Peterborough,,cambs,,PE1 2TA,Tel: 01733 342464, - ,,,No ratings yet Rate it yourself - /Services/opticians/LeaveReview/DefaultView.aspx?id=OP_5AF_10333__000002_PE12TA,0,0,
Vision Express,OP_5AF_12958__000003_PE11NH,OPT,20 Queensgate Centre,,Peterborough,Cambridgeshire,,PE1 1NH,Tel: 01733 555655, - ,,,No ratings yet Rate it yourself - /Services/opticians/LeaveReview/DefaultView.aspx?id=OP_5AF_12958__000003_PE11NH,0,0,
Dolland & Aitchison,OP_5AF_4909__000002_PE11NH,OPT,27 Queensgate Centre,,Peterborough,Cambridgeshire,,PE1 1NH,Tel: 01733 312705, - ,,,No ratings yet Rate it yourself - /Services/opticians/LeaveReview/DefaultView.aspx?id=OP_5AF_4909__000002_PE11NH,0,0,
Henry Smith & Hamylton (Opticians) Ltd,OP_5AF_3378__000001_PE11YR,OPT,1 Cumbergate,,Peterborough,Cambridgeshire,,PE1 1YR,Tel: 01733 310661, - ,,,No ratings yet Rate it yourself - /Services/opticians/LeaveReview/DefaultView.aspx?id=OP_5AF_3378__000001_PE11YR,0,0,
Boots-Peterborough - Queensgate,OP_5AF_12954__000003_PE11NW,OPT,Queensgate Centre,,,Peterborough,Cambridgeshire,PE1 1NW,Tel: 01733 313380, - ,,,No ratings yet Rate it yourself - /Services/opticians/LeaveReview/DefaultView.aspx?id=OP_5AF_12954__000003_PE11NW,0,0,
Optical Express,7 5PN__000001_PE11YT,OPT,"Suite 9, Cross St Court",,Cross Street,Peterborough,Cambridgeshire,PE1 1XA,Tel: 0800 023 2020, - ,,,No ratings yet Rate it yourself - /Services/opticians/LeaveReview/DefaultView.aspx?id=7 5PN__000001_PE11YT,0,0,
Boots-Peterborough - Long Causeway,OP_5AF_12218__000001_PE11YD,OPT,Unit 2,1-4 Long Causeway,,Peterborough,Cambridgeshire,PE1 1YD,Tel: 01733 562 019, - ,,,No ratings yet Rate it yourself - /Services/opticians/LeaveReview/DefaultView.aspx?id=OP_5AF_12218__000001_PE11YD,0,0,
The Eye Centre,OP_5AF_12953__000001_PE11DH,OPT,4 Cowgate,,Peterborough,Cambridgeshire,,PE1 1DH,Tel: 01733 343380, - ,,,No ratings yet Rate it yourself - /Services/opticians/LeaveReview/DefaultView.aspx?id=OP_5AF_12953__000001_PE11DH,0,0,
Peterborough Visionplus Ltd,OP_5AF_2835__000001_PE11HA,OPT,53 Bridge Street,,Peterborough,Cambridgeshire,,PE1 1HA,Tel: 01733 348822, - ,,,No ratings yet Rate it yourself - /Services/opticians/LeaveReview/DefaultView.aspx?id=OP_5AF_2835__000001_PE11HA,0,0,
Asda Stores Ltd,PE1 001,OPT,,West Rivergate Shopping Centre,Viersen Platz,Peterborough,Cambridgeshire,PE1 1ET,Tel: 01733 556300, - ,,,No ratings yet Rate it yourself - /Services/opticians/LeaveReview/DefaultView.aspx?id=PE1 001,0,0,
Scrivens Ltd,OP_5D3_3417__000002_PE68EA,OPT,,5 The Precinct,,Market Deeping,Northamptonshire,PE6 8DL,Tel: 01778 346259, - ,,,No ratings yet Rate it yourself - /Services/opticians/LeaveReview/DefaultView.aspx?id=OP_5D3_3417__000002_PE68EA,0,0,
Philip David Edwards Opticians,OP_5D3_13824__000001_PE68AA,OPT,,37a Church Street,Market Deeping,Lincolnshire,,PE6 8AN,Tel: 01778 346147, - ,,,No ratings yet Rate it yourself - /Services/opticians/LeaveReview/DefaultView.aspx?id=OP_5D3_13824__000001_PE68AA,0,0,no
Tesco Opticians,OP_5AG_10533__000002_PE78BD,OPT,Serpentine Green Shopping Centrehargate Way,,Peterborough,Cambridgeshire,,PE7 8BD,Tel: 01733 410514, - ,,,No ratings yet Rate it yourself - /Services/opticians/LeaveReview/DefaultView.aspx?id=OP_5AG_10533__000002_PE78BD,0,0,
Carl Love Opticians,OP_5AG_4710__000001_PE73LB,OPT,138 Main Street Yaxley,,Peterborough,Cambridgeshire,,PE7 3LB,Tel: 01733 243504, - ,,,No ratings yet Rate it yourself - /Services/opticians/LeaveReview/DefaultView.aspx?id=OP_5AG_4710__000001_PE73LB,0,0,
Specsavers Opticians Ltd,OP_5D3_14933__000001_PE92FT,OPT,Wm. Morrisons Supermarket,Uffington Road,Stamford,,,PE9 2FT,Tel: 01780 761950, - ,,,No ratings yet Rate it yourself - /Services/opticians/LeaveReview/DefaultView.aspx?id=OP_5D3_14933__000001_PE92FT,0,0,yes
Christine Pirrie Ltd (Christine Pirrie),OP_5D3_192__000001_PE92AZ,OPT,7  - 8 Maiden Lane,",",Stamford,",",,PE9 2AZ,Tel: 01780 753488, - ,,,No ratings yet Rate it yourself - /Services/opticians/LeaveReview/DefaultView.aspx?id=OP_5D3_192__000001_PE92AZ,0,0,
Boots-Stamford,OP_5D3_8979__000002_PE92AW,OPT,Unit 2 St Michaels Church,,,Stamford,Lincolnshire,PE9 2AW,Tel: 01780 762665, - ,,,No ratings yet Rate it yourself - /Services/opticians/LeaveReview/DefaultView.aspx?id=OP_5D3_8979__000002_PE92AW,0,0,no
Vision Express (Stamford VE Ltd),OP_5D3_13828__000003_PE92AW,OPT,"Unit 3, St Michaels Church",High Street,Stamford,,,PE9 2AW,Tel: 01780 480737, - ,,,No ratings yet Rate it yourself - /Services/opticians/LeaveReview/DefaultView.aspx?id=OP_5D3_13828__000003_PE92AW,0,0,
Scrivens Ltd,OP_5D3_10765__000001_PE91PL,OPT,10 Ironmonger Street,,,Stamford,Lincolnshire,PE9 1PL,Tel: 01780 753719, - ,,,No ratings yet Rate it yourself - /Services/opticians/LeaveReview/DefaultView.aspx?id=OP_5D3_10765__000001_PE91PL,0,0,
The Stamford Eye Clinic Opticians,01-18126_21012015_RL,OPT,,32 St Peter's Street,,Stamford,,PE9 2PF,Tel: 01780 767403, - ,,,No ratings yet Rate it yourself - /Services/opticians/LeaveReview/DefaultView.aspx?id=01-18126_21012015_RL,0,0,
J Neville Opticians Ltd,12 5PP__000002_PE71HA,OPT,18 Broad Street Whittlesey,,Peterborough,Cambridgeshire,,PE7 1HA,Tel: 01733 208578, - ,,,No ratings yet Rate it yourself - /Services/opticians/LeaveReview/DefaultView.aspx?id=12 5PP__000002_PE71HA,0,0,
Krog & Whitehead Opticians,OP_5AG_8938__000001_PE71AH,OPT,,1-2 Blunts Lane,Whittlesey,Peterborough,Cambridgeshire,PE7 1AH,Tel: 01733 205466, - ,,,No ratings yet Rate it yourself - /Services/opticians/LeaveReview/DefaultView.aspx?id=OP_5AG_8938__000001_PE71AH,0,0,
Judith Day Optometrist,PE8 4BA,OPT,,5 Market Place,,Oundle,,PE8 4BA,Tel: 01832 272974, - ,,,No ratings yet Rate it yourself - /Services/opticians/LeaveReview/DefaultView.aspx?id=PE8 4BA,0,0,
Scrivens Ltd,OP_5D3_5467__000001_PE109NE,OPT,Unit 1 Crown Walk,West Street,,Bourne,Lincolnshire,PE10 9NE,Tel: 01778 425995, - ,,,No ratings yet Rate it yourself - /Services/opticians/LeaveReview/DefaultView.aspx?id=OP_5D3_5467__000001_PE109NE,0,0,
One Stop Eye Care Centre,OP_5D3_14935__000002_PE109NE,OPT,2 West Street,Bourne,,,,PE10 9NE,Tel: 01778 421188, - ,,,No ratings yet Rate it yourself - /Services/opticians/LeaveReview/DefaultView.aspx?id=OP_5D3_14935__000002_PE109NE,0,0,
"Specsavers Bourne (I Stradling, N Stradling & K Stradlling)",OP_5D3_3252__000001_PE109NS,OPT,,Unit 11,The Burghley Centre,Bourne,Lincolnshire,PE10 9EG,Tel: 01778 422402, - ,,,No ratings yet Rate it yourself - /Services/opticians/LeaveReview/DefaultView.aspx?id=OP_5D3_3252__000001_PE109NS,0,0,
Gathercole & Ward,OP_5GF_3400__000001_PE171BS,OPT,102 High Street Ramsey,Huntingdon,Cambridgeshire,,,PE26 1BS,Tel: 01487 812358, - ,,,No ratings yet Rate it yourself - /Services/opticians/LeaveReview/DefaultView.aspx?id=OP_5GF_3400__000001_PE171BS,0,0,
Boots-Spalding,OP_5H9_668__000002_PE111XA,OPT,16 Bridge Street,,,Spalding,Lincolnshire,PE11 1XA,Tel: 01775 723 479, - ,,,No ratings yet Rate it yourself - /Services/opticians/LeaveReview/DefaultView.aspx?id=OP_5H9_668__000002_PE111XA,0,0,
Eyecare Centre,OP_5H9_2126__000001_PE111BH,OPT,,6 Sheepmarket,,Spalding,,PE11 1BH,Tel: 01775 722141, - ,,,No ratings yet Rate it yourself - /Services/opticians/LeaveReview/DefaultView.aspx?id=OP_5H9_2126__000001_PE111BH,0,0,no
Vision Express Spalding,01-17534,OPT,,9 Hall Place,,Spalding,,PE11 1SR,Tel: 01775 719872, - ,,,No ratings yet Rate it yourself - /Services/opticians/LeaveReview/DefaultView.aspx?id=01-17534,0,0,
Specsavers Opticians,OP_PE111SG_34925,OPT,,31 Hall Place,,Spalding,,PE11 1SG,, - ,,,No ratings yet Rate it yourself - /Services/opticians/LeaveReview/DefaultView.aspx?id=OP_PE111SG_34925,0,0,
Selby and Taylor Opticians,CO/3820,OPT,,44a Dartford Road,,Cambs,,PE15 8BQ,, - ,,,No ratings yet Rate it yourself - /Services/opticians/LeaveReview/DefaultView.aspx?id=CO/3820,0,0,
Spectacular Opticians,OP_5JK_10815__000001_PE158LB,OPT,10 Broad Street,,,March,Cambridgeshire,PE15 8TG,Tel: 01354 650115, - ,,,No ratings yet Rate it yourself - /Services/opticians/LeaveReview/DefaultView.aspx?id=OP_5JK_10815__000001_PE158LB,0,0,
N P Coley,OP_5JK_7814__000001_PE158TG,OPT,30 Broad Street,,March,Cambridgeshire,,PE15 8TG,Tel: 01354 653393, - ,,,No ratings yet Rate it yourself - /Services/opticians/LeaveReview/DefaultView.aspx?id=OP_5JK_7814__000001_PE158TG,0,0,
Driver Opticians,3014/5PP__000001_PE158TX,OPT,The Wheel Centre,March,March,Cambridgeshire,,PE15 8TX,Tel: 01354 658833, - ,,,No ratings yet Rate it yourself - /Services/opticians/LeaveReview/DefaultView.aspx?id=3014/5PP__000001_PE158TX,0,0,
ZMP; Lee Walker (Domiciliary),5PC^20850__000001_PE282TD,OPT,2 Station Road,Warboys,Cambs,,,PE28 2TD,, - ,,,No ratings yet Rate it yourself - /Services/opticians/LeaveReview/DefaultView.aspx?id=5PC^20850__000001_PE282TD,0,0,
Harrison Eyeclinic,OP_5JK_12283__000001_PE159BS,OPT,10a Elwyn Road,,,March,Cambridgeshire,PE15 9BS,Tel: 01354 652418, - ,,,No ratings yet Rate it yourself - /Services/opticians/LeaveReview/DefaultView.aspx?id=OP_5JK_12283__000001_PE159BS,0,0,
Andrew Love Optical Company,OL/01-9123/5PA__000002_LE159PZ,OPT,,8 High Street East,,Uppingham,Rutland,LE15 9PZ,Tel: 01572 822920, - ,,,No ratings yet Rate it yourself - /Services/opticians/LeaveReview/DefaultView.aspx?id=OL/01-9123/5PA__000002_LE159PZ,0,0,
Davis Optometrists,OP_5LV_1199__000002_NN144JH,OPT,6 High Street,,,Thrapston,Northamptonshire,NN14 4JH,Tel: 01832 733415, - ,,,No ratings yet Rate it yourself - /Services/opticians/LeaveReview/DefaultView.aspx?id=OP_5LV_1199__000002_NN144JH,0,0,
ASDA  Opticians,OP_5LV^NN171DT__000002_NN171DT,OPT,Phoenix Parkway,,Corby,Northamptonshire,,NN17 5DT,Tel: 01423 704 512, - ,,,No ratings yet Rate it yourself - /Services/opticians/LeaveReview/DefaultView.aspx?id=OP_5LV^NN171DT__000002_NN171DT,0,0,
Josephs Opticians,COL/D12514/5PD__000001_NN173HF,OPT,62 High Street,Old Village,Corby,Northamptonshire,,NN17 1UU,Tel: 01536 266410, - ,,,No ratings yet Rate it yourself - /Services/opticians/LeaveReview/DefaultView.aspx?id=COL/D12514/5PD__000001_NN173HF,0,0,
Tesco Opticians Corby ,CO-1998_240915,OPT,Tesco Extra,Oakley Road,,Corby,Northamptonshire,NN18 8AL,Tel: 07718 545 708, - ,,,No ratings yet Rate it yourself - /Services/opticians/LeaveReview/DefaultView.aspx?id=CO-1998_240915,0,0,yes
Simmons Optometrists,OP_5EH_11709__000001_LE157DH,OPT,,23 Burley Road,,Oakham,Rutland,LE15 6DH,Tel: 01572 756434, - ,,,No ratings yet Rate it yourself - /Services/opticians/LeaveReview/DefaultView.aspx?id=OP_5EH_11709__000001_LE157DH,0,0,
Focus Eye Clinic ,OP_LE156DY_46546,OPT,Focus Eye Clinic,3a Market Street,,"Oakham, Rutland, Leicestershire",,LE15 6DY,Tel: 01572 720072, - ,,,No ratings yet Rate it yourself - /Services/opticians/LeaveReview/DefaultView.aspx?id=OP_LE156DY_46546,0,0,
Selby and Taylor Opticians,OPT_PE166BH_1,OPT,,42 High Street,,Chatteris,,PE16 6BH,, - ,,,No ratings yet Rate it yourself - /Services/opticians/LeaveReview/DefaultView.aspx?id=OPT_PE166BH_1,0,0,
Langrick & Coe Opticians,OP_5EH_12697__000002_LE156AL,OPT,8 Church Street,Oakham,,Rutland,,LE15 6AA,Tel: 01572 724407, - ,,,No ratings yet Rate it yourself - /Services/opticians/LeaveReview/DefaultView.aspx?id=OP_5EH_12697__000002_LE156AL,0,0,
Spectacular Opticians,OP_5JK_1682__000002_PE166EX,OPT,Spectacular Ophthalmic Opticians Contact Lens Practitioners,16 High Street,Chatteris,Cambridgeshire,,PE16 6BG,Tel: 01354 694666, - ,,,No ratings yet Rate it yourself - /Services/opticians/LeaveReview/DefaultView.aspx?id=OP_5JK_1682__000002_PE166EX,0,0,
Greens Opticians,OP_5LV_14726__000001_NN171TW,OPT,"61, Forest Gate Road",Corby,Northamptonshire,,,NN17 1TW,Tel: 01536 204180, - ,,,No ratings yet Rate it yourself - /Services/opticians/LeaveReview/DefaultView.aspx?id=OP_5LV_14726__000001_NN171TW,0,0,
Tesco Opticians,CO-1998__000001_PE282LA,OPT,Abbots Ripton Road,Sapley,Huntingdon,Cambridgeshire,,PE28 2LA,Tel: 01480 277 779, - ,,,No ratings yet Rate it yourself - /Services/opticians/LeaveReview/DefaultView.aspx?id=CO-1998__000001_PE282LA,0,0,
Specsavers,OP_5LV_3219__000001_NN171PB,OPT,21 New Post Office Square,,Corby,,,NN17 1PB,Tel: 01536 401119, - ,,,No ratings yet Rate it yourself - /Services/opticians/LeaveReview/DefaultView.aspx?id=OP_5LV_3219__000001_NN171PB,0,0,
Boots-Corby,OP_5LV_2173__000001_NN171NL,OPT,17 Corporation Street,,,Corby,Northamptonshire,NN17 1NG,Tel: 01536 202 391, - ,,,No ratings yet Rate it yourself - /Services/opticians/LeaveReview/DefaultView.aspx?id=OP_5LV_2173__000001_NN171NL,0,0,
Eye to Eye,OP_5LV_NN171NV__000001_NN171NV,OPT,Unit 2b Spencer Court,Corby Shopping Centre,Corby,Northamptonshire,,NN17 1NU,Tel: 01536 269913, - ,,,No ratings yet Rate it yourself - /Services/opticians/LeaveReview/DefaultView.aspx?id=OP_5LV_NN171NV__000001_NN171NV,0,0,
Vision Express (UK) Ltd,COL/CO-1881/5PD__000001_NN171BH,OPT,Unit 8 Willow Place,Corby,Corby,Northamptonshire,,NN17 1BH,Tel: 01536 400421, - ,,,No ratings yet Rate it yourself - /Services/opticians/LeaveReview/DefaultView.aspx?id=COL/CO-1881/5PD__000001_NN171BH,0,0,
Stradling Opticians,OP_5H9_8187__000001_PE127LW,OPT,12 West End,Holbeach,Spalding,,,PE12 7LW,Tel: 01406 423239, - ,,,No ratings yet Rate it yourself - /Services/opticians/LeaveReview/DefaultView.aspx?id=OP_5H9_8187__000001_PE127LW,0,0,
Holbeach Optical Ltd,0925011216,OPT,,38 High Street,,Holbeach,,PE12 7DY,, - ,,,No ratings yet Rate it yourself - /Services/opticians/LeaveReview/DefaultView.aspx?id=0925011216,0,0,
Tesco Opticians Wisbech,PE14 0RG,OPT,,Cromwell Road,,Wisbech,,PE14 0RG,, - ,,,No ratings yet Rate it yourself - /Services/opticians/LeaveReview/DefaultView.aspx?id=PE14 0RG,0,0,
Healthcall Opticial Services (Chris J Jones Ltd),OP_LE157JH_34423,OPT,,4 Jubilee Drive Langham,,Rutland,,LE15 7JH,Tel: 0800 5677925, - ,,,No ratings yet Rate it yourself - /Services/opticians/LeaveReview/DefaultView.aspx?id=OP_LE157JH_34423,0,0,
Vision Express (UK) Ltd,CO-1881.__000001_PE293NB,OPT,9-11 Chequers Court,Huntingdon,Huntingdon,Cambridgeshire,,PE29 3NB,Tel: 01480 417055, - ,,,No ratings yet Rate it yourself - /Services/opticians/LeaveReview/DefaultView.aspx?id=CO-1881.__000001_PE293NB,0,0,
Specsavers Opticians,OP_5GF_12758__000001_PE293NE,OPT,128 High Street,,Huntingdon,Cambridgshire,,PE29 3NE,Tel: 01480 457800, - ,,,No ratings yet Rate it yourself - /Services/opticians/LeaveReview/DefaultView.aspx?id=OP_5GF_12758__000001_PE293NE,0,0,no
S H Harrold (1937) Ltd,5PP PE29 3PN,OPT,,4 St Benedict's Court,,Huntingdon,Cambridgeshire,PE29 3PN,Tel: 01480 454000, - ,,,No ratings yet Rate it yourself - /Services/opticians/LeaveReview/DefaultView.aspx?id=5PP PE29 3PN,0,0,
Gathercole & Ward Optometrists,5PP PE29 3AQ,OPT,,36 High Street,,Huntingdon,Cambridgeshire,PE29 3AQ,Tel: 01480 453208, - ,,,No ratings yet Rate it yourself - /Services/opticians/LeaveReview/DefaultView.aspx?id=5PP PE29 3AQ,0,0,
Umesh K. Solanki Optometrist,OP_5GF_9606__000001_PE293NF,OPT,Solanki Optometrist,136 High Street,,Huntingdon,Cambridgeshire,PE29 3NF,Tel: 01480412746, - ,,,No ratings yet Rate it yourself - /Services/opticians/LeaveReview/DefaultView.aspx?id=OP_5GF_9606__000001_PE293NF,0,0,
Coakley & Associates Opticians,OP_5JK_1757__000001_PE131EB,OPT,9 York Row,,Wisbech,Cambridgeshire,Cambridgeshire,PE13 1EB,Tel: 01945 583044, - ,,,No ratings yet Rate it yourself - /Services/opticians/LeaveReview/DefaultView.aspx?id=OP_5JK_1757__000001_PE131EB,0,0,
RM  Driver (Opticians) Ltd,OP_5JK_1430__000001_PE131DB,OPT,4 High Street,,Wisbech,Cambridgeshire,,PE13 1DB,Tel: 01945 582096, - ,,,No ratings yet Rate it yourself - /Services/opticians/LeaveReview/DefaultView.aspx?id=OP_5JK_1430__000001_PE131DB,0,0,
Specsavers Opticians,OP_5JK_12278__000001_PE131DT,OPT,9 Market Place,,Wisbech,Cambridgeshire,,PE13 1DT,Tel: 01945 428810, - ,,,No ratings yet Rate it yourself - /Services/opticians/LeaveReview/DefaultView.aspx?id=OP_5JK_12278__000001_PE131DT,0,0,
Boots-Wisbech - The Horsefair,OP_5JK_3026__000002_PE131AR,OPT,15 Horse Fair,,Wisbech,Cambridgeshire,,PE13 1AR,Tel: 01945 584677, - ,,,No ratings yet Rate it yourself - /Services/opticians/LeaveReview/DefaultView.aspx?id=OP_5JK_3026__000002_PE131AR,0,0,
Krog & Whitehead,OP_5LV_8937__000001_NN96HS,OPT,21 High Street,Raunds,Northamptonshire,,,NN9 6HS,Tel: 01933 460035, - ,,,No ratings yet Rate it yourself - /Services/opticians/LeaveReview/DefaultView.aspx?id=OP_5LV_8937__000001_NN96HS,0,0,
Clark Family Eyecare Ltd,OP_PE114ST_46350,OPT,Clark Family Eyecare,20 Market Place,Donington,Spalding,Lincolnshire,PE11 4ST,Tel: 01775 821888, - ,,,No ratings yet Rate it yourself - /Services/opticians/LeaveReview/DefaultView.aspx?id=OP_PE114ST_46350,0,0,yes
Coakley & Associates Opticians (Martin Walters and Partners),OP_5H9_3058__000001_PE129JA,OPT,11 Market Place,Long Sutton,Spalding,",",,PE12 9JA,Tel: 01406 363348, - ,,,No ratings yet Rate it yourself - /Services/opticians/LeaveReview/DefaultView.aspx?id=OP_5H9_3058__000001_PE129JA,0,0,yes
Gathercole & Ward,OP_5GF_9508__000001_PE174BX,OPT,13 The Broadway,,St Ives,Cambridgeshire,,PE27 5BX,Tel: 01480 462433, - ,,,No ratings yet Rate it yourself - /Services/opticians/LeaveReview/DefaultView.aspx?id=OP_5GF_9508__000001_PE174BX,0,0,
Scrivens Ltd,OP_5GF_10150__000001_PE275PA,OPT,1 Crown Place,,St. Ives,St Ives,Cambridgeshire,PE27 5PA,Tel: 01480 301337, - ,,,No ratings yet Rate it yourself - /Services/opticians/LeaveReview/DefaultView.aspx?id=OP_5GF_10150__000001_PE275PA,0,0,
Specsavers St Ives,,OPT,,23 Crown Way,,St Ives,Cambridgeshire,PE27 5AB,Tel: 01480409800, - ,,,N/A - Data not available,,,
Umesh Solanki Optometrist,OP_5GF_12759__000001_PE275PD,OPT,,Umesh K. Solanki Optometrist,Currently trading from Huntingdon branch,St Ives,Cambridgeshire,PE27 5EG,Tel: 01480412746, - ,,,No ratings yet Rate it yourself - /Services/opticians/LeaveReview/DefaultView.aspx?id=OP_5GF_12759__000001_PE275PD,0,0,
S H Harrold (1937) Ltd,OP_5GF_3899__000001_PE275EG,OPT,8 Bridge Street,,,St. Ives,Cambridgeshire,PE27 5EG,Tel: 01480 463655, - ,,,No ratings yet Rate it yourself - /Services/opticians/LeaveReview/DefaultView.aspx?id=OP_5GF_3899__000001_PE275EG,0,0,
Specsavers,OP_5LV_2837__000001_NN168JL,OPT,49 The Mall,Newlands,Kettering,,,NN16 8JL,Tel: 01536 412171, - ,,,No ratings yet Rate it yourself - /Services/opticians/LeaveReview/DefaultView.aspx?id=OP_5LV_2837__000001_NN168JL,0,0,
Stirling Opticians,OP_5LV_6247__000001_NN160BN,OPT,14a Silver Street,16-18 Gold Street,Kettering,Kettering,,NN16 8JB,Tel: 01536 512931, - ,,,No ratings yet Rate it yourself - /Services/opticians/LeaveReview/DefaultView.aspx?id=OP_5LV_6247__000001_NN160BN,0,0,
Boots-Kettering - Gold St,OP_5LV_6061__000003_NN168JB,OPT,35 Gold Street,,,Kettering,Northamptonshire,NN16 8JB,Tel: 01536 482 914, - ,,,No ratings yet Rate it yourself - /Services/opticians/LeaveReview/DefaultView.aspx?id=OP_5LV_6061__000003_NN168JB,0,0,
Dollond & Aitchison,OP_5LV_4632__000001_NN160BL,OPT,1-2 Meeting Lane,,Kettering,,,NN16 0BL,Tel: 01536 519479, - ,,,No ratings yet Rate it yourself - /Services/opticians/LeaveReview/DefaultView.aspx?id=OP_5LV_4632__000001_NN160BL,0,0,
Vision Express,OP_5LV_9672__000001_NN168DP,OPT,Unit 9,Newlands Shopping Centre,Kettering,,,NN16 8DP,Tel: 01536 510642, - ,,,No ratings yet Rate it yourself - /Services/opticians/LeaveReview/DefaultView.aspx?id=OP_5LV_9672__000001_NN168DP,0,0,
Davis Optometrists,OP_5LV_6599__000001_NN168JA,OPT,Moyune House,Crispin Place,,Kettering,Northamptonshire,NN16 8SP,Tel: 01536 512792, - ,,,No ratings yet Rate it yourself - /Services/opticians/LeaveReview/DefaultView.aspx?id=OP_5LV_6599__000001_NN168JA,0,0,
Latimer Opticians,OP_5LV_NN155LA__000002_NN155LA,OPT,Old Coach House,101high Street,Burton Latimer,Northamptonshire,,NN15 5LB,Tel: 01536 724212, - ,,,No ratings yet Rate it yourself - /Services/opticians/LeaveReview/DefaultView.aspx?id=OP_5LV_NN155LA__000002_NN155LA,0,0,
Bellamy Opticians,OP_5LV_14725__000001_NN95TN,OPT,24 High Street,,Irthlingborough,Near Wellingborough,,NN9 5TN,Tel: 01933 653226, - ,,,No ratings yet Rate it yourself - /Services/opticians/LeaveReview/DefaultView.aspx?id=OP_5LV_14725__000001_NN95TN,0,0,
Tesco Opticians Kettering ,CO1998_24092015,OPT,,Carina Road,,Kettering,,NN15 6XB,, - ,,,No ratings yet Rate it yourself - /Services/opticians/LeaveReview/DefaultView.aspx?id=CO1998_24092015,0,0,
Higham Eye Care,OP_5LV_NN98BP__000001_NN98BP,OPT,6 High Street,,Higham Ferrers,Northamptonshire,Northamptonshire,NN10 8BN,Tel: 01933 317000, - ,,,No ratings yet Rate it yourself - /Services/opticians/LeaveReview/DefaultView.aspx?id=OP_5LV_NN98BP__000001_NN98BP,0,0,yes
Desborough Opticians,OP_5LV_10878__000001_NN142RS,OPT,,60 Station Road,,Desborough,Northamptonshire,NN14 2RS,Tel: 01536 763000, - ,,,No ratings yet Rate it yourself - /Services/opticians/LeaveReview/DefaultView.aspx?id=OP_5LV_10878__000001_NN142RS,0,0,
Davis Optometrists,OP_5LV_1198__000001_NN142EW,OPT,4 Bridge Street,,,Rothwell,Northamptonshire,NN14 6EW,Tel: 01536 712384, - ,,,No ratings yet Rate it yourself - /Services/opticians/LeaveReview/DefaultView.aspx?id=OP_5LV_1198__000001_NN142EW,0,0,
Eyes of Swavesey,OP_5JJ_7821__000001_CB45QJ,OPT,,2 Station Road,Swavesey,Cambridge,Cambridgeshire,CB24 4QJ,Tel: 01954 231158, - ,,,No ratings yet Rate it yourself - /Services/opticians/LeaveReview/DefaultView.aspx?id=OP_5JJ_7821__000001_CB45QJ,0,0,
I-Care Opticians,OP_5LV_2360__000001_NN100PQ,OPT,104 High Street,,Rushden,,,NN10 0PQ,Tel: 01933 312632, - ,,,No ratings yet Rate it yourself - /Services/opticians/LeaveReview/DefaultView.aspx?id=OP_5LV_2360__000001_NN100PQ,0,0,
Morris & Kon,OP_5D3_6913__000001_NG316TS,OPT,8 St. Catherines Road,,Grantham,,,NG31 6TS,Tel: 01476 564766, - ,,,No ratings yet Rate it yourself - /Services/opticians/LeaveReview/DefaultView.aspx?id=OP_5D3_6913__000001_NG316TS,0,0,
Clark - Neville,MOB/01-12412/5N8__000001_NG319ZQ,OPT,Home Eyecare,PO Box 2826,,Grantham,Lincolnshire,NG31 9ZQ,Tel: 01476 590353, - ,,,No ratings yet Rate it yourself - /Services/opticians/LeaveReview/DefaultView.aspx?id=MOB/01-12412/5N8__000001_NG319ZQ,0,0,
Neville Clark,OP_5GD_12412__000001_NG319PL,OPT,Home Eyecare,PO Box 2826,,Grantham,Lincolnshire,NG31 9ZQ,Tel: 01476 590353, - ,,,No ratings yet Rate it yourself - /Services/opticians/LeaveReview/DefaultView.aspx?id=OP_5GD_12412__000001_NG319PL,0,0,
Neville Clark,OP_NG319ZQ_46952,OPT,Home Eyecare,PO Box 2826,,Grantham,Lincolnshire,NG31 9ZQ,Tel: 01476 590353, - ,,,No ratings yet Rate it yourself - /Services/opticians/LeaveReview/DefaultView.aspx?id=OP_NG319ZQ_46952,0,0,
Neville Clarke Optometrist,OP_5PA_281010_1__000002_NG319ZQ,OPT,Home Eyecare,PO Box 2826,,Grantham,Lincolnshire,NG31 9ZQ,Tel: 01476 590353, - ,,,No ratings yet Rate it yourself - /Services/opticians/LeaveReview/DefaultView.aspx?id=OP_5PA_281010_1__000002_NG319ZQ,0,0,