Organisation Name,NACS Code,Organisation Type,Address1,Address2,Address3,Address4,Address5,PostCode,Telephone Number,Opening time,Value  (Opening time),Banding Classification  (Opening time),NHS.UK users rating,Value  (NHS.UK users rating),Banding Classification  (NHS.UK users rating),Car parking (Is there car parking at this organisation?)
Pipkin Partnership Optometrists,OP_5AJ_4264__000001_CM59EB,OPT,96 High Street,,Ongar,Essex,,CM5 9EB,Tel: 01277 362192, - ,,,No ratings yet Rate it yourself - /Services/opticians/LeaveReview/DefaultView.aspx?id=OP_5AJ_4264__000001_CM59EB,0,0,
Boatmans Opticians,OP_5PV_01__000003_CM59JJ,OPT,182 High Street,,Ongar,Essex,,CM5 9JJ,Tel: 01277 366665, - ,,,No ratings yet Rate it yourself - /Services/opticians/LeaveReview/DefaultView.aspx?id=OP_5PV_01__000003_CM59JJ,0,0,
Edward Watts Opticians,OP_5GP_10094__000002_CM158RQ,OPT,14 Chelmsford Road,Shenfield,Brentwood,Essex,,CM15 8RQ,Tel: 01277 212978, - ,,,1 rating Rate it yourself - /Services/opticians/LeaveReview/DefaultView.aspx?id=OP_5GP_10094__000002_CM158RQ,,,
Boots-Epping - High St,CM16 4AQ_19173,OPT,,188 Epping High Street,,Epping,Essex,CM16 4AQ,Tel: 01992 571986, - ,,,No ratings yet Rate it yourself - /Services/opticians/LeaveReview/DefaultView.aspx?id=CM16 4AQ_19173,0,0,
Templeman Opticians,OP_5GP_10874__000001_CM144RZ,OPT,131 High Street,,Brentwood,Essex,,CM14 4RZ,Tel: 01277 220932, - ,,,No ratings yet Rate it yourself - /Services/opticians/LeaveReview/DefaultView.aspx?id=OP_5GP_10874__000001_CM144RZ,0,0,
Aves Optometrists,OP_5AJ_8196__000002_CM164BL,OPT,,221 High Street,,Epping,Essex,CM16 4BL,Tel: 01992 572302, - ,,,1 rating Rate it yourself - /Services/opticians/LeaveReview/DefaultView.aspx?id=OP_5AJ_8196__000002_CM164BL,,,
Boots Opticians Ltd,OP_5GP_11983__000002_CM144RH,OPT,15 High Street,,Brentwood,,,CM14 4RH,Tel: 01277 211297, - ,,,No ratings yet Rate it yourself - /Services/opticians/LeaveReview/DefaultView.aspx?id=OP_5GP_11983__000002_CM144RH,0,0,
"Cole, Martin & Tregaskis Optometrists",OP_5GP_9926__000002_CM158AG,OPT,23 Shenfield Road,,,Brentwood,Essex,CM15 8AG,Tel: 01277 211164, - ,,,1 rating Rate it yourself - /Services/opticians/LeaveReview/DefaultView.aspx?id=OP_5GP_9926__000002_CM158AG,,,
Boots-Brentwood - High St,OP_5GP_6329__000001_CM144AJ,OPT,36a High Street,,,Brentwood,Essex,CM14 4AJ,Tel: 01277 211297, - ,,,1 rating Rate it yourself - /Services/opticians/LeaveReview/DefaultView.aspx?id=OP_5GP_6329__000001_CM144AJ,,,
Vision Express,OP-5PY-3491__000003_CM144AB,OPT,26a High Street,,Brentwood,Essex,,CM14 4AB,Tel: 01277 231502, - ,,,No ratings yet Rate it yourself - /Services/opticians/LeaveReview/DefaultView.aspx?id=OP-5PY-3491__000003_CM144AB,0,0,
Specsavers Opticians,OP_5GP_1290__000001_CM144AB,OPT,22 High Street,,Brentwood,,,CM14 4AB,Tel: 01277 200700, - ,,,No ratings yet Rate it yourself - /Services/opticians/LeaveReview/DefaultView.aspx?id=OP_5GP_1290__000001_CM144AB,0,0,
Scrivens Opticians,OP_5GP_7429__000001_CM144BX,OPT,29 Baytree Centre,,Brentwood,Essex,,CM14 4BX,Tel: 0121 456 8700, - ,,,No ratings yet Rate it yourself - /Services/opticians/LeaveReview/DefaultView.aspx?id=OP_5GP_7429__000001_CM144BX,0,0,
Pryor & Clacher,OP_5AJ_1464__000001_CM164BD,OPT,91 High Street,,Epping,Essex,,CM16 4BD,Tel: 01992 575999, - ,,,No ratings yet Rate it yourself - /Services/opticians/LeaveReview/DefaultView.aspx?id=OP_5AJ_1464__000001_CM164BD,0,0,
"Sames, J.P. Opticians",OP_5A4_241__000001_RM38DT,OPT,108 Hilldene Avenue,Harrold Hill,,Romford,Essex,RM3 8DT,Tel: 01708 377777, - ,,,No ratings yet Rate it yourself - /Services/opticians/LeaveReview/DefaultView.aspx?id=OP_5A4_241__000001_RM38DT,0,0,
Boots-Harold Hill,OP_5A4_9574__000002_RM38DX,OPT,16 Farnham Road,,Harold Hill,Romford,Essex,RM3 8DX,Tel: 01708 341 550, - ,,,No ratings yet Rate it yourself - /Services/opticians/LeaveReview/DefaultView.aspx?id=OP_5A4_9574__000002_RM38DX,0,0,
Romford Tesco Opticians,OP_5A4RTO__000002_RM30LL,OPT,Bryant Avenue,,Romford,Essex,,RM3 0LL,Tel: 0345 601 3479, - ,,,No ratings yet Rate it yourself - /Services/opticians/LeaveReview/DefaultView.aspx?id=OP_5A4RTO__000002_RM30LL,0,0,
Eye Clinic,OP_5A4_13775__000001_RM30PH,OPT,11b Oak Road,Harold Wood,,Romford,Essex,RM3 0PH,Tel: 01708 372303, - ,,,1 rating Rate it yourself - /Services/opticians/LeaveReview/DefaultView.aspx?id=OP_5A4_13775__000001_RM30PH,,,
"Debney, K. Opticians",OP_5A4_4835__000002_RM53PR,OPT,16 Chase Cross Road,Collier Row,Romford,,,RM5 3PR,Tel: 01708 737448, - ,,,1 rating Rate it yourself - /Services/opticians/LeaveReview/DefaultView.aspx?id=OP_5A4_4835__000002_RM53PR,,,
A M Fletcher Opticians,CO 3580 - 5A4__000001_RM26ND,OPT,Links Avenue,Gidea Park,,Romford,Essex,RM2 6ND,Tel: 01708 742297, - ,,,No ratings yet Rate it yourself - /Services/opticians/LeaveReview/DefaultView.aspx?id=CO 3580 - 5A4__000001_RM26ND,0,0,
Eye Gee Opticians,OP_5AJ_13310__000003_IG103ST,OPT,66 The Broadway,Debden,,Loughton,,IG10 3ST,Tel: 0208 508 5092, - ,,,No ratings yet Rate it yourself - /Services/opticians/LeaveReview/DefaultView.aspx?id=OP_5AJ_13310__000003_IG103ST,0,0,
FR Loveday Opticians,OP_5DC_1995__000001_CM170DW,OPT,22 High Street,,Old Harlow,Essex,,CM17 0DW,Tel: 01279 415625, - ,,,No ratings yet Rate it yourself - /Services/opticians/LeaveReview/DefaultView.aspx?id=OP_5DC_1995__000001_CM170DW,0,0,
Boots-Harlow - Broadwalk,OP_5DC_1813__000002_CM201JA,OPT,37 Broadwalk,,Harlow,Essex,,CM20 1JA,Tel: 01279 439581, - ,,,No ratings yet Rate it yourself - /Services/opticians/LeaveReview/DefaultView.aspx?id=OP_5DC_1813__000002_CM201JA,0,0,
Vision Express Opticians,OP_5DC_13314__000001_CM201XW,OPT,33a Harvey Shopping Centre,,Harlow,Essex,,CM20 1XW,Tel: 01279 410346, - ,,,No ratings yet Rate it yourself - /Services/opticians/LeaveReview/DefaultView.aspx?id=OP_5DC_13314__000001_CM201XW,0,0,
Rose Optometrists,OP_5DC_8699__000001_CM201XR,OPT,15F The Harvey Centre,,Harlow,Essex,,CM20 1XR,Tel: 01279 443181, - ,,,No ratings yet Rate it yourself - /Services/opticians/LeaveReview/DefaultView.aspx?id=OP_5DC_8699__000001_CM201XR,0,0,
Dollond & Aitchison Proffessional Services 2 Ltd,OP_5DC_1594__000002_CM201HT,OPT,4 The Broadwalk,,Harlow,Essex,,CM20 1HT,Tel: 01279 438851, - ,,,No ratings yet Rate it yourself - /Services/opticians/LeaveReview/DefaultView.aspx?id=OP_5DC_1594__000002_CM201HT,0,0,
Specsavers Ltd,OP_5DC_2746__000001_CM201HP,OPT,,10-12 Broad Walk,Harlow,Essex,,CM20 1HT,Tel: 01279 410888, - ,,,No ratings yet Rate it yourself - /Services/opticians/LeaveReview/DefaultView.aspx?id=OP_5DC_2746__000001_CM201HP,0,0,
Stratton & Stratton Opticians,OP_5GP_8414__000002_CM120UA,OPT,14 The Pantiles,Queens Park Avenue,Billericay,Essex,,CM12 0UA,Tel: 01277 650584, - ,,,3 ratings Rate it yourself - /Services/opticians/LeaveReview/DefaultView.aspx?id=OP_5GP_8414__000002_CM120UA,,,
"Muskett, W. (N. Cox)",OP_5A4_13776__000002_RM11DL,OPT,108 North Street,,Romford,,,RM1 1DL,Tel: 01708 749589, - ,,,No ratings yet Rate it yourself - /Services/opticians/LeaveReview/DefaultView.aspx?id=OP_5A4_13776__000002_RM11DL,0,0,
Vision Express (UK) Ltd,OP_5A4_6734__000001_RM13EE,OPT,"Unit 17, Liberty 2",Mercury Gardens,Romford,,,RM1 3EE,Tel: 01708 731616, - ,,,No ratings yet Rate it yourself - /Services/opticians/LeaveReview/DefaultView.aspx?id=OP_5A4_6734__000001_RM13EE,0,0,
SCRIVENS,OP_5NA45715__000001_IG74DJ,OPT,191 Manford Way,Chigwell,,London,,IG7 4DJ,Tel: 020 8500 2304, - ,,,No ratings yet Rate it yourself - /Services/opticians/LeaveReview/DefaultView.aspx?id=OP_5NA45715__000001_IG74DJ,0,0,
Boots-Romford - The Liberty,OP_5A4_11825__000002_RM13RL,OPT,12 The Liberty,,,Romford,Essex,RM1 3RL,Tel: 01708 725334, - ,,,1 rating Rate it yourself - /Services/opticians/LeaveReview/DefaultView.aspx?id=OP_5A4_11825__000002_RM13RL,,,
"OSAGIE, HENRY",10036__000001_IG103HT,OPT,61 The Lindens,Loughton,Essex,,,IG10 3HT,Tel: 020 8965 6707, - ,,,No ratings yet Rate it yourself - /Services/opticians/LeaveReview/DefaultView.aspx?id=10036__000001_IG103HT,0,0,
Boots-Romford - Stewards Walk,RM1 3RJ_19288,OPT,,16 Stewards Walk,,Romford,Essex,RM1 3RJ,Tel: 01708 741 312, - ,,,No ratings yet Rate it yourself - /Services/opticians/LeaveReview/DefaultView.aspx?id=RM1 3RJ_19288,0,0,
Scher & Ward Opticians,OP_5AJ_2908__000001_IG101BR,OPT,278 High Road,,Loughton,Essex,,IG10 1RB,Tel: 020 8508 5852, - ,,,1 rating Rate it yourself - /Services/opticians/LeaveReview/DefaultView.aspx?id=OP_5AJ_2908__000001_IG101BR,,,
Specsavers,OP_5A4_417__000001_RM11RX,OPT,90 South Street,,Romford,,,RM1 1RX,Tel: 01708 724475, - ,,,No ratings yet Rate it yourself - /Services/opticians/LeaveReview/DefaultView.aspx?id=OP_5A4_417__000001_RM11RX,0,0,
Bird & Fairley,OP_5AJ_3042__000001_IG101AH,OPT,269 High Road,,,Loughton,Essex,IG10 1AH,Tel: 0208 508 4070, - ,,,No ratings yet Rate it yourself - /Services/opticians/LeaveReview/DefaultView.aspx?id=OP_5AJ_3042__000001_IG101AH,0,0,
David Clulow Opticians,NEW WEPCT__000002_IG101AH,OPT,297 High Road,,Loughton,Essex,,IG10 1AH,Tel: 0208 502 5259, - ,,,No ratings yet Rate it yourself - /Services/opticians/LeaveReview/DefaultView.aspx?id=NEW WEPCT__000002_IG101AH,0,0,
EYE CLINIC CHIGWELL LTD, TP2FH,OPT,,173 Manor Road,,Chigwell Essex,,IG7 5QB,, - ,,,No ratings yet Rate it yourself - /Services/opticians/LeaveReview/DefaultView.aspx?id=TP2FH,0,0,
EYE CLINIC CHIGWELL LTD, TP2FH,OPT,The Opticians,173 Manor Road,,Chigwell,Essex,IG7 5QB,Tel: 0208 928 1500, - ,,,No ratings yet Rate it yourself - /Services/opticians/LeaveReview/DefaultView.aspx?id=TP2FH,0,0,
Boots-Loughton,IG10 1AD_19218,OPT,,247 High Road,,Loughton,Essex,IG10 1AD,Tel: 02085 087 497, - ,,,1 rating Rate it yourself - /Services/opticians/LeaveReview/DefaultView.aspx?id=IG10 1AD_19218,,,
Specsavers Opticians,OP_5AJ_14203__000001_IG101AD,OPT,231 High Road,,Loughton,Essex,,IG10 1AD,Tel: 0208 498 6740, - ,,,No ratings yet Rate it yourself - /Services/opticians/LeaveReview/DefaultView.aspx?id=OP_5AJ_14203__000001_IG101AD,0,0,
Maa Eyecare,TP8XN,OPT,Maa Eyecare,121 Avon Road,Cranham,Upminster,Greater London,RM14 1RQ,Tel: 01708 259889, - ,,,No ratings yet Rate it yourself - /Services/opticians/LeaveReview/DefaultView.aspx?id=TP8XN,0,0,yes
Atkinson Opticians Ltd,OP_5AJ_794__000001_IG101DX,OPT,24 Forest Road,,Loughton,,,IG10 1DX,Tel: 0208 508 1325, - ,,,No ratings yet Rate it yourself - /Services/opticians/LeaveReview/DefaultView.aspx?id=OP_5AJ_794__000001_IG101DX,0,0,
Boots-Billericay - High St,OP_5GP_11422__000002_CM129AX,OPT,55 High Street,,,Billericay,Essex,CM12 9AX,Tel: 01277 622414, - ,,,No ratings yet Rate it yourself - /Services/opticians/LeaveReview/DefaultView.aspx?id=OP_5GP_11422__000002_CM129AX,0,0,
Specsavers Opticians,011715__000004_CM129BS,OPT,68 High Street,,,Billericay,Essex,CM12 9BS,Tel: 01277 635610, - ,,,No ratings yet Rate it yourself - /Services/opticians/LeaveReview/DefaultView.aspx?id=011715__000004_CM129BS,0,0,
Aquila Optometrist,OP_5GP_11680__000002_CM129BS,OPT,72 High Street,,Billericay,Essex,,CM12 9BS,Tel: 01277 624916, - ,,,7 ratings Rate it yourself - /Services/opticians/LeaveReview/DefaultView.aspx?id=OP_5GP_11680__000002_CM129BS,,,
"Debney, K. Optician",OP_5A4_999__000001_RM141LD,OPT,219 Front Lane,,Upminster,,,RM14 1LD,Tel: 01708 223116, - ,,,No ratings yet Rate it yourself - /Services/opticians/LeaveReview/DefaultView.aspx?id=OP_5A4_999__000001_RM141LD,0,0,
Boots-Billericay - High St,OP_5GP_6979__000001_CM129DF,OPT,132 High Street,,Billericay,Billericay,Essex,CM12 9DF,Tel: 01277 622522, - ,,,No ratings yet Rate it yourself - /Services/opticians/LeaveReview/DefaultView.aspx?id=OP_5GP_6979__000001_CM129DF,0,0,
The i Practice,OP_5GJ_1225__000001_CM219AX,OPT,47 Knight Street,Sawbridgeworth,Hertfordshire,,,CM21 9AX,Tel: 01279 725332, - ,,,No ratings yet Rate it yourself - /Services/opticians/LeaveReview/DefaultView.aspx?id=OP_5GJ_1225__000001_CM219AX,0,0,
Roy Gill,OP_5A4_13770__000001_RM124U,OPT,96 High Street,Hornchurch,Essex,,,RM12 4UH,Tel: 01708 475623, - ,,,No ratings yet Rate it yourself - /Services/opticians/LeaveReview/DefaultView.aspx?id=OP_5A4_13770__000001_RM124U,0,0,
Gill Eyecare Ltd,01/14123,OPT,,145 High Street,,Honrchurch,Essex,RM11 3YD,Tel: 01708 475623, - ,,,No ratings yet Rate it yourself - /Services/opticians/LeaveReview/DefaultView.aspx?id=01/14123,0,0,yes
Specsavers Ltd,OP_5A4_14774__000002_RM113YD,OPT,139 High Street,Hornchurch,Essex,,,RM11 3YD,Tel: 01708 460170, - ,,,1 rating Rate it yourself - /Services/opticians/LeaveReview/DefaultView.aspx?id=OP_5A4_14774__000002_RM113YD,,,
Boots-Hornchurch - High St,OP_5A4_1321__000001_RM113YD,OPT,127-133 High Street,,,Hornchurch,Essex,RM11 3YD,Tel: 01708 440233, - ,,,No ratings yet Rate it yourself - /Services/opticians/LeaveReview/DefaultView.aspx?id=OP_5A4_1321__000001_RM113YD,0,0,
CHIGWELL MEDICAL CENTRE,20000__000001_IG62TA,OPT,300 Fencepiece Road,Hainault,Essex,,,IG6 2TA,, - ,,,2 ratings Rate it yourself - /Services/opticians/LeaveReview/DefaultView.aspx?id=20000__000001_IG62TA,,,
AVES OPTICIAN (MRS GUPTA),10090__000001_IG62UE,OPT,49 New North Road,Hainult,Essex,,,IG6 2UE,Tel: 020 8502 7000, - ,,,No ratings yet Rate it yourself - /Services/opticians/LeaveReview/DefaultView.aspx?id=10090__000001_IG62UE,0,0,
James Read Opticians Ltd,OP_5A4_14773__000001_RM142S,OPT,36 Station Road,Upminster,,Essex,,RM14 2TR,Tel: 01708 221086, - ,,,No ratings yet Rate it yourself - /Services/opticians/LeaveReview/DefaultView.aspx?id=OP_5A4_14773__000001_RM142S,0,0,
"Bahri, P.K.",OP_5A4_8118__000001_RM143BT,OPT,172 St. Marys Lane,,Upminster,,,RM14 3BT,Tel: 01708 228397, - ,,,No ratings yet Rate it yourself - /Services/opticians/LeaveReview/DefaultView.aspx?id=OP_5A4_8118__000001_RM143BT,0,0,
J H PETERS,OP_5NA45707__000001_RM66LU,OPT,192 High Road,Romford,Essex,,,RM6 6LU,Tel: 020 8590 7590, - ,,,No ratings yet Rate it yourself - /Services/opticians/LeaveReview/DefaultView.aspx?id=OP_5NA45707__000001_RM66LU,0,0,
Boots-Upminster,OP_5A4_4931__000001_RM142AP,OPT,7 Corbets Tey Road,,,Upminster,Essex,RM14 2AP,Tel: 01708 222 383, - ,,,No ratings yet Rate it yourself - /Services/opticians/LeaveReview/DefaultView.aspx?id=OP_5A4_4931__000001_RM142AP,0,0,
Aves Opticians,OP_5A4_7090__000002_RM126LL,OPT,211 Station Lane,,Hornchurch,,,RM12 6LL,Tel: 01708 452295, - ,,,No ratings yet Rate it yourself - /Services/opticians/LeaveReview/DefaultView.aspx?id=OP_5A4_7090__000002_RM126LL,0,0,
Queens Road Opticians,OP_5AJ_5829__000001_IG95BU,OPT,55 Queens Road,,Buckhurst Hill,Essex,,IG9 5BU,Tel: 020 8504 5175, - ,,,2 ratings Rate it yourself - /Services/opticians/LeaveReview/DefaultView.aspx?id=OP_5AJ_5829__000001_IG95BU,,,
Peters J H,OP_52C__000001_RM64LU,OPT,192 High Road,Chadwell Heath,Dagenham,Essex,,RM6 4LU,, - ,,,No ratings yet Rate it yourself - /Services/opticians/LeaveReview/DefaultView.aspx?id=OP_52C__000001_RM64LU,0,0,
Dawsons Opticians (R Stewart),OP_5C2_7675__000001_RM64BE,OPT,1 Station Road,Chadwell Heath,Romford,,,RM6 4BE,Tel: 020 8590 1748, - ,,,No ratings yet Rate it yourself - /Services/opticians/LeaveReview/DefaultView.aspx?id=OP_5C2_7675__000001_RM64BE,0,0,
J I PARTRIDGE,OP_5NA45708__000001_RM64AD,OPT,1106 High Road,Chadwell Heath,London,,,RM6 4AD,Tel: 020 8590 1762, - ,,,No ratings yet Rate it yourself - /Services/opticians/LeaveReview/DefaultView.aspx?id=OP_5NA45708__000001_RM64AD,0,0,
Healthcall Optical Services,OP_5EK_14984__000005_S92EH,OPT,County Square,100 New London Road,Chelmsford,Essex,,CM2 0RG,Tel: 01245 261811, - ,,,No ratings yet Rate it yourself - /Services/opticians/LeaveReview/DefaultView.aspx?id=OP_5EK_14984__000005_S92EH,0,0,
Boots-Barkingside - High St,OP_5NA45695__000001_IG62DR,OPT,90 High Street,Barkingside,London,London,Essex,IG6 2DR,Tel: 0208 550 2920, - ,,,No ratings yet Rate it yourself - /Services/opticians/LeaveReview/DefaultView.aspx?id=OP_5NA45695__000001_IG62DR,0,0,
Boatmans Optical,OP_5JN_3705__000001_CM20LD,OPT,175 Moulsham Street,,Chelmsford,Essex,,CM2 0LD,Tel: 01245 264659, - ,,,No ratings yet Rate it yourself - /Services/opticians/LeaveReview/DefaultView.aspx?id=OP_5JN_3705__000001_CM20LD,0,0,
Broomfield Opticians,OP_5JN_9929__000001_CM11SW,OPT,24 Broomfield Road,,Chelmsford,Essex,,CM1 1SW,Tel: 01245 352803, - ,,,No ratings yet Rate it yourself - /Services/opticians/LeaveReview/DefaultView.aspx?id=OP_5JN_9929__000001_CM11SW,0,0,
Opticial Express,OPT_CM11LN_1,OPT,,"Ground Floor, Marlborough House",,Chelmsford,,CM1 1LN,, - ,,,No ratings yet Rate it yourself - /Services/opticians/LeaveReview/DefaultView.aspx?id=OPT_CM11LN_1,0,0,
Opticial Express,OP_12345_CM1 1LN,OPT,"Ground Floor, Marlborough House",Victoria Road South,,Chelmsford,Essex,CM1 1LN,Tel: 0800 023 2020, - ,,,No ratings yet Rate it yourself - /Services/opticians/LeaveReview/DefaultView.aspx?id=OP_12345_CM1 1LN,0,0,
SPECSAVERS,50000__000004_IG62AD,OPT,45 High Street,Barkingside,Essex,,,IG6 2AD,Tel: 0208 418 2480, - ,,,66 ratings Rate it yourself - /Services/opticians/LeaveReview/DefaultView.aspx?id=50000__000004_IG62AD,,,
HD Jameson & Associates,OP_5AJ_13309__000001_IG96LN,OPT,46 Station Way,,Buckhurst Hill,Essex,,IG9 6LN,Tel: 0208 504 4830, - ,,,No ratings yet Rate it yourself - /Services/opticians/LeaveReview/DefaultView.aspx?id=OP_5AJ_13309__000001_IG96LN,0,0,
Vision Express Opticians,OP_5JN_13317__000001_CM11XR,OPT,Unit 5 High Chelmer Shopping Ctr,,Chelmsford,Essex,,CM1 1XR,Tel: 01245 251313, - ,,,No ratings yet Rate it yourself - /Services/opticians/LeaveReview/DefaultView.aspx?id=OP_5JN_13317__000001_CM11XR,0,0,
GoldsmithWebb,OP_5JN_11793__000001_CM11LU,OPT,19 Market Road,,Chelmsford,Essex,,CM1 1LU,Tel: 01245 260555, - ,,,No ratings yet Rate it yourself - /Services/opticians/LeaveReview/DefaultView.aspx?id=OP_5JN_11793__000001_CM11LU,0,0,
Boots-Barkingside - High St,OP_5NA45687__000001_IG62DF,OPT,10 High Street,Barkingside,London,London,Essex,IG6 2DF,Tel: 020 8550 7740, - ,,,No ratings yet Rate it yourself - /Services/opticians/LeaveReview/DefaultView.aspx?id=OP_5NA45687__000001_IG62DF,0,0,
ELLIS BASS OPTOMETRISTS,5NA_0121__000001_IG62AA,OPT,"Unit 4c, 3-19 High Street",Barkingside,Ilford,Essex,,IG6 2AA,Tel: 020 8550 9288, - ,,,1 rating Rate it yourself - /Services/opticians/LeaveReview/DefaultView.aspx?id=5NA_0121__000001_IG62AA,,,
Boots-Chelmsford - High Chelmer,OP_5JN_13300__000001_CM11XG,OPT,"Unit 2b, High Chelmer East",,,Chelmsford,Essex,CM1 1XG,Tel: 01245 354027, - ,,,4 ratings Rate it yourself - /Services/opticians/LeaveReview/DefaultView.aspx?id=OP_5JN_13300__000001_CM11XG,,,
Eye Clinic,OP_5A4_13123__000001_RM124RN,OPT,35 The Broadway,Elm Park,,Hornchurch,Essex,RM12 4RN,Tel: 01708 447012, - ,,,1 rating Rate it yourself - /Services/opticians/LeaveReview/DefaultView.aspx?id=OP_5A4_13123__000001_RM124RN,,,
Blink Opticians,OP_5PX_11885__000001_CM20SW,OPT,22 New London Road,High Chelmer Shopping Centre,Chelmsford,Essex,,CM2 0SW,Tel: 01245 347666, - ,,,No ratings yet Rate it yourself - /Services/opticians/LeaveReview/DefaultView.aspx?id=OP_5PX_11885__000001_CM20SW,0,0,
JAMES SCOTT OPTICIANS LTD,OP_5NA45709__000001_IG88AJ,OPT,637a Chigwell Road,Woodford Bridge,London,,,IG8 8AJ,Tel: 020 8504 3292, - ,,,No ratings yet Rate it yourself - /Services/opticians/LeaveReview/DefaultView.aspx?id=OP_5NA45709__000001_IG88AJ,0,0,
Specsavers Opticians,OP_5JN_2616__000001_CM11DX,OPT,92-93 High Street,,,Chelmsford,,CM1 1DX,Tel: 01245 600000, - ,,,No ratings yet Rate it yourself - /Services/opticians/LeaveReview/DefaultView.aspx?id=OP_5JN_2616__000001_CM11DX,0,0,
Boots-Chelmsford - High St,OP_5JN_167__000001_CM11DH,OPT,60 High Street,,,Chelmsford,Essex,CM1 1DH,Tel: 01245 353 654, - ,,,1 rating Rate it yourself - /Services/opticians/LeaveReview/DefaultView.aspx?id=OP_5JN_167__000001_CM11DH,,,
J Bryan Opticians Ltd,OP_5JN_12108__000002_CM26FD,OPT,,33 The Meadows Shopping Centre,,Chelmsford,Essex,CM2 6FD,Tel: 01245 357766, - ,,,No ratings yet Rate it yourself - /Services/opticians/LeaveReview/DefaultView.aspx?id=OP_5JN_12108__000002_CM26FD,0,0,
Nasir Opticians,OP_5C2_13777__000001_RM109R,OPT,2-3 Station Parade,Elm Park,,Hornchurch,Essex,RM12 5AB,Tel: 020 8593 0328, - ,,,No ratings yet Rate it yourself - /Services/opticians/LeaveReview/DefaultView.aspx?id=OP_5C2_13777__000001_RM109R,0,0,
Optical Express,CM26JE_12356,OPT,,31 Springfield Road,,Chelmsford,,CM2 6JE,Tel: 0800 0232020, - ,,,No ratings yet Rate it yourself - /Services/opticians/LeaveReview/DefaultView.aspx?id=CM26JE_12356,0,0,
Sun Street Opticians,1909161410,OPT,,54 Sun Street,,Waltham Abbey,Herefordshire,EN9 1EJ,Tel: 01992 669669, - ,,,2 ratings Rate it yourself - /Services/opticians/LeaveReview/DefaultView.aspx?id=1909161410,,,
OPT A VISION,OP_5NA45713__000005_RM81XU,OPT,14 Rowallen Parade,Dagenham,London,,,RM8 1XU,Tel: 020 8590 1333, - ,,,No ratings yet Rate it yourself - /Services/opticians/LeaveReview/DefaultView.aspx?id=OP_5NA45713__000005_RM81XU,0,0,
Shiva Optician Ltd,TP4CT,OPT,,433 Becontree Avenue,,Dagenham,,RM8 3UH,, - ,,,No ratings yet Rate it yourself - /Services/opticians/LeaveReview/DefaultView.aspx?id=TP4CT,0,0,
RAJ OPTICIANS ,OP_5NA45714__000001_IG39UR,OPT,1 RAVENINGS PARADE,39 GOODMAYES ROAD,GOODMAYES,ILFORD,Essex,IG3 9NR,Tel: 0208 590 2739, - ,,,No ratings yet Rate it yourself - /Services/opticians/LeaveReview/DefaultView.aspx?id=OP_5NA45714__000001_IG39UR,0,0,
Scher and Lasky Opticians,10080__000005_IG87QF,OPT,4 Jubilee Parade,Snakes Lane East,Woodford Green,Essex,,IG8 7QF,Tel: 020 8504 9243, - ,,,No ratings yet Rate it yourself - /Services/opticians/LeaveReview/DefaultView.aspx?id=10080__000005_IG87QF,0,0,
Care Optics,01-15072-1,OPT,,14 The Broadway,,London,,IG8 0HL,, - ,,,1 rating Rate it yourself - /Services/opticians/LeaveReview/DefaultView.aspx?id=01-15072-1,,,yes
Home Eye Care (DOM),5LA_OPT_17__000007_IG38RG,OPT,627d  Southend Road,Ilford,Essex,,,IG3 8RG,Tel: 0208 590 6666, - ,,,No ratings yet Rate it yourself - /Services/opticians/LeaveReview/DefaultView.aspx?id=5LA_OPT_17__000007_IG38RG,0,0,
Broomfield Refraction Clinic,OP_5JN_13368__000001_CM29BG,OPT,Court Road,Broomfield,,Chelmsford,Essex,CM1 5ET,Tel: 01245 440761, - ,,,No ratings yet Rate it yourself - /Services/opticians/LeaveReview/DefaultView.aspx?id=OP_5JN_13368__000001_CM29BG,0,0,
EYE GEE LTD,OP_5NA45700__000002_IG38RA,OPT,651 High Street,Seven Kings,London,,,IG3 8RA,Tel: 0208 599 0033, - ,,,No ratings yet Rate it yourself - /Services/opticians/LeaveReview/DefaultView.aspx?id=OP_5NA45700__000002_IG38RA,0,0,
Orthoptic Department,OP_5JN_U/K__000002_CM29BG,OPT,West Wing 2,Broomfield Hospital,Court Road,Chelmsford,Essex,CM1 7ET,Tel: 01245 514500, - ,,,1 rating Rate it yourself - /Services/opticians/LeaveReview/DefaultView.aspx?id=OP_5JN_U/K__000002_CM29BG,,,
Downes Eyecare,5NA 6080,OPT,,608 High Road,Seven Kings,Ilford,Essex,IG3 8RF,Tel: 020 8590 2710, - ,,,3 ratings Rate it yourself - /Services/opticians/LeaveReview/DefaultView.aspx?id=5NA 6080,,,
HOWARD HARRIS,OP_5NA45706__000001_IG26LE,OPT,474 Cranbrook Road,Gants Hill,Ilford,Essex,,IG2 6LE,Tel: 020 8518 3666, - ,,,2 ratings Rate it yourself - /Services/opticians/LeaveReview/DefaultView.aspx?id=OP_5NA45706__000001_IG26LE,,,
MOBELEYES LTD,30000__000002_IG26LE,OPT,747 Cranbrook Road,Gants Hill,Essex,,,IG2 6LE,Tel: 0208 518 3769, - ,,,No ratings yet Rate it yourself - /Services/opticians/LeaveReview/DefaultView.aspx?id=30000__000002_IG26LE,0,0,
ROSE OPTICAL SERVICE,10079__000004_IG26JU,OPT,48/50 Wayside Mews,,Ilford,,,IG2 6JU,Tel: 020 8551 7512, - ,,,No ratings yet Rate it yourself - /Services/opticians/LeaveReview/DefaultView.aspx?id=10079__000004_IG26JU,0,0,
ROSE OPTOMETRISTS,OP_5NA45716__000010_IG26JZ,OPT,583 Cranbrook Road,Gants Hill,London,,,IG2 6JZ,Tel: 020 8551 5353, - ,,,No ratings yet Rate it yourself - /Services/opticians/LeaveReview/DefaultView.aspx?id=OP_5NA45716__000010_IG26JZ,0,0,