Organisation Name,NACS Code,Organisation Type,Address1,Address2,Address3,Address4,Address5,PostCode,Telephone Number,Opening time,Value  (Opening time),Banding Classification  (Opening time),NHS.UK users rating,Value  (NHS.UK users rating),Banding Classification  (NHS.UK users rating),Car parking (Is there car parking at this organisation?)
Vision Express ,OP_5CD_7572__000001_DT101AW,OPT,2 Retsel House,Bridge Street,Sturminster Newton,,,DT10 1AW,Tel: 01258 472291, - ,,,No ratings yet Rate it yourself - /Services/opticians/LeaveReview/DefaultView.aspx?id=OP_5CD_7572__000001_DT101AW,0,0,
Grace Haine Eyecare Ltd,OP_DT102LZ_34883,OPT,,1 Skye House,Ring Street,STALBRIDGE,Dorset,DT10 2LZ,Tel: 01963 362775, - ,,,No ratings yet Rate it yourself - /Services/opticians/LeaveReview/DefaultView.aspx?id=OP_DT102LZ_34883,0,0,yes
Robert Frith Opticians (Wessex) Ltd,OP_5CD_12558__000001_SP78AR,OPT,Wesley House,12 Bell Street,,SHAFTESBURY,Dorset,SP7 8AR,Tel: 01747 854761, - ,,,No ratings yet Rate it yourself - /Services/opticians/LeaveReview/DefaultView.aspx?id=OP_5CD_12558__000001_SP78AR,0,0,
S H Harrold (1937) Ltd,CO-2389__000001_SP78JE,OPT,,49 High Street,,SHAFTESBURY,Dorset,SP7 8JE,Tel: 01747 853553, - ,,,No ratings yet Rate it yourself - /Services/opticians/LeaveReview/DefaultView.aspx?id=CO-2389__000001_SP78JE,0,0,
EyeStyle Centre Opticians Ltd,OP_5CD_50__000001_SP78AA,OPT,56 High Street,,Shaftesbury,Shaftesbury,,SP7 8AA,Tel: 01747 851006, - ,,,No ratings yet Rate it yourself - /Services/opticians/LeaveReview/DefaultView.aspx?id=OP_5CD_50__000001_SP78AA,0,0,
Robert Frith Opticians Ltd,OP_5CD_13759__000001_SP84AA,OPT,Fairfield House,36 High Street,,GILLINGHAM,Dorset,SP8 4AA,Tel: 01747 825122, - ,,,No ratings yet Rate it yourself - /Services/opticians/LeaveReview/DefaultView.aspx?id=OP_5CD_13759__000001_SP84AA,0,0,
Robert Frith Opticians (Blandford) Ltd.,OP_5CD_2016__000001_DT117AH,OPT,,3 Market Place,,BLANDFORD FORUM,Dorset,DT11 7AH,Tel: 01258 452207, - ,,,No ratings yet Rate it yourself - /Services/opticians/LeaveReview/DefaultView.aspx?id=OP_5CD_2016__000001_DT117AH,0,0,
Scrivens Ltd,OP_5CD_2939__000001_DT117PY,OPT,,9 Market Place,,Blandford Forum,Dorset,DT11 7AF,Tel: 01258 452443, - ,,,No ratings yet Rate it yourself - /Services/opticians/LeaveReview/DefaultView.aspx?id=OP_5CD_2939__000001_DT117PY,0,0,
S H Harrold (1937) Ltd,OP_5CD_4949__000002_DT117DX,OPT,,61 East Street,,BLANDFORD FORUM,Dorset,DT11 7DX,Tel: 01258 458476, - ,,,No ratings yet Rate it yourself - /Services/opticians/LeaveReview/DefaultView.aspx?id=OP_5CD_4949__000002_DT117DX,0,0,
Specsavers,CO-5497,OPT,,44-48 East Street,,Blandford Forum,,DT11 7DR,, - ,,,No ratings yet Rate it yourself - /Services/opticians/LeaveReview/DefaultView.aspx?id=CO-5497,0,0,
L & M Wincanton Limited,OPT_BA99LA_2,OPT,,16 Market Place,,Wincanton,,BA9 9LA,, - ,,,No ratings yet Rate it yourself - /Services/opticians/LeaveReview/DefaultView.aspx?id=OPT_BA99LA_2,0,0,
L & M Wincanton Limited,OPT_BA99LA_1,OPT,,16 Market Place,,Wincanton,,BA9 9LA,, - ,,,No ratings yet Rate it yourself - /Services/opticians/LeaveReview/DefaultView.aspx?id=OPT_BA99LA_1,0,0,
Sarah Gibson Optometrist ,OP_5K1_6438__000001_BA99LP,OPT,Commerce House,Market Place,,Wincanton,Somerset,BA9 9LP,Tel: 01963 34333, - ,,,No ratings yet Rate it yourself - /Services/opticians/LeaveReview/DefaultView.aspx?id=OP_5K1_6438__000001_BA99LP,0,0,
Vision Express UK Ltd,OP_5CD_2784__000001_DT93AX,OPT,57 Cheap Street,,Sherborne,,,DT9 3AX,Tel: 01935 812105, - ,,,No ratings yet Rate it yourself - /Services/opticians/LeaveReview/DefaultView.aspx?id=OP_5CD_2784__000001_DT93AX,0,0,
Matthews Opticians - Sherborne,OP_5CD_2683__000001_DT93NL,OPT,1 Tilton Court,Digby Road,,SHERBORNE,Dorset,DT9 3NL,Tel: 01935 813355, - ,,,No ratings yet Rate it yourself - /Services/opticians/LeaveReview/DefaultView.aspx?id=OP_5CD_2683__000001_DT93NL,0,0,
Scrivens Ltd,OP_5CD_7192__000001_DT93BJ,OPT,44 Cheap Street,,,Sherbourne,Dorset,DT9 3PX,Tel: 01935 812971, - ,,,No ratings yet Rate it yourself - /Services/opticians/LeaveReview/DefaultView.aspx?id=OP_5CD_7192__000001_DT93BJ,0,0,
Home Care Community Opticians (J2NA Ltd),00281__000002_DT93RQ,OPT,Old Yarn Business Centre,Westbury,Sherborne,Dorset,,DT9 3RQ,Tel: 01935 813800, - ,,,No ratings yet Rate it yourself - /Services/opticians/LeaveReview/DefaultView.aspx?id=00281__000002_DT93RQ,0,0,
Robert Frith Optometrists,OP_5K1_1670__000002_BA77BG,OPT,Fore Street,Castle Cary,Somerset,Somerset,,BA7 7BG,Tel: 01963 351948, - ,,,No ratings yet Rate it yourself - /Services/opticians/LeaveReview/DefaultView.aspx?id=OP_5K1_1670__000002_BA77BG,0,0,
Optique 2000 Ltd,OP_5FN_6873__000001_BH211JN,OPT,7a West Street,,,WIMBORNE,Dorset,BH21 1JN,Tel: 01202 848808, - ,,,No ratings yet Rate it yourself - /Services/opticians/LeaveReview/DefaultView.aspx?id=OP_5FN_6873__000001_BH211JN,0,0,
Scrivens Ltd,OP_5FN_5544__000001_BH211HT,OPT,1 High Street,,,Wimborne,Dorset,BH21 1HR,Tel: 01202 883827, - ,,,No ratings yet Rate it yourself - /Services/opticians/LeaveReview/DefaultView.aspx?id=OP_5FN_5544__000001_BH211HT,0,0,
Peter Bowen Thomas Ltd,OP_5FN_8398__000001_BH211DX,OPT,43 East Street,,Wimborne,,,BH21 1DX,Tel: 01202 889131, - ,,,No ratings yet Rate it yourself - /Services/opticians/LeaveReview/DefaultView.aspx?id=OP_5FN_8398__000001_BH211DX,0,0,
Vision Express (UK) Ltd,OP_5K1_12679__000002_BA201LX,OPT,44-46 Middle Street,Yeovil,Somerset,,,BA20 1LX,Tel: 01935 472044, - ,,,No ratings yet Rate it yourself - /Services/opticians/LeaveReview/DefaultView.aspx?id=OP_5K1_12679__000002_BA201LX,0,0,
Specsavers Opticians,OP_5K1_38__000001_BA201LX,OPT,50-52 Middle Street,Yeovil,,Somerset,,BA20 1LX,Tel: 01935 410040, - ,,,No ratings yet Rate it yourself - /Services/opticians/LeaveReview/DefaultView.aspx?id=OP_5K1_38__000001_BA201LX,0,0,
Dollond & Aitchison,OP_5K1_113__000002_BA201LG,OPT,39-41 Middle Street,Yeovil,Somerset,,,BA20 1LG,Tel: 01935 423490, - ,,,No ratings yet Rate it yourself - /Services/opticians/LeaveReview/DefaultView.aspx?id=OP_5K1_113__000002_BA201LG,0,0,
Boots-Yeovil - Middle St,OP_5K1_2550__000003_BA201LG,OPT,,39-41 Middle Street,,Yeovil,Somerset,BA20 1LG,Tel: 01935 423 490, - ,,,No ratings yet Rate it yourself - /Services/opticians/LeaveReview/DefaultView.aspx?id=OP_5K1_2550__000003_BA201LG,0,0,
Robert Frith Optometrists Yeovil,OP_5K1_3238__000001_BA201EQ,OPT,Ryburn House,28 Princes Street,,Yeovil,Somerset,BA20 1EQ,Tel: 01935 474333, - ,,,No ratings yet Rate it yourself - /Services/opticians/LeaveReview/DefaultView.aspx?id=OP_5K1_3238__000001_BA201EQ,0,0,
Care Opticians,SP10 3DG,OPT,,6 Heath Close,,Wimborne,Dorset,BH21 2LP,Tel: 01202 889472, - ,,,No ratings yet Rate it yourself - /Services/opticians/LeaveReview/DefaultView.aspx?id=SP10 3DG,0,0,
Tesco Opticians,OP_5QL-126__000002_BA201DL,OPT,Queensway Place,Huish,Yeovil,Somerset,,BA20 1DL,Tel: 01935 647438, - ,,,No ratings yet Rate it yourself - /Services/opticians/LeaveReview/DefaultView.aspx?id=OP_5QL-126__000002_BA201DL,0,0,
Scrivens Ltd,OP_5KV_6309__000003_BH188DP,OPT,,169-171 The Broadway,,Broadstone,Dorset,BH18 8DS,Tel: 01202 692859, - ,,,No ratings yet Rate it yourself - /Services/opticians/LeaveReview/DefaultView.aspx?id=OP_5KV_6309__000003_BH188DP,0,0,
S H Harrold (1937) Ltd,OP_5KV_6757__000001_BH151SY,OPT,184c Lower Blandford Road,,Broadstone,Dorset,,BH18 8DP,Tel: 01202 672878, - ,,,No ratings yet Rate it yourself - /Services/opticians/LeaveReview/DefaultView.aspx?id=OP_5KV_6757__000001_BH151SY,0,0,
I J Brown Partnership,OP_5FP_6510__000001_DT11UY,OPT,,63 High West Street,,DORCHESTER,Dorset,DT1 1UY,Tel: 01305 264922, - ,,,No ratings yet Rate it yourself - /Services/opticians/LeaveReview/DefaultView.aspx?id=OP_5FP_6510__000001_DT11UY,0,0,
Boots Opticians,CO-3673,OPT,,16 Cornhill,,Dorset,,DT1 1BQ,Tel: 01305 251573, - ,,,No ratings yet Rate it yourself - /Services/opticians/LeaveReview/DefaultView.aspx?id=CO-3673,0,0,
Insight ,OP_5FP_8741__000001_DT11BN,OPT,9 Tudor Arcade,South Street,,DORCHESTER,Dorset,DT1 1BN,Tel: 01305 260753, - ,,,No ratings yet Rate it yourself - /Services/opticians/LeaveReview/DefaultView.aspx?id=OP_5FP_8741__000001_DT11BN,0,0,
Sproston & Bowden Opticians Ltd,OP_5FP_7270__000001_DT11UW,OPT,23 High West Street,,Dorchester,,,DT1 1UW,Tel: 01305 264557, - ,,,No ratings yet Rate it yourself - /Services/opticians/LeaveReview/DefaultView.aspx?id=OP_5FP_7270__000001_DT11UW,0,0,
Specsavers (Dorchester Vision Plus Ltd),CO 1795__000002_DT11BS,OPT,20 South Street,,Dorchester,Dorset,,DT1 1BS,Tel: 01305 216910, - ,,,No ratings yet Rate it yourself - /Services/opticians/LeaveReview/DefaultView.aspx?id=CO 1795__000002_DT11BS,0,0,
Scrivens Ltd,OP_5FP_11251__000001_DT11BY,OPT,,41 South Street,,Dorchester,Dorset,DT1 1TW,Tel: 01305 264966, - ,,,No ratings yet Rate it yourself - /Services/opticians/LeaveReview/DefaultView.aspx?id=OP_5FP_11251__000001_DT11BY,0,0,
Andrew Care Opticians,OP_5FP_14132__000002_DT11DE,OPT,,6 South Terrace,,DORCHESTER,Dorset,DT1 1DE,Tel: 01305 262225, - ,,,No ratings yet Rate it yourself - /Services/opticians/LeaveReview/DefaultView.aspx?id=OP_5FP_14132__000002_DT11DE,0,0,
Peacock & Murphy,OP_5FN_5847__000001_BH216DR,OPT,27b Vicarage Road,,Verwood,Dorset,,BH31 6DR,Tel: 01202 825448, - ,,,No ratings yet Rate it yourself - /Services/opticians/LeaveReview/DefaultView.aspx?id=OP_5FN_5847__000001_BH216DR,0,0,
Specsavers Home Visits,00025__000001_BH217SH,OPT,Unit 4a Arena Business Centre,9 Nimrod Way,Ferndown,Dorset,,BH21 7SH,Tel: 01202 862385, - ,,,No ratings yet Rate it yourself - /Services/opticians/LeaveReview/DefaultView.aspx?id=00025__000001_BH217SH,0,0,
Robert Frith Opticians Ltd,,OPT,,31 Crown Street West,,Poundbury,Dorset,DT1 3FQ,Tel: 01305 264 922, - ,,,N/A - Data not available,,,
EyeStyle Centre Opticians Ltd,TP7HJ,OPT,,141-143 Station Road,,Dorset,,BH22 0HT,, - ,,,No ratings yet Rate it yourself - /Services/opticians/LeaveReview/DefaultView.aspx?id=TP7HJ,0,0,
Christine Webster Opticians Ltd,OP_5FN_1098__000001_BH204AF,OPT,Victoria House,10a North Street,Wareham,Dorset,,BH20 4AF,Tel: 01929 556062, - ,,,No ratings yet Rate it yourself - /Services/opticians/LeaveReview/DefaultView.aspx?id=OP_5FN_1098__000001_BH204AF,0,0,
Haine & Smith Opticians,OP_5DH_11016__000001_BA129AN,OPT,,10 Market Place,,Warminster,Wiltshire,BA12 9AN,Tel: 01985 212034, - ,,,No ratings yet Rate it yourself - /Services/opticians/LeaveReview/DefaultView.aspx?id=OP_5DH_11016__000001_BA129AN,0,0,
Boots Opticians Warminster,240417135350,OPT,,51 Market Place,,Warminster,,BA12 9AZ,, - ,,,No ratings yet Rate it yourself - /Services/opticians/LeaveReview/DefaultView.aspx?id=240417135350,0,0,
Specsavers Opticians,OP_5DH_645__000005_BA129AY,OPT,Unit 2,1 Market Place,Warminster,Wiltshire,,BA12 9AY,Tel: 01985 219 016, - ,,,No ratings yet Rate it yourself - /Services/opticians/LeaveReview/DefaultView.aspx?id=OP_5DH_645__000005_BA129AY,0,0,
Batemans (Opticians) Ltd,OP_5DH_82__000001_BA129AY,OPT,21 Market Place,,,Warminster,Wiltshire,BA12 9AY,Tel: 01985 213347, - ,,,No ratings yet Rate it yourself - /Services/opticians/LeaveReview/DefaultView.aspx?id=OP_5DH_82__000001_BA129AY,0,0,
Still & Bedford,E0E1C,OPT,,61 Victoria Road,Ferndown,Bournemouth,Dorset,BH22 9HU,Tel: 01202 891727, - ,,,No ratings yet Rate it yourself - /Services/opticians/LeaveReview/DefaultView.aspx?id=E0E1C,0,0,
Knight Eyecare,,OPT,,61 Victoria Road,,Ferndown,Dorset,BH22 9HU,Tel: 01202 891 727, - ,,,N/A - Data not available,,,
Underwood Eyecare,OP_5FN_4238__000002_BH229TH,OPT,Underwood Eyecare,7 Pennys Walk,,Ferndown,Dorset,BH22 9TH,Tel: 01202 891955, - ,,,No ratings yet Rate it yourself - /Services/opticians/LeaveReview/DefaultView.aspx?id=OP_5FN_4238__000002_BH229TH,0,0,
Henderson's,OP_5FN_13758__000001_BH229HZ,OPT,54 Victoria Road,,Ferndown,Dorset,,BH22 9HZ,Tel: 01202 871711, - ,,,No ratings yet Rate it yourself - /Services/opticians/LeaveReview/DefaultView.aspx?id=OP_5FN_13758__000001_BH229HZ,0,0,
Tesco Stores Ltd,OL-CO1998-5QN__000002_BH124NX,OPT,Yarrow Road,Mannings Heath,Poole,Dorset,,BH12 4NX,Tel: 01202 457438, - ,,,No ratings yet Rate it yourself - /Services/opticians/LeaveReview/DefaultView.aspx?id=OL-CO1998-5QN__000002_BH124NX,0,0,
Asda Stores Ltd.,CO-2058__000001_BH151JQ,OPT,West Quay Road,,Poole,Dorset,,BH15 1JQ,Tel: 01202 207020, - ,,,No ratings yet Rate it yourself - /Services/opticians/LeaveReview/DefaultView.aspx?id=CO-2058__000001_BH151JQ,0,0,
Boots-Poole - Dolphin Centre,OP_5KV_538__000002_BH151SX,OPT,"190-196 High Street, Dolphin Centre",,,Poole,Dorset,BH15 1SX,Tel: 01202 679395, - ,,,No ratings yet Rate it yourself - /Services/opticians/LeaveReview/DefaultView.aspx?id=OP_5KV_538__000002_BH151SX,0,0,
Leightons & Tempany,OP_5KV_646__000001_BH151AU,OPT,,157 High Street,,Poole,Dorset,BH15 1AU,Tel: 01202 678244, - ,,,No ratings yet Rate it yourself - /Services/opticians/LeaveReview/DefaultView.aspx?id=OP_5KV_646__000001_BH151AU,0,0,
Vision Express (UK) Ltd,OP_5KV_6730__000001_BH151ST,OPT,37-38 Dolphin Shopping Centre,,Poole,,,BH15 1ST,Tel: 01202 661060, - ,,,No ratings yet Rate it yourself - /Services/opticians/LeaveReview/DefaultView.aspx?id=OP_5KV_6730__000001_BH151ST,0,0,
Specsavers Opticians (Poole Visionplus Ltd),OP_5KV_4516__000001_BH151DF,OPT,,32/34 Kingsland Crescent,,Poole,Dorset,BH15 1TB,Tel: 01202 675789, - ,,,No ratings yet Rate it yourself - /Services/opticians/LeaveReview/DefaultView.aspx?id=OP_5KV_4516__000001_BH151DF,0,0,
Scrivens Ltd,OP_5KV_7844__000001_BH151TB,OPT,,145 High Street,,Poole,Dorset,BH15 1AS,Tel: 0121 456 8700, - ,,,No ratings yet Rate it yourself - /Services/opticians/LeaveReview/DefaultView.aspx?id=OP_5KV_7844__000001_BH151TB,0,0,
K C Opticians ,OP_BH107AZ_85049,OPT,,1553 Wimborne Road,Kinson,BOURNEMOUTH,Dorset,BH10 7AZ,Tel: 01202 571601, - ,,,No ratings yet Rate it yourself - /Services/opticians/LeaveReview/DefaultView.aspx?id=OP_BH107AZ_85049,0,0,
Wilton i Ltd,SP2 0DF,OPT,within The Old Orchard Surgery,South Street,,Wilton,,SP2 0JU,Tel: 01722 743122, - ,,,No ratings yet Rate it yourself - /Services/opticians/LeaveReview/DefaultView.aspx?id=SP2 0DF,0,0,
Parley Optometrists,OP_5FN_391__000002_BH228EB,OPT,127 New Road,West Parley,,FERNDOWN,Dorset,BH22 8EB,Tel: 01202 575759, - ,,,No ratings yet Rate it yourself - /Services/opticians/LeaveReview/DefaultView.aspx?id=OP_5FN_391__000002_BH228EB,0,0,yes
F P Whiffen Ltd,CO-2538__000002_BH140ES,OPT,2 Bournemouth Road,Lower Parkstone,,POOLE,Dorset,BH14 0ES,Tel: 01202 716661, - ,,,No ratings yet Rate it yourself - /Services/opticians/LeaveReview/DefaultView.aspx?id=CO-2538__000002_BH140ES,0,0,
Parkstone Eyecare,OP_5KV_5415__000001_BH140AA,OPT,434 Ashley Road,Parkstone,,POOLE,Dorset,BH14 0AA,Tel: 01202 741963, - ,,,No ratings yet Rate it yourself - /Services/opticians/LeaveReview/DefaultView.aspx?id=OP_5KV_5415__000001_BH140AA,0,0,
Boots-Bournemouth - Wallisdown Rd,OP_5CE_13054__000001_BH118PN,OPT,288a Wallisdown Road,Wallisdown,,Bournemouth,Dorset,BH11 8PN,Tel: 01202 515024, - ,,,No ratings yet Rate it yourself - /Services/opticians/LeaveReview/DefaultView.aspx?id=OP_5CE_13054__000001_BH118PN,0,0,
Boots-Frome,OP_5FX_12891__000001_BA111BN,OPT,3 Cheap Street,,,Frome,Somerset,BA11 1BN,Tel: 01373 462031, - ,,,No ratings yet Rate it yourself - /Services/opticians/LeaveReview/DefaultView.aspx?id=OP_5FX_12891__000001_BA111BN,0,0,
Eye-Tech Opticians,OP_5FX_13589__000001_BA111AH,OPT,25 Market Place,Frome,,Somerset,,BA11 1AH,Tel: 01373 462573, - ,,,No ratings yet Rate it yourself - /Services/opticians/LeaveReview/DefaultView.aspx?id=OP_5FX_13589__000001_BA111AH,0,0,
Trew Eyecare Limited,OP_5KV_3373__000001_BH149DS,OPT,255 Ashley Road,Parkstone,Poole,Poole,Dorset,BH14 9DS,Tel: 01202 742003, - ,,,No ratings yet Rate it yourself - /Services/opticians/LeaveReview/DefaultView.aspx?id=OP_5KV_3373__000001_BH149DS,0,0,
Kelly Eyecare (Parkstone) Limited,OP_5KV_8173__000002_BH149DS,OPT,279 Ashley Road,Parkstone,,POOLE,Dorset,BH14 9DS,Tel: 01202 733611, - ,,,No ratings yet Rate it yourself - /Services/opticians/LeaveReview/DefaultView.aspx?id=OP_5KV_8173__000002_BH149DS,0,0,
Kelly Eyecare (Parkstone) Limited,OP_5A1_14103__000002_SO403BX,OPT,9 Commercial Road,279 Ashley Road,Totton,Parkstone,,BH14 9DS,Tel: 023 8086 5493, - ,,,No ratings yet Rate it yourself - /Services/opticians/LeaveReview/DefaultView.aspx?id=OP_5A1_14103__000002_SO403BX,0,0,
O'toid Opticians,01-19886,OPT,,5 The Bridge,,Frome,,BA11 1AR,Tel: 01373 467467, - ,,,No ratings yet Rate it yourself - /Services/opticians/LeaveReview/DefaultView.aspx?id=01-19886,0,0,
Specsavers Opticians,OP_5FX_7746__000002_BA111BS,OPT,19 Westway Centre,Frome,,Somerset,,BA11 1BS,Tel: 01373 451180, - ,,,No ratings yet Rate it yourself - /Services/opticians/LeaveReview/DefaultView.aspx?id=OP_5FX_7746__000002_BA111BS,0,0,
A.J Bass BSc FCOptom,OP_5A1_14086__000001_SP61AX,OPT,36 High Street,,Fordingbridge,Hampshire,,SP6 1AX,Tel: 01425 652663, - ,,,No ratings yet Rate it yourself - /Services/opticians/LeaveReview/DefaultView.aspx?id=OP_5A1_14086__000001_SP61AX,0,0,
Spesavers - Sainsburys,,OPT,,Alder Park,4 Alder Road,Poole,Dorset,BH12 4BA,Tel: 01202403273, - ,,,N/A - Data not available,,,
Onsite Eyecare Ltd,CT005__000001_BH105AS,OPT,20 Barnes Road,,Bournemouth,Dorset,,BH10 5AS,Tel: 01202 511249, - ,,,No ratings yet Rate it yourself - /Services/opticians/LeaveReview/DefaultView.aspx?id=CT005__000001_BH105AS,0,0,
Moordown Eyecare,OP_5CE_13760__000001_BH91BN,OPT,,922 Wimborne Road,Moordown,BOURNEMOUTH,Dorset,BH9 2DH,Tel: 01202 530500, - ,,,No ratings yet Rate it yourself - /Services/opticians/LeaveReview/DefaultView.aspx?id=OP_5CE_13760__000001_BH91BN,0,0,
Still & Bedford Ltd,OP_5CE_9449__000001_BH92SG,OPT,,922 Wimborne Road,,Bournemouth,Dorset,BH9 2DH,Tel: 01202 529414, - ,,,No ratings yet Rate it yourself - /Services/opticians/LeaveReview/DefaultView.aspx?id=OP_5CE_9449__000001_BH92SG,0,0,yes
Christopher Young Optometrists,OP_5FX_2045__000001_BA45AS,OPT,46 High Street,Shepton Mallet,Somerset,,,BA4 5AS,Tel: 01749 345259, - ,,,No ratings yet Rate it yourself - /Services/opticians/LeaveReview/DefaultView.aspx?id=OP_5FX_2045__000001_BA45AS,0,0,
Specsavers,BH24 1AT__000001_BH241AT,OPT,2 The Furlong Centre,,Ringwood,Hants,,BH24 1AT,Tel: 01425 484480, - ,,,No ratings yet Rate it yourself - /Services/opticians/LeaveReview/DefaultView.aspx?id=BH24 1AT__000001_BH241AT,0,0,
Scrivens Opticians,OP_5A1_14100__000001_BH241AD,OPT,49 High Street,,Ringwood,Hampshire,,BH24 1AD,Tel: 01425 472534, - ,,,No ratings yet Rate it yourself - /Services/opticians/LeaveReview/DefaultView.aspx?id=OP_5A1_14100__000001_BH241AD,0,0,
Specsavers Optician,01-25615,OPT,,411 Wimborne Road,,Dorset,,BH9 2AJ,Tel: 01202 635890, - ,,,No ratings yet Rate it yourself - /Services/opticians/LeaveReview/DefaultView.aspx?id=01-25615,0,0,
Kelly Eyecare,OP_5A1_14099__000001_BH241AB,OPT,17 High Street,,Ringwood,Hampshire,,BH24 1AB,Tel: 01425 478545, - ,,,No ratings yet Rate it yourself - /Services/opticians/LeaveReview/DefaultView.aspx?id=OP_5A1_14099__000001_BH241AB,0,0,
R T Knight EyecareLtd,OP_5KV_5765__000001_BH49EF,OPT,118 Poole Road,118 Poole Road,Bournemouth,Bournemouth,,BH4 9EF,Tel: 01202 764439, - ,,,No ratings yet Rate it yourself - /Services/opticians/LeaveReview/DefaultView.aspx?id=OP_5KV_5765__000001_BH49EF,0,0,
Scrivens Ltd,OP_5CE_1815__000001_BH92EN,OPT,,373 Wimborne Road,,Winton,Dorset,BH9 2AQ,Tel: 01202 529700, - ,,,No ratings yet Rate it yourself - /Services/opticians/LeaveReview/DefaultView.aspx?id=OP_5CE_1815__000001_BH92EN,0,0,
Kelly Eyecare Ltd,CO-2697__000002_BH92AQ,OPT,369 Wimborne Road,Winton,,BOURNEMOUTH,Dorset,BH9 2AQ,Tel: 01202 510102, - ,,,No ratings yet Rate it yourself - /Services/opticians/LeaveReview/DefaultView.aspx?id=CO-2697__000002_BH92AQ,0,0,
Scrivens Ltd,OP_5KV_11124__000002_BH49BB,OPT,,89 Poole Road,,Westbourne,Dorset,BH4 9BB,Tel: 01202 764545, - ,,,No ratings yet Rate it yourself - /Services/opticians/LeaveReview/DefaultView.aspx?id=OP_5KV_11124__000002_BH49BB,0,0,
Boots-Bournemouth - Winton Rd,CO-3459__000001_BH92HH,OPT,,355A Wimborne Road,Winton,BOURNEMOUTH,Dorset,BH9 2AD,Tel: 01202 516924, - ,,,No ratings yet Rate it yourself - /Services/opticians/LeaveReview/DefaultView.aspx?id=CO-3459__000001_BH92HH,0,0,
Eye See Eye,OP_5A1_14098__000001_BH241DG,OPT,17-19 Christchurch Road,Friday's Cross,Ringwood,,,BH24 1DG,Tel: 01425 477922, - ,,,No ratings yet Rate it yourself - /Services/opticians/LeaveReview/DefaultView.aspx?id=OP_5A1_14098__000001_BH241DG,0,0,
Martock Opticians Ltd,OP_5K1_14660__000002_TA126JL,OPT,North Street,Martock,Somerset,,,TA12 6DH,Tel: 01935 824431, - ,,,No ratings yet Rate it yourself - /Services/opticians/LeaveReview/DefaultView.aspx?id=OP_5K1_14660__000002_TA126JL,0,0,
Mark Jones Eyecare,OP_5DJ_14125__000001_SP27SU,OPT,,21 Fisherton Street,,Salisbury,,SP2 7SU,Tel: 01722 322891, - ,,,No ratings yet Rate it yourself - /Services/opticians/LeaveReview/DefaultView.aspx?id=OP_5DJ_14125__000001_SP27SU,0,0,
Batemans (Opticians) Ltd,OP_5DJ_3495__000001_SP12LX,OPT,6 Bridge Street,,Salisbury,,,SP1 2LX,Tel: 01722 322585, - ,,,No ratings yet Rate it yourself - /Services/opticians/LeaveReview/DefaultView.aspx?id=OP_5DJ_3495__000001_SP12LX,0,0,
Boots-Salisbury - Silver St,SP1 2NG_29481,OPT,,41-49 Silver Street,,Salisbury,Wiltshire,SP1 2NG,Tel: 01722 412625, - ,,,No ratings yet Rate it yourself - /Services/opticians/LeaveReview/DefaultView.aspx?id=SP1 2NG_29481,0,0,
Boots Opticians Limited,OP_5DJ_11593__000001_SP12AA,OPT,49-51 New Canel,,Salisbury,,,SP1 2AA,Tel: 01722 412625, - ,,,No ratings yet Rate it yourself - /Services/opticians/LeaveReview/DefaultView.aspx?id=OP_5DJ_11593__000001_SP12AA,0,0,
Vision Express (UK) Ltd,OP_5DJ_1147__000002_SP11EP,OPT,25-27 Butcher Row,,Salisbury,,,SP1 1EP,Tel: 01722 330056, - ,,,No ratings yet Rate it yourself - /Services/opticians/LeaveReview/DefaultView.aspx?id=OP_5DJ_1147__000002_SP11EP,0,0,
Silverthornes Opticians,OP_5DJ_14126__000001_SP12DD,OPT,50 Catherine Street,,Salisbury,Wiltshire,,SP1 2DD,Tel: 01722 322880, - ,,,No ratings yet Rate it yourself - /Services/opticians/LeaveReview/DefaultView.aspx?id=OP_5DJ_14126__000001_SP12DD,0,0,
PBS Optical,OPT_BH241TW_1,OPT,,Cornerways Cottage,,Ringwood,,BH24 1TW,, - ,,,No ratings yet Rate it yourself - /Services/opticians/LeaveReview/DefaultView.aspx?id=OPT_BH241TW_1,0,0,
Specsavers Opticians,OP_5DJ_9766__000001_SP12DG,OPT,1 Catherine Street,,Salisbury,,,SP1 2DF,Tel: 01722 412255, - ,,,No ratings yet Rate it yourself - /Services/opticians/LeaveReview/DefaultView.aspx?id=OP_5DJ_9766__000001_SP12DG,0,0,
Memory Opticians,OP_5DJ_8550__000002_SP12DF,OPT,13 Catherine Street,,Salisbury,,,SP1 2DF,Tel: 01722 410959, - ,,,No ratings yet Rate it yourself - /Services/opticians/LeaveReview/DefaultView.aspx?id=OP_5DJ_8550__000002_SP12DF,0,0,
Boots-Salisbury - Catherine St,OP_5DJ_10591__000001_SP12DF,OPT,17 Catherine Street,,,Salisbury,Wiltshire,SP1 2DF,Tel: 01722 322 522, - ,,,No ratings yet Rate it yourself - /Services/opticians/LeaveReview/DefaultView.aspx?id=OP_5DJ_10591__000001_SP12DF,0,0,
M&S Opticians - Castlepoint,O7K0D,OPT,,"Castlepoint Shopping Centre, Yeomans Way",,Bournemouth,Dorset,BH8 9UL,Tel: 01202 059316, - ,,,No ratings yet Rate it yourself - /Services/opticians/LeaveReview/DefaultView.aspx?id=O7K0D,0,0,
Asda Stores Ltd.,OP_5CE_14967__000002_BH89UP,OPT,Castlepoint Centre,Castle Lane West,,Bournemouth,,BH8 9UP,Tel: 01202 844412, - ,,,No ratings yet Rate it yourself - /Services/opticians/LeaveReview/DefaultView.aspx?id=OP_5CE_14967__000002_BH89UP,0,0,
Vision Express (UK )Ltd,OP_5KV_13763__000001_BH25LP,OPT,46 Commercial Road,,Bournemouth,,,BH2 5LP,Tel: 01202 587524, - ,,,No ratings yet Rate it yourself - /Services/opticians/LeaveReview/DefaultView.aspx?id=OP_5KV_13763__000001_BH25LP,0,0,