Organisation Name,NACS Code,Organisation Type,Address1,Address2,Address3,Address4,Address5,PostCode,Telephone Number,Opening time,Value  (Opening time),Banding Classification  (Opening time),NHS.UK users rating,Value  (NHS.UK users rating),Banding Classification  (NHS.UK users rating),Car parking (Is there car parking at this organisation?)
Boots-Wallingford,BOOTSWALLINGFORD1,OPT,1 Castle Street,,,Wallingford,Oxfordshire,OX10 8DL,Tel: 01491 833200, - ,,,2 ratings Rate it yourself - /Services/opticians/LeaveReview/DefaultView.aspx?id=BOOTSWALLINGFORD1,,,
Robert Stanley Opticians,OP_5DX_5409__000002_OX100AL,OPT,8 St. Martins Street,,,Wallingford,,OX10 0AL,Tel: 01491 837033, - ,,,No ratings yet Rate it yourself - /Services/opticians/LeaveReview/DefaultView.aspx?id=OP_5DX_5409__000002_OX100AL,0,0,
Patricia Hayselden & Partners,OP_5DX_8466__000002_OX100EL,OPT,,60 St Mary's Street,,Wallingford,Oxfordshire,OX10 0EL,Tel: 01491 835466, - ,,,1 rating Rate it yourself - /Services/opticians/LeaveReview/DefaultView.aspx?id=OP_5DX_8466__000002_OX100EL,,,
Boots-Didcot,OP_5DY_11588__000001_OX118RJ,OPT,,48 Orchard Street,,Didcot,Oxfordshire,OX11 7LG,Tel: 01235 812241, - ,,,No ratings yet Rate it yourself - /Services/opticians/LeaveReview/DefaultView.aspx?id=OP_5DY_11588__000001_OX118RJ,0,0,
Specsavers,SPECSAVERSDIDCOT1,OPT,,17 Orchard Street,,Didcot,,OX11 7LG,Tel: 01235 517100, - ,,,No ratings yet Rate it yourself - /Services/opticians/LeaveReview/DefaultView.aspx?id=SPECSAVERSDIDCOT1,0,0,
Scrivens,OP_5DY_11103__000001_OX118RN,OPT,,182 The Broadway,,Didcot,Oxfordshire,OX11 8RN,Tel: 01235 813305, - ,,,No ratings yet Rate it yourself - /Services/opticians/LeaveReview/DefaultView.aspx?id=OP_5DY_11103__000001_OX118RN,0,0,
Posh Eyes,D-12688 ,OPT,Westbury House,52 French Laurence Way,,Oxford,Oxfordshire,OX44 7YF,Tel: 01865400384, - ,,,No ratings yet Rate it yourself - /Services/opticians/LeaveReview/DefaultView.aspx?id=D-12688,0,0,yes
Robert Stanley Opticians,OP_5DY_2075__000002_OX143JF,OPT,23 Stert Street,,,Abingdon,,OX14 3JF,Tel: 01235 520849, - ,,,No ratings yet Rate it yourself - /Services/opticians/LeaveReview/DefaultView.aspx?id=OP_5DY_2075__000002_OX143JF,0,0,
Scrivens inc. Russell Caulton,OP_5DY_5772__000002_OX143HA,OPT,,6 Bury Street,,Abingdon,Oxfordshire,OX14 3QY,Tel: 01235 523217, - ,,,No ratings yet Rate it yourself - /Services/opticians/LeaveReview/DefaultView.aspx?id=OP_5DY_5772__000002_OX143HA,0,0,
Abingdon Eye Centre,ABINGDONEYECENTRE1,OPT,,"Unit 3, Bury Street Shopping Centre",,Abingdon,Oxfordshire,OX14 3QY,Tel: 01235 533328, - ,,,1 rating Rate it yourself - /Services/opticians/LeaveReview/DefaultView.aspx?id=ABINGDONEYECENTRE1,,,
Paul Conway,OP_5DY_1044__000001_OX145BB,OPT,,21 High Street,,Abingdon,Oxfordshire,OX14 5BB,Tel: 01235 528032, - ,,,No ratings yet Rate it yourself - /Services/opticians/LeaveReview/DefaultView.aspx?id=OP_5DY_1044__000001_OX145BB,0,0,
Boots Opticians,TP4MA,OPT,,Unit 10,Abbey Shopping Centre,Abingdon,Oxfordshire,OX14 3QX,Tel: 01235 520809, - ,,,3 ratings Rate it yourself - /Services/opticians/LeaveReview/DefaultView.aspx?id=TP4MA,,,
Specsavers Opticians,OP_5DY_11818__000001_OX141JZ,OPT,Unit 16,Abbey Shopping Centre,,Abingdon,,OX14 3QT,Tel: 01235 530530, - ,,,2 ratings Rate it yourself - /Services/opticians/LeaveReview/DefaultView.aspx?id=OP_5DY_11818__000001_OX141JZ,,,
Vision Express,TESCOABINGDON1,OPT,Tesco Express,Marcham Road,,Abingdon,Oxfordshire,OX14 1TU,Tel: 0121 519 1181, - ,,,No ratings yet Rate it yourself - /Services/opticians/LeaveReview/DefaultView.aspx?id=TESCOABINGDON1,0,0,
Specsavers Opticians,TP98L,OPT,Sainsbury's,Heyford Hill,Littlemore,Oxford,Oxfordshire,OX4 4XR,Tel: 01865 712 500, - ,,,13 ratings Rate it yourself - /Services/opticians/LeaveReview/DefaultView.aspx?id=TP98L,,,
Vision Express (UK) Ltd,OP_5DL_2989__000001_RG87LR,OPT,,12 Whitchurch Road,Reading,Pangbourne,Berkshire,RG8 7BP,Tel: 0118 984 2428, - ,,,No ratings yet Rate it yourself - /Services/opticians/LeaveReview/DefaultView.aspx?id=OP_5DL_2989__000001_RG87LR,0,0,
Ideal Eyes ,OP_5DW_11455__000001_OX43XH,OPT,,130-131 Pound Way,Cowley,Oxford,Oxfordshire,OX4 3XH,Tel: 01865 749877, - ,,,No ratings yet Rate it yourself - /Services/opticians/LeaveReview/DefaultView.aspx?id=OP_5DW_11455__000001_OX43XH,0,0,
Specsavers Opticians,OP_5DW_212__000001_OX43YA,OPT,119 Pound Way,Cowley,,Oxford,,OX4 3YA,Tel: 01865 773344, - ,,,9 ratings Rate it yourself - /Services/opticians/LeaveReview/DefaultView.aspx?id=OP_5DW_212__000001_OX43YA,,,
Gardiners Opticians,OP_5DW_3921__000001_OX37RA,OPT,5 Manor Buildings,Osler Road,,Oxford,,OX3 7RA,Tel: 01865 761459, - ,,,No ratings yet Rate it yourself - /Services/opticians/LeaveReview/DefaultView.aspx?id=OP_5DW_3921__000001_OX37RA,0,0,
John Lewis Opticians,TP8JN,OPT,101 The Westgate,Queen Street,,Oxford,Oxfordshire,OX1 1PB,Tel: 01865 240172, - ,,,No ratings yet Rate it yourself - /Services/opticians/LeaveReview/DefaultView.aspx?id=TP8JN,0,0,
Robert Stanley Opticians,OP_5DW_3703__000001_OX39HZ,OPT,137 London Road,Headington,,Oxford,,OX3 9HZ,Tel: 01865 766488, - ,,,3 ratings Rate it yourself - /Services/opticians/LeaveReview/DefaultView.aspx?id=OP_5DW_3703__000001_OX39HZ,,,
M&S Opticians,,OPT,,13-18 Queen Street,,Oxford,Oxfordshire,OX1 1AB,Tel: 01865 419984, - ,,,N/A - Data not available,,,
Vision Express,OP_5DW_12640__000001_OX11NU,OPT,,31-32 Queen Street,,Oxford,Oxfordshire,OX1 3ER,Tel: 01865 243567, - ,,,No ratings yet Rate it yourself - /Services/opticians/LeaveReview/DefaultView.aspx?id=OP_5DW_12640__000001_OX11NU,0,0,
David Clulow Opticians,TP3RL,OPT,,13 High Street,,Oxford,Oxfordshire,OX1 4DB,Tel: 01865 242058, - ,,,No ratings yet Rate it yourself - /Services/opticians/LeaveReview/DefaultView.aspx?id=TP3RL,0,0,
Specsavers,OX1 3EY__000003_OX11NU,OPT,,33 Queen Street,,Oxford,Oxfordshire,OX1 1ER,Tel: 01865 255710, - ,,,No ratings yet Rate it yourself - /Services/opticians/LeaveReview/DefaultView.aspx?id=OX1 3EY__000003_OX11NU,0,0,
Boots Opticians (Oxford),,OPT,,6-8 Cornmarket Street,,Oxford,,OX1 3HL,Tel: 01865246206, - ,,,N/A - Data not available,,,
Paul Conway ,OP_5DW_8773__000001_OX12AQ,OPT,,44 George Street,,Oxford,Oxfordshire,OX1 2AQ,Tel: 01865 244667, - ,,,No ratings yet Rate it yourself - /Services/opticians/LeaveReview/DefaultView.aspx?id=OP_5DW_8773__000001_OX12AQ,0,0,
Optometry Department,OP_5DW_1905__000002_OX26HE,OPT,West Wing Lg1,John Radcliffe Hospital,Headington,Oxford,,OX3 9DU,Tel: 01865 234163, - ,,,No ratings yet Rate it yourself - /Services/opticians/LeaveReview/DefaultView.aspx?id=OP_5DW_1905__000002_OX26HE,0,0,
Scrivens Opticians,OP_5DL_10795__000002_RG315AR,OPT,11 School Road,Tilehurst,Reading,Berkshire,,RG31 5AR,Tel: 0118 9412911, - ,,,1 rating Rate it yourself - /Services/opticians/LeaveReview/DefaultView.aspx?id=OP_5DL_10795__000002_RG315AR,,,
Specsavers Opticians,TP2HJ,OPT,,1A Grove Street,,Wantage,Oxfordshire,OX12 7AB,Tel: 01235 773980, - ,,,No ratings yet Rate it yourself - /Services/opticians/LeaveReview/DefaultView.aspx?id=TP2HJ,0,0,
Boots-Wantage,BOOTSOPTICIANSWANTAGE1,OPT,Unit 3A Kings Walk,,,Wantage,Oxfordshire,OX12 9AJ,Tel: 01235 768177, - ,,,No ratings yet Rate it yourself - /Services/opticians/LeaveReview/DefaultView.aspx?id=BOOTSOPTICIANSWANTAGE1,0,0,
Campbells Opticians,OP_5DY_2985__000002_OX128BU,OPT,,34 Market Place,,Wantage,Oxfordshire,OX12 8AH,Tel: 01235 763312, - ,,,No ratings yet Rate it yourself - /Services/opticians/LeaveReview/DefaultView.aspx?id=OP_5DY_2985__000002_OX128BU,0,0,
David Spicer Opticians,OP_5DW_8831__000001_OX29LG,OPT,1 Elms Parade,Botley,,Oxford,Oxfordshire,OX2 9LG,Tel: 01865 241142, - ,,,1 rating Rate it yourself - /Services/opticians/LeaveReview/DefaultView.aspx?id=OP_5DW_8831__000001_OX29LG,,,
Ideal Eyes,OP_5DW_12641__000001_OP_5DW_12641,OPT,76 West Way,Botley,,Oxford,,OX2 9JT,Tel: 01865 244699, - ,,,No ratings yet Rate it yourself - /Services/opticians/LeaveReview/DefaultView.aspx?id=OP_5DW_12641__000001_OP_5DW_12641,0,0,
Bunker Opticians,OP_5DX_8715__000001_RG91AN,OPT,45 - 47 Duke Street,,Henley-on-Thames,,,RG9 1UR,Tel: 01491 412020, - ,,,No ratings yet Rate it yourself - /Services/opticians/LeaveReview/DefaultView.aspx?id=OP_5DX_8715__000001_RG91AN,0,0,
Boots-Henley On Thames,BOOTSHENLEY1,OPT,23 Duke Street,,,Henley On Thames,Oxfordshire,RG9 1UR,Tel: 01491 637763, - ,,,1 rating Rate it yourself - /Services/opticians/LeaveReview/DefaultView.aspx?id=BOOTSHENLEY1,,,
Specsavers Opticians,TP9F3,OPT,Sainsbury's,Bath Road,Calcot,Reading,Berkshire,RG31 7SA,Tel: 0118 956 9770, - ,,,No ratings yet Rate it yourself - /Services/opticians/LeaveReview/DefaultView.aspx?id=TP9F3,0,0,
Vision Express,OP_RG301AH_85777,OPT,,"Tesco Express, Portman Road",,Reading,,RG30 1AH,, - ,,,No ratings yet Rate it yourself - /Services/opticians/LeaveReview/DefaultView.aspx?id=OP_RG301AH_85777,0,0,
Robin James Opticians Ltd,OP_5DL_844__000002_RG48AU,OPT,44 Church Street,Caversham,Reading,,,RG4 8AU,Tel: 0118 947 2099, - ,,,No ratings yet Rate it yourself - /Services/opticians/LeaveReview/DefaultView.aspx?id=OP_5DL_844__000002_RG48AU,0,0,
Robert Stanley Opticians,OP_5DP_14311__000004_OX92BL,OPT,22 Cornmarket,,Thame,Oxon,,OX9 2BL,Tel: 01844 261096, - ,,,No ratings yet Rate it yourself - /Services/opticians/LeaveReview/DefaultView.aspx?id=OP_5DP_14311__000004_OX92BL,0,0,
Thame Specsavers Limited,O9Q0Q,OPT,,109 High Street,,Thame,,OX9 3DZ,Tel: 01844 394765, - ,,,2 ratings Rate it yourself - /Services/opticians/LeaveReview/DefaultView.aspx?id=O9Q0Q,,,
Home Care Optician,OP_RG46PH_46763,OPT,,4 Highbridge Close,Caversham Park Village,Reading,Berkshire,RG4 6PH,Tel: 07909 335211, - ,,,No ratings yet Rate it yourself - /Services/opticians/LeaveReview/DefaultView.aspx?id=OP_RG46PH_46763,0,0,
Ideal Eyes,IDEALEYES1,OPT,,217 Banbury Road,Summertown,Oxford,,OX2 7HQ,Tel: 01865 302288, - ,,,No ratings yet Rate it yourself - /Services/opticians/LeaveReview/DefaultView.aspx?id=IDEALEYES1,0,0,
Boots-Oxford - Mayfield House,OP_5DW_2231__000001_OX27DE,OPT,1 Mayfield House,256 Banbury Road,Summertime,Oxford,,OX2 7DE,Tel: 01865 558 951, - ,,,No ratings yet Rate it yourself - /Services/opticians/LeaveReview/DefaultView.aspx?id=OP_5DW_2231__000001_OX27DE,0,0,
Eyesite Opticians,OP_5DL_297__000001_RG11EP,OPT,142 Friar Street,,,Reading,Berkshire,RG1 1EX,Tel: 0118 950 9098, - ,,,1 rating Rate it yourself - /Services/opticians/LeaveReview/DefaultView.aspx?id=OP_5DL_297__000001_RG11EP,,,
Specsavers Opticians,OP_RG12AA_85781,OPT,,45 Broad Street,,Reading,,RG1 2AA,, - ,,,No ratings yet Rate it yourself - /Services/opticians/LeaveReview/DefaultView.aspx?id=OP_RG12AA_85781,0,0,
Leightons Opticians & Hearing Care,OP_5DL_8141__000001_RG17UJ,OPT,,12-14 Queen Victoria Street,,Reading,Berkshire,RG1 1TG,Tel: 0118 959 0055, - ,,,No ratings yet Rate it yourself - /Services/opticians/LeaveReview/DefaultView.aspx?id=OP_5DL_8141__000001_RG17UJ,0,0,
Vision Express (UK) Ltd,OP_5DL_2333__000003_RG12AH,OPT,"5a, Town Mall Walk, Upper Ground Level",The Oracle Centre,Reading,,,RG1 2AH,Tel: 0118 950 4504, - ,,,No ratings yet Rate it yourself - /Services/opticians/LeaveReview/DefaultView.aspx?id=OP_5DL_2333__000003_RG12AH,0,0,
Boots-Reading - Oracle Centre (in Boots UK),OP_5DL_1822__000002_RG12AH,OPT,Unit 5 Upper Ground Level,The Oracle Centre,,Reading,Berkshire,RG1 2AH,Tel: 0118 958 9783, - ,,,5 ratings Rate it yourself - /Services/opticians/LeaveReview/DefaultView.aspx?id=OP_5DL_1822__000002_RG12AH,,,
Vision Express,OP_RG18DF_85776,OPT,,"Tesco Express, Napier Road",,Reading,,RG1 8DF,, - ,,,No ratings yet Rate it yourself - /Services/opticians/LeaveReview/DefaultView.aspx?id=OP_RG18DF_85776,0,0,
Opticial Express,OP_12345_RG1 4BP,OPT,"Lower Ground, Havell House",62-66 Queens Road,,Reading,Berkshire,RG1 4BP,Tel: 0800 023 2020, - ,,,No ratings yet Rate it yourself - /Services/opticians/LeaveReview/DefaultView.aspx?id=OP_12345_RG1 4BP,0,0,
Optical Express,,OPT,,Havell House,,Reading,,RG1 4BP,, - ,,,N/A - Data not available,,,
D & R Kirk Opticians,OP_RG20EG_85771,OPT,D & R Kirk Opticians,47 Whitley Street,,READING,Berkshire,RG2 0EG,Tel: 0118 9871020, - ,,,4 ratings Rate it yourself - /Services/opticians/LeaveReview/DefaultView.aspx?id=OP_RG20EG_85771,,,
Leightons Opticians & Hearing Care,OP_5DK_3647__000001_RG193JD,OPT,,12 Kingsland Centre,,Thatcham,Berkshire,RG19 3HN,Tel: 01635 863290, - ,,,1 rating Rate it yourself - /Services/opticians/LeaveReview/DefaultView.aspx?id=OP_5DK_3647__000001_RG193JD,,,
Buyspecs Direct,TP0ML,OPT,,"Unit 9, Pipers Court",Berkshire Drive,Thatcham,Berkshire,RG19 4ER,Tel: 01635 293578, - ,,,No ratings yet Rate it yourself - /Services/opticians/LeaveReview/DefaultView.aspx?id=TP0ML,0,0,
Costco,OP_RG26UE_85770,OPT,,"100 South Oak Way, Green Park",,Reading,,RG2 6UE,, - ,,,No ratings yet Rate it yourself - /Services/opticians/LeaveReview/DefaultView.aspx?id=OP_RG26UE_85770,0,0,
Leightons Opticians & Hearing Care,OP_5DN_6941__000002_RG53JH,OPT,,124 Crockhamwell Road,Woodley,Reading,Berkshire,RG5 3JH,Tel: 0118 969 1139, - ,,,1 rating Rate it yourself - /Services/opticians/LeaveReview/DefaultView.aspx?id=OP_5DN_6941__000002_RG53JH,,,
Specsavers Opticians,OP_RG53JH_85780,OPT,,176 Crockhamwell Road,,Woodley,,RG5 3JH,, - ,,,1 rating Rate it yourself - /Services/opticians/LeaveReview/DefaultView.aspx?id=OP_RG53JH_85780,,,
Specsavers Opticians,OP_RG28HA_85773,OPT,,"203 - 205 Shinfield Road,",,"Earley, Reading",,RG2 8HA,, - ,,,No ratings yet Rate it yourself - /Services/opticians/LeaveReview/DefaultView.aspx?id=OP_RG28HA_85773,0,0,
Vision Express (UK) Ltd,OP_5DN_1223__000001_RG109DN,OPT,7 Church Street,Twyford,Reading,Berkshire,,RG10 9DN,Tel: 0118 934 5566, - ,,,No ratings yet Rate it yourself - /Services/opticians/LeaveReview/DefaultView.aspx?id=OP_5DN_1223__000001_RG109DN,0,0,
Specsavers Opticians,OP_5DK_1746__000001_RG141DT,OPT,42-42a Northbrook Street,Newbury,Berkshire,,,RG14 1DT,Tel: 01635 46105, - ,,,No ratings yet Rate it yourself - /Services/opticians/LeaveReview/DefaultView.aspx?id=OP_5DK_1746__000001_RG141DT,0,0,
Ottica UK Ltd,OP_RG141AY_85774,OPT,,38 Parkway,,Newbury,,RG14 1AY,, - ,,,No ratings yet Rate it yourself - /Services/opticians/LeaveReview/DefaultView.aspx?id=OP_RG141AY_85774,0,0,
Morgan Optometry,OP_5DT_12976__000001_OX51BL,OPT,106a Oxford Road,,,Kidlington,,OX5 1BL,Tel: 01865 372125, - ,,,1 rating Rate it yourself - /Services/opticians/LeaveReview/DefaultView.aspx?id=OP_5DT_12976__000001_OX51BL,,,
Boots-Newbury - Northbrook St (in Boots UK),OP_RG141DJ_85768,OPT,4-5 Northbrook Street,,,Newbury,Berkshire,RG14 1DJ,Tel: 01635 40397, - ,,,2 ratings Rate it yourself - /Services/opticians/LeaveReview/DefaultView.aspx?id=OP_RG141DJ_85768,,,
Scott Waters Opticians,OP_5DK_5322__000002_RG141AA,OPT,,98 Northbrook Street,,Newbury,Berkshire,RG14 1AA,Tel: 01635 31113, - ,,,No ratings yet Rate it yourself - /Services/opticians/LeaveReview/DefaultView.aspx?id=OP_5DK_5322__000002_RG141AA,0,0,
Vision Express,OP_5DK_3370__000001_RG141AA,OPT,92 Northbrook Street,,Newbury,,,RG14 1AA,Tel: 01635 230294, - ,,,No ratings yet Rate it yourself - /Services/opticians/LeaveReview/DefaultView.aspx?id=OP_5DK_3370__000001_RG141AA,0,0,
ASDA Stores Ltd,OP_RG65TT_85766,OPT,,Lower Earley District Centre,,READING,,RG6 5TT,Tel: 01189 870 320, - ,,,No ratings yet Rate it yourself - /Services/opticians/LeaveReview/DefaultView.aspx?id=OP_RG65TT_85766,0,0,
Specsavers - Hectors Way Newbury,,OPT,,Sainsbury's Hectors Way,,Newbury,Berkshire,RG14 5AB,Tel: 01635 881 657, - ,,,N/A - Data not available,,,
Stephen Abery Opticians,OP_5DN_8100__000001_RG67HD,OPT,,46 Gipsy Lane,Reading,Earley,Buckinghamshire,RG6 7HD,Tel: 0118 935 1975, - ,,,No ratings yet Rate it yourself - /Services/opticians/LeaveReview/DefaultView.aspx?id=OP_5DN_8100__000001_RG67HD,0,0,
Cherwell Opticians,,OPT,,33 High Street,Kidlington,Oxfordshire,,OX5 2DH,Tel: 01865 842044, - ,,,N/A - Data not available,,,
Specsavers Kidlington,F4N7Z,OPT,,"Unit 2B, 40 High Street",,Kidlington,Oxfordshire,OX5 2DL,Tel: 01865 509578, - ,,,2 ratings Rate it yourself - /Services/opticians/LeaveReview/DefaultView.aspx?id=F4N7Z,,,
Chilton Watson Ltd,OP_5DP_267__000001_HP170AE,OPT,51 High Street,,,Princes Risborough,Buckinghamshire,HP27 0AE,Tel: 01844 345674, - ,,,No ratings yet Rate it yourself - /Services/opticians/LeaveReview/DefaultView.aspx?id=OP_5DP_267__000001_HP170AE,0,0,
Boots-Princes Risborough,OP_5DP_236__000001_HP270AT,OPT,23 Duke Street,,,Princes Risborough,Buckinghamshire,HP27 0AT,Tel: 01844 344374, - ,,,No ratings yet Rate it yourself - /Services/opticians/LeaveReview/DefaultView.aspx?id=OP_5DP_236__000001_HP270AT,0,0,
Asda Opticians,OPT_HP124NU,OPT,,Holmers Farm Way,,High Wycombe,,HP12 4NU,Tel: 01494 899098, - ,,,No ratings yet Rate it yourself - /Services/opticians/LeaveReview/DefaultView.aspx?id=OPT_HP124NU,0,0,
Specsavers Opticians,TP9GH,OPT,,15-17 West Street,,Marlow,Buckinghamshire,SL7 2LS,Tel: 01628 957610, - ,,,No ratings yet Rate it yourself - /Services/opticians/LeaveReview/DefaultView.aspx?id=TP9GH,0,0,
Stewart-Robinson Opticians,OP_5G5_11132__000001_SL72LS,OPT,49 West Street,49 West Street,,Marlow,Buckinghamshire,SL7 2LS,Tel: 01628 482906, - ,,,No ratings yet Rate it yourself - /Services/opticians/LeaveReview/DefaultView.aspx?id=OP_5G5_11132__000001_SL72LS,0,0,
Leigh Lewis Optometrists,OL01167875QD__000001_HP144TH,OPT,247 Main Road,,Walters Ash,Buckinghamshire,,HP14 4TH,Tel: 01494 564600, - ,,,No ratings yet Rate it yourself - /Services/opticians/LeaveReview/DefaultView.aspx?id=OL01167875QD__000001_HP144TH,0,0,
David Clulow Marlow,OP_SL71AW_46730,OPT,42 High Street,,,Marlow,Buckinghamshire,SL7 1AW,Tel: 01628 484544, - ,,,1 rating Rate it yourself - /Services/opticians/LeaveReview/DefaultView.aspx?id=OP_SL71AW_46730,,,
Leightons Insight,OP_5G5_14309__000002_SL71AB,OPT,,73 High Street,,Marlow,Buckinghamshire,SL7 1AE,Tel: 01628 477998, - ,,,No ratings yet Rate it yourself - /Services/opticians/LeaveReview/DefaultView.aspx?id=OP_5G5_14309__000002_SL71AB,0,0,
Boots-Marlow,OP_5G5_10586__000003_SL71AB,OPT,93 High Street,,,Marlow,Buckinghamshire,SL7 1AB,Tel: 01628 483 052, - ,,,No ratings yet Rate it yourself - /Services/opticians/LeaveReview/DefaultView.aspx?id=OP_5G5_10586__000003_SL71AB,0,0,
Vision Express,OP_RG147HB_85778,OPT,,"Tesco Express, Pinchington Lane",,Newbury,,RG14 7HB,, - ,,,No ratings yet Rate it yourself - /Services/opticians/LeaveReview/DefaultView.aspx?id=OP_RG147HB_85778,0,0,
Optimum Vision Clinic,01-26429,OPT,,"The Falcon Garage, Burghfield Road",,Tadley,Hampshire,RG26 4QY,Tel: 0118 9810267, - ,,,161 ratings Rate it yourself - /Services/opticians/LeaveReview/DefaultView.aspx?id=01-26429,,,yes
A R Salter,OP_5G5_5759__000001_HP112EL,OPT,65 Bridge Street,,High Wycombe,,,HP11 2EL,Tel: 01494 527130, - ,,,No ratings yet Rate it yourself - /Services/opticians/LeaveReview/DefaultView.aspx?id=OP_5G5_5759__000001_HP112EL,0,0,
Leightons Opticians & Hearing Care,OP_5DF_7434__000001_RG264HN,OPT,,Dental Surgery,Newchurch Road,Tadley,Hampshire,RG26 4HN,Tel: 0118 981 2250, - ,,,No ratings yet Rate it yourself - /Services/opticians/LeaveReview/DefaultView.aspx?id=OP_5DF_7434__000001_RG264HN,0,0,
High Wycombe VE Ltd,,OPT,,"Eden Shopping Centre, Newland Street",High Wycombe,Buckinghamshire,,HP11 2BY,Tel: 01494 473399, - ,,,N/A - Data not available,,,
M&S Opticians (High Wycombe),N9V1C,OPT,,"M&S, 1 Eden Place",The Eden Centre,High Wycombe,,HP11 2DH,Tel: 01494 321 717, - ,,,No ratings yet Rate it yourself - /Services/opticians/LeaveReview/DefaultView.aspx?id=N9V1C,0,0,
Boots-High Wycombe - Eden Walk (in Boots UK),OP_5G5_6341__000002_HP112HR,OPT,27 Eden Walk,,Eden Centre,High Wycombe,Buckinghamshire,HP11 2AU,Tel: 01494 459610, - ,,,2 ratings Rate it yourself - /Services/opticians/LeaveReview/DefaultView.aspx?id=OP_5G5_6341__000002_HP112HR,,,
Specsavers Opticians,OP_5G5_12596__000001_HP112DG,OPT,27/31 White Hart Street,,,High Wycombe,Buckinghamshire,HP11 2HL,Tel: 01494 520304, - ,,,No ratings yet Rate it yourself - /Services/opticians/LeaveReview/DefaultView.aspx?id=OP_5G5_12596__000001_HP112DG,0,0,
Scrivens Opticians,OP_5G5_96__000002_HP112DF,OPT,,18 Queen Square,,High Wycombe,Buckinghamshire,HP11 2DF,Tel: 01494 526058, - ,,,No ratings yet Rate it yourself - /Services/opticians/LeaveReview/DefaultView.aspx?id=OP_5G5_96__000002_HP112DF,0,0,
Redgate Opticians & Audiologists,TP8JG,OPT,,3-4 Queens Square,,High Wycombe,Buckinghamshire,HP11 2BP,Tel: 01494 258 690, - ,,,2 ratings Rate it yourself - /Services/opticians/LeaveReview/DefaultView.aspx?id=TP8JG,,,
David Williams ,HP11 1BA_22222,OPT,,7 Queen Victoria Road,,High Wycombe,,HP11 1BA,Tel: 01494 443448, - ,,,1 rating Rate it yourself - /Services/opticians/LeaveReview/DefaultView.aspx?id=HP11 1BA_22222,,,
Vision Express Witney,T0M9W,OPT,,24 Woolgate Shopping Centre,Market Square,Witney,Oxfordshire,OX28 6AP,Tel: 01993849700, - ,,,No ratings yet Rate it yourself - /Services/opticians/LeaveReview/DefaultView.aspx?id=T0M9W,0,0,
Specsavers Opticians,OP_5DY_7975__000001_OX86AP,OPT,,18a Woolgate Centre,,Witney,Oxfordshire,OX28 6AP,Tel: 01993 779977, - ,,,1 rating Rate it yourself - /Services/opticians/LeaveReview/DefaultView.aspx?id=OP_5DY_7975__000001_OX86AP,,,
Haine & Smith Opticians,OP_5DY_13238__000001_SN77HH,OPT,,7 Cornmarket,,Faringdon,,SN7 7HH,Tel: 01367 242262, - ,,,No ratings yet Rate it yourself - /Services/opticians/LeaveReview/DefaultView.aspx?id=OP_5DY_13238__000001_SN77HH,0,0,
Cotswold Opticians,OP_5DY_10797__000001_OX86AG,OPT,43 Market Square,,Witney,,,OX28 6AG,Tel: 01993 773535, - ,,,1 rating Rate it yourself - /Services/opticians/LeaveReview/DefaultView.aspx?id=OP_5DY_10797__000001_OX86AG,,,
Scrivens ,OP_5DY_11106__000002_OX86HB,OPT,,16a High Street,,Witney,Oxfordshire,OX28 6HB,Tel: 01993 702543, - ,,,No ratings yet Rate it yourself - /Services/opticians/LeaveReview/DefaultView.aspx?id=OP_5DY_11106__000002_OX86HB,0,0,
Boots-Witney,OP_5DY_11544__000001_OX286HW,OPT,,5 High Street,,Witney,Oxfordshire,OX28 6HW,Tel: 01993 778237, - ,,,1 rating Rate it yourself - /Services/opticians/LeaveReview/DefaultView.aspx?id=OP_5DY_11544__000001_OX286HW,,,
Optical View Opticians,OPTICALVIEWOPTICIANS1,OPT,,78 High Street,,Witney,Oxfordshire,OX28 6HL,Tel: 01993 771793, - ,,,2 ratings Rate it yourself - /Services/opticians/LeaveReview/DefaultView.aspx?id=OPTICALVIEWOPTICIANS1,,,yes
Susan Collier Ltd,OP_5G4_14307__000001_HP160NZ,OPT,The Geans,3 Wycombe Road,Prestwood,Buckinghamshire,,HP16 0NZ,Tel: 01494 866270, - ,,,No ratings yet Rate it yourself - /Services/opticians/LeaveReview/DefaultView.aspx?id=OP_5G4_14307__000001_HP160NZ,0,0,
Witney Community Hospital,OP_5DY_3500__000001_OX87JJ,OPT,Welch Way,,,Witney,Oxfordshire,OX28 6JJ,Tel: 01993 209400, - ,,,No ratings yet Rate it yourself - /Services/opticians/LeaveReview/DefaultView.aspx?id=OP_5DY_3500__000001_OX87JJ,0,0,
Scrivens Opticians,OP_5G5_11089__000001_SL85SY,OPT,,20-24 The Parade,,Bourne End,Buckinghamshire,SL8 5SY,Tel: 01628 525999, - ,,,No ratings yet Rate it yourself - /Services/opticians/LeaveReview/DefaultView.aspx?id=OP_5G5_11089__000001_SL85SY,0,0,
Ashton Opticians,OL124685G5__000001_HP109LS,OPT,1 Acorn House,12-16 Straight Bit,Flackwell Heath,High Wycombe,Buckinghamshire,HP10 9LS,Tel: 01628 530420, - ,,,1 rating Rate it yourself - /Services/opticians/LeaveReview/DefaultView.aspx?id=OL124685G5__000001_HP109LS,,,
Vision Express (UK) Ltd,OP_5DN_10002__000002_RG401XZ,OPT,4 Old Row Court,Rose Street,Wokingham,Berkshire,,RG40 1XZ,Tel: 0118 978 0937, - ,,,No ratings yet Rate it yourself - /Services/opticians/LeaveReview/DefaultView.aspx?id=OP_5DN_10002__000002_RG401XZ,0,0,
Specsavers Opticians,OP_RG401AL_85779,OPT,,18 Market Place,,Wokingham,Berkshire,RG40 1AL,Tel: 0118 978 3525, - ,,,No ratings yet Rate it yourself - /Services/opticians/LeaveReview/DefaultView.aspx?id=OP_RG401AL_85779,0,0,