Organisation Name,NACS Code,Organisation Type,Address1,Address2,Address3,Address4,Address5,PostCode,Telephone Number,Opening time,Value  (Opening time),Banding Classification  (Opening time),NHS.UK users rating,Value  (NHS.UK users rating),Banding Classification  (NHS.UK users rating),Car parking (Is there car parking at this organisation?)
Asda Opticians,OPT_MK1 1SR,OPT,,BLETCHAM WAY,BLETCHLEY,MILTON KEYNES,,MK1 1SR,Tel: 01908 362 520, - ,,,1 rating Rate it yourself - /Services/opticians/LeaveReview/DefaultView.aspx?id=OPT_MK1 1SR,,,
The Contact Lens Clinic,OP_5CQ_14311__000002_MK22EH,OPT,233 Queensway,,Bletchley,,,MK2 2EH,Tel: 01908 366882, - ,,,No ratings yet Rate it yourself - /Services/opticians/LeaveReview/DefaultView.aspx?id=OP_5CQ_14311__000002_MK22EH,0,0,
D W Roberts Optometrists,OP_5CQ_8648__000001_MK22DR,OPT,63 Queensway,Bletchley,Milton Keynes,,,MK2 2DR,Tel: 01908 373131, - ,,,No ratings yet Rate it yourself - /Services/opticians/LeaveReview/DefaultView.aspx?id=OP_5CQ_8648__000001_MK22DR,0,0,
Specsavers Opticians,OP_5CQ_7450__000001_MK22RU,OPT,110 Queensway,Bletchley,Milton Keynes,,,MK2 2RU,Tel: 01908 365533, - ,,,2 ratings Rate it yourself - /Services/opticians/LeaveReview/DefaultView.aspx?id=OP_5CQ_7450__000001_MK22RU,,,
T J Lodge,OP_5CQ_2684__000001_MK22BA,OPT,58-60 Aylesbury Street,,Fenny Stratford,,,MK2 2BA,Tel: 01908 648565, - ,,,No ratings yet Rate it yourself - /Services/opticians/LeaveReview/DefaultView.aspx?id=OP_5CQ_2684__000001_MK22BA,0,0,
Boots-Bletchley,OP_5CQ_6564__000001_MK22HE,OPT,4 The Concourse,Brunel Centre,,Bletchley,,MK2 2HE,Tel: 01908 270247, - ,,,No ratings yet Rate it yourself - /Services/opticians/LeaveReview/DefaultView.aspx?id=OP_5CQ_6564__000001_MK22HE,0,0,
Boots-Milton Keynes - Winchester Circle,OP_5CQ_13332__000001_MK100BA,OPT,32 Winchester Circle,Kingston Centre,,Milton Keynes,Buckinghamshire,MK10 0BA,Tel: 01908 281 221, - ,,,No ratings yet Rate it yourself - /Services/opticians/LeaveReview/DefaultView.aspx?id=OP_5CQ_13332__000001_MK100BA,0,0,
Tesco Opticians,OP_5CQ_14312__000002_MK100AH,OPT,1 Winchester Circle,,Kingston Centre,Milton Keynes,,MK10 0AH,Tel: 0345 601 3479, - ,,,No ratings yet Rate it yourself - /Services/opticians/LeaveReview/DefaultView.aspx?id=OP_5CQ_14312__000002_MK100AH,0,0,
Clearsight Opticians,OP_5CQ_7471__000002_MK44DD,OPT,11 Barnsdale Drive,Westcroft,Milton Keynes,Milton Keynes,,MK4 4DD,Tel: 01908 504740, - ,,,10 ratings Rate it yourself - /Services/opticians/LeaveReview/DefaultView.aspx?id=OP_5CQ_7471__000002_MK44DD,,,
Boots-Milton Keynes - Midsummer Arcade,OP_5CQ_1888__000002_MK93BB,OPT,30 Midsummer Arcade,,,Central Milton Keynes,Buckinghamshire,MK9 3BB,Tel: 01908 234757, - ,,,No ratings yet Rate it yourself - /Services/opticians/LeaveReview/DefaultView.aspx?id=OP_5CQ_1888__000002_MK93BB,0,0,
Vision Express (UK) Ltd,OP_5CQ_2901__000001_MK93ES,OPT,18 Midsummer Arcade,,Milton Keynes,Buckinghamshire,,MK9 3ES,Tel: 01908 672 267, - ,,,No ratings yet Rate it yourself - /Services/opticians/LeaveReview/DefaultView.aspx?id=OP_5CQ_2901__000001_MK93ES,0,0,
Melson Wingate Ltd(Scrivens),OP_5CQ_11119__000001_MK93BA,OPT,172 Midsummer Arcade,,,Milton Keynes,Northamptonshire,MK9 3BA,Tel: 01908 606520, - ,,,No ratings yet Rate it yourself - /Services/opticians/LeaveReview/DefaultView.aspx?id=OP_5CQ_11119__000001_MK93BA,0,0,
Boots-Milton Keynes - Crown Walk,OP_5CQ_7002__000003_MK93AH,OPT,18 Crown Walk,,,Milton Keynes,Buckinghamshire,MK9 3AH,Tel: 01908 606618, - ,,,No ratings yet Rate it yourself - /Services/opticians/LeaveReview/DefaultView.aspx?id=OP_5CQ_7002__000003_MK93AH,0,0,
Specsavers Ltd,OP_5CQ_13331__000001_MK93AG,OPT,35-37 Silbury Arcade,,Central Milton Keynes,Buckinghamshire,,MK9 3AG,Tel: 01908 662 116, - ,,,No ratings yet Rate it yourself - /Services/opticians/LeaveReview/DefaultView.aspx?id=OP_5CQ_13331__000001_MK93AG,0,0,
Costco Wholesale UK Ltd,CO-1833-13,OPT,,Mandeville Drive,Kingston,Milton Keynes,,MK10 0DB,Tel: 01908 285 035, - ,,,No ratings yet Rate it yourself - /Services/opticians/LeaveReview/DefaultView.aspx?id=CO-1833-13,0,0,
T J Lodge,OLCO25455CQ__000001_MK178RQ,OPT,9a High Street,Woburn Sands,Milton Keynes,Buckinghamshire,,MK17 8RQ,Tel: 01908 281133, - ,,,No ratings yet Rate it yourself - /Services/opticians/LeaveReview/DefaultView.aspx?id=OLCO25455CQ__000001_MK178RQ,0,0,
Home Eyetest Ltd,OP_MK158PL_46766,OPT,,18 Lacy Drive,Bolbeck Park,Milton Keynes,Buckinghamshire,MK15 8PL,Tel: 01908 465611, - ,,,No ratings yet Rate it yourself - /Services/opticians/LeaveReview/DefaultView.aspx?id=OP_MK158PL_46766,0,0,
T J Lodge,OP_5CQ_2956__000001_MK125DQ,OPT,13 The Square,Wolverton,Milton Keynes,,,MK12 5DQ,Tel: 01908 312130, - ,,,No ratings yet Rate it yourself - /Services/opticians/LeaveReview/DefaultView.aspx?id=OP_5CQ_2956__000001_MK125DQ,0,0,
D W Roberts Optometrists,OP_5CQ_8647__000002_MK125DG,OPT,17 The Square,Wolverton,Milton Keynes,,,MK12 5DG,Tel: 01908 313338, - ,,,2 ratings Rate it yourself - /Services/opticians/LeaveReview/DefaultView.aspx?id=OP_5CQ_8647__000002_MK125DG,,,
D W Roberts Optometrists,OP_5CQ_4166__000001_MK168HE,OPT,3 St. John Street,,Newport Pagnell,,,MK16 8HE,Tel: 01908 218121, - ,,,1 rating Rate it yourself - /Services/opticians/LeaveReview/DefaultView.aspx?id=OP_5CQ_4166__000001_MK168HE,,,
Heron Opticians,OP_5CQ_1791__000002_MK168HE,OPT,56 High Street,Newport,Pagnell,Buckinghamshire,,MK16 8AQ,Tel: 01908 216477, - ,,,3 ratings Rate it yourself - /Services/opticians/LeaveReview/DefaultView.aspx?id=OP_5CQ_1791__000002_MK168HE,,,
Dollond & Aitchison,OP_5CQ_2589__000001_MK168AR,OPT,31 High Street,,Newport Pagnell,,,MK16 8AR,Tel: 01908 610303, - ,,,No ratings yet Rate it yourself - /Services/opticians/LeaveReview/DefaultView.aspx?id=OP_5CQ_2589__000001_MK168AR,0,0,
D W Roberts Optometrists,OP_5CQ_435__000001_MK111AF,OPT,16 High Street,Stony Stratford,,Buckinghamshire,,MK11 1AF,Tel: 01908 562355, - ,,,No ratings yet Rate it yourself - /Services/opticians/LeaveReview/DefaultView.aspx?id=OP_5CQ_435__000001_MK111AF,0,0,
Lesley A Arkin Optometrist,OP_5CQ_9939__000001_MK111BY,OPT,7 Cofferidge Close,Stony Stratford,Milton Keynes,,,MK11 1BY,Tel: 01908 567672, - ,,,No ratings yet Rate it yourself - /Services/opticians/LeaveReview/DefaultView.aspx?id=OP_5CQ_9939__000001_MK111BY,0,0,
D King Opticians ,OP_5GE_9067__000001_LU77EN,OPT,,2 North Street,,Leighton Buzzard,,LU7 1EN,Tel: 01525 850312, - ,,,No ratings yet Rate it yourself - /Services/opticians/LeaveReview/DefaultView.aspx?id=OP_5GE_9067__000001_LU77EN,0,0,
Specsavers Opticians,OP_5GE___000001_LU71DH,OPT,18 Waterborne Walk,,Leighton Buzzard,Beds,,LU7 1DH,Tel: 01525 219030, - ,,,No ratings yet Rate it yourself - /Services/opticians/LeaveReview/DefaultView.aspx?id=OP_5GE___000001_LU71DH,0,0,
Juma Opticians,OP_5P2_18__000002_LU71DN,OPT,3 High Street,,Leighton Buzzard,Bedfordshire,,LU7 1DN,, - ,,,No ratings yet Rate it yourself - /Services/opticians/LeaveReview/DefaultView.aspx?id=OP_5P2_18__000002_LU71DN,0,0,
Allders Opticians,OP_5GE_11683__000002_LU77EU,OPT,1 Market Square,,Leighton Buzzard,Beds,,LU7 1EU,Tel: 01525 374191, - ,,,No ratings yet Rate it yourself - /Services/opticians/LeaveReview/DefaultView.aspx?id=OP_5GE_11683__000002_LU77EU,0,0,
Brian Clark Opticians,OP_5GE_2973__000001_LU77EA,OPT,38 High Street,,Leighton Buzzard,Beds,,LU7 7EA,Tel: 01525 372238, - ,,,No ratings yet Rate it yourself - /Services/opticians/LeaveReview/DefaultView.aspx?id=OP_5GE_2973__000001_LU77EA,0,0,
Brian Clark,OP_5DP_3224__000001_MK183HB,OPT,42 High Street,Winslow,Buckingham,,,MK18 3HB,Tel: 01296 712043, - ,,,No ratings yet Rate it yourself - /Services/opticians/LeaveReview/DefaultView.aspx?id=OP_5DP_3224__000001_MK183HB,0,0,
Punch Opticians,OP_5GE__000002_LU56BY,OPT,18 High Street,,Toddington,Beds,,LU5 6BY,Tel: 01525 875099, - ,,,2 ratings Rate it yourself - /Services/opticians/LeaveReview/DefaultView.aspx?id=OP_5GE__000002_LU56BY,,,
S H Harrold Ltd,OP_5GE_22__000003_MK451AJ,OPT,2 Steppingley Road,,Flitwick,Beds,,MK45 1AJ,Tel: 01525 714767, - ,,,No ratings yet Rate it yourself - /Services/opticians/LeaveReview/DefaultView.aspx?id=OP_5GE_22__000003_MK451AJ,0,0,
Ideal Eyewear Ltd,D-2705 ,OPT,,"Unit 3 Highfield House,",110 The Hawthorns,Flitwick,Bedfordshire,MK45 1FN,Tel: 01525715759, - ,,,No ratings yet Rate it yourself - /Services/opticians/LeaveReview/DefaultView.aspx?id=D-2705,0,0,
Allders Opticians,OP_5GE_8382__000001_MK451DP,OPT,4a Station Square,,Flitwick,Beds,,MK45 1DP,Tel: 01525 712864, - ,,,No ratings yet Rate it yourself - /Services/opticians/LeaveReview/DefaultView.aspx?id=OP_5GE_8382__000001_MK451DP,0,0,
Punch Opticians,OP_5CQ_9607__000001_MK464AJ,OPT,27 Market Place,,Olney,,,MK46 4AJ,Tel: 01234 712860, - ,,,No ratings yet Rate it yourself - /Services/opticians/LeaveReview/DefaultView.aspx?id=OP_5CQ_9607__000001_MK464AJ,0,0,
Allders Opticians,OP_5GE_23__000004_MK452PJ,OPT,17 Bedford Street,,Ampthill,Beds,,MK45 2LU,Tel: 01525 403647, - ,,,No ratings yet Rate it yourself - /Services/opticians/LeaveReview/DefaultView.aspx?id=OP_5GE_23__000004_MK452PJ,0,0,
DAVIS Optometrists,OP_5CQ_14974__000001_MK464BE,OPT,58 High Street,,,Olney,Buckinghamshire,MK46 4BE,Tel: 01234 712500, - ,,,No ratings yet Rate it yourself - /Services/opticians/LeaveReview/DefaultView.aspx?id=OP_5CQ_14974__000001_MK464BE,0,0,
Vision Express,OLOL/C030435QD__000004_MK181RS,OPT,,7 Meadow Walk,,Buckingham,Buckinghamshire,MK18 1RS,Tel: 01280 822204, - ,,,No ratings yet Rate it yourself - /Services/opticians/LeaveReview/DefaultView.aspx?id=OLOL/C030435QD__000004_MK181RS,0,0,
Boots-Buckingham,OP_5DP_8514__000001_MK181NW,OPT,13 Market Square,,,Buckingham,Buckinghamshire,MK18 1NW,Tel: 01280 812166, - ,,,No ratings yet Rate it yourself - /Services/opticians/LeaveReview/DefaultView.aspx?id=OP_5DP_8514__000001_MK181NW,0,0,
Specsavers Buckingham,S0D4U,OPT,,11 Market Square,,Buckingham,Buckinghamshire,MK18 1NW,Tel: 01280 733081, - ,,,No ratings yet Rate it yourself - /Services/opticians/LeaveReview/DefaultView.aspx?id=S0D4U,0,0,
Specsavers  Buckingham,S0D4U,OPT,,11 Market Square,,Buckingham,Buckinghamshire,MK18 1NW,Tel: 01280 733081, - ,,,No ratings yet Rate it yourself - /Services/opticians/LeaveReview/DefaultView.aspx?id=S0D4U,0,0,
S H Harrold (1937) Ltd,OP_5DP_2786__000001_MK181EL,OPT,3 Bridge Street,,,Buckingham,Buckinghamshire,MK18 1EL,Tel: 01280 813496, - ,,,No ratings yet Rate it yourself - /Services/opticians/LeaveReview/DefaultView.aspx?id=OP_5DP_2786__000001_MK181EL,0,0,
Brown & White Opticians,OP_5GE_8934__000002_LU55ES,OPT,1 Bedford Square,Houghton Regis,,Dunstable,Bedfordshire,LU5 5ES,Tel: 01582 865888, - ,,,No ratings yet Rate it yourself - /Services/opticians/LeaveReview/DefaultView.aspx?id=OP_5GE_8934__000002_LU55ES,0,0,
Grant & Glass Opticians,OP_5GE_11812__000001_LU63SN,OPT,,5a Queensway,,Dunstable,,LU5 4DW,Tel: 01582 608449, - ,,,No ratings yet Rate it yourself - /Services/opticians/LeaveReview/DefaultView.aspx?id=OP_5GE_11812__000001_LU63SN,0,0,
Brown & Wenman Opticians,OP_5GE_980__000001_LU61SA,OPT,,18 Albion Street,,Dunstable,Bedfordshire,LU6 1SA,Tel: 01582 663770, - ,,,No ratings yet Rate it yourself - /Services/opticians/LeaveReview/DefaultView.aspx?id=OP_5GE_980__000001_LU61SA,0,0,yes
Allders Opticians,OP_5GE_10409__000001_LU61LA,OPT,42 High Street North,,Dunstable,Beds,,LU6 1LA,Tel: 01582 664815, - ,,,No ratings yet Rate it yourself - /Services/opticians/LeaveReview/DefaultView.aspx?id=OP_5GE_10409__000001_LU61LA,0,0,
Boots-Dunstable,OP_5GE_11942__000004_LU54RH,OPT,42 Broadwalk North,,,Dunstable,Bedfordshire,LU5 4RH,Tel: 01582 663777, - ,,,No ratings yet Rate it yourself - /Services/opticians/LeaveReview/DefaultView.aspx?id=OP_5GE_11942__000004_LU54RH,0,0,
Specsavers Opticians,OP_5GE_11767__000003_LU54RH,OPT,17-19  Broadwalk,Quadrant,Dunstable,Beds,,LU5 4RH,Tel: 01582 475404, - ,,,No ratings yet Rate it yourself - /Services/opticians/LeaveReview/DefaultView.aspx?id=OP_5GE_11767__000003_LU54RH,0,0,
Dunstable Eye Centre,OP5P222__000002_LU63SN,OPT,,5a Queensway,,Dunstable,Bedfordshire,LU5 4DW,Tel: 01582 608449, - ,,,3 ratings Rate it yourself - /Services/opticians/LeaveReview/DefaultView.aspx?id=OP5P222__000002_LU63SN,,,
I Kara,OP_5GC_12948__000001_LU33BH,OPT,8 The Parade,Sundon Park,,Luton,,LU3 3BH,Tel: 01582 571731, - ,,,No ratings yet Rate it yourself - /Services/opticians/LeaveReview/DefaultView.aspx?id=OP_5GC_12948__000001_LU33BH,0,0,
Chis Archbold Optometrist,OP_5GD_3122__000001_MK428BH,OPT,158 Bedford Road,Kempston,Bedford,,,MK42 8BH,Tel: 01234 855822, - ,,,No ratings yet Rate it yourself - /Services/opticians/LeaveReview/DefaultView.aspx?id=OP_5GD_3122__000001_MK428BH,0,0,
Valerie Curtis,OP_5GD_8192__000001_MK428HP,OPT,142 Bedford Road,Kempston,Bedford,,,MK42 8BH,Tel: 01234 851873, - ,,,No ratings yet Rate it yourself - /Services/opticians/LeaveReview/DefaultView.aspx?id=OP_5GD_8192__000001_MK428HP,0,0,
Allders Opticians,OP_5GE_5127__000003_MK454LL,OPT,79 Bedford Road,,Barton-le-Clay,Beds,,MK45 4LL,Tel: 01582 881478, - ,,,No ratings yet Rate it yourself - /Services/opticians/LeaveReview/DefaultView.aspx?id=OP_5GE_5127__000003_MK454LL,0,0,
Tesco Opticians,OP_5P2_98__000001_LU54JU,OPT,,Skimpot Road,,Dunstable,,LU5 4JU,Tel: 0345 601 3479, - ,,,No ratings yet Rate it yourself - /Services/opticians/LeaveReview/DefaultView.aspx?id=OP_5P2_98__000001_LU54JU,0,0,
Kanzaria Opticians,OP_5GC_12944__000002_LU33SR,OPT,Purley Centre,Marsh Farm,Luton,Beds,,LU3 3SR,Tel: 01582 580310, - ,,,No ratings yet Rate it yourself - /Services/opticians/LeaveReview/DefaultView.aspx?id=OP_5GC_12944__000002_LU33SR,0,0,
Vision Express,OP_HP198BU_46733,OPT,,"Tesco Express, Broadfields Retail Park",,Aylesbury,Buckinghamshire,HP19 8BU,Tel: 0129 685 0228, - ,,,No ratings yet Rate it yourself - /Services/opticians/LeaveReview/DefaultView.aspx?id=OP_HP198BU_46733,0,0,
Nu-Sight Opticians,OP_5DP_4409__000001_HP201RS,OPT,30 Cambridge Street,,,Aylesbury,Buckinghamshire,HP20 1RS,Tel: 01296 398941, - ,,,1 rating Rate it yourself - /Services/opticians/LeaveReview/DefaultView.aspx?id=OP_5DP_4409__000001_HP201RS,,,
F & S Opticians,OP_5DP_9903__000002_HP201RS,OPT,40a Cambridge Street,,Aylesbury,,,HP20 1RS,Tel: 01296 435677, - ,,,No ratings yet Rate it yourself - /Services/opticians/LeaveReview/DefaultView.aspx?id=OP_5DP_9903__000002_HP201RS,0,0,
Specsavers Opticians,OP_5DP_14310__000001_HP201SH,OPT,13-15 High Street,Aylesbury,Buckinghamshire,,,HP20 1SH,Tel: 01296 469 700, - ,,,No ratings yet Rate it yourself - /Services/opticians/LeaveReview/DefaultView.aspx?id=OP_5DP_14310__000001_HP201SH,0,0,
Boots-Aylesbury - Hale Leys,OP_5DP_21__000001_HP201SG,OPT,,4 Hale Leys Shopping Centre,High Street,Aylesbury,Buckinghamshire,HP20 1ST,Tel: 01296 426938, - ,,,No ratings yet Rate it yourself - /Services/opticians/LeaveReview/DefaultView.aspx?id=OP_5DP_21__000001_HP201SG,0,0,
J Coad Ltd,OP_5DP_12091__000001_HP202HU,OPT,Portman House,9 George Street,,Aylesbury,Buckinghamshire,HP20 2HU,Tel: 01296 486228, - ,,,No ratings yet Rate it yourself - /Services/opticians/LeaveReview/DefaultView.aspx?id=OP_5DP_12091__000001_HP202HU,0,0,no
Aylesbury V.E. Limited,,OPT,,Friars Square Shopping Centre,,Aylesbury,,HP20 2SP,Tel: 01296 338 560, - ,,,N/A - Data not available,,,
Kanzaria Opticians,OP_5GC_180__000001_LU32QL,OPT,180 Marsh Road,,Luton,Beds,,LU3 2QL,Tel: 01582 575886, - ,,,1 rating Rate it yourself - /Services/opticians/LeaveReview/DefaultView.aspx?id=OP_5GC_180__000001_LU32QL,,,
Fairford Eyes Ltd,OP_5DP_219__000004_HP197HL,OPT,52 Wedgewood Street,Fairford Leys,Aylesbury,Buckinghamshire,,HP19 7HL,Tel: 01296 399775, - ,,,No ratings yet Rate it yourself - /Services/opticians/LeaveReview/DefaultView.aspx?id=OP_5DP_219__000004_HP197HL,0,0,
S Robinson,OP-5GC__000004_LU32NJ,OPT,70 Marsh Road,,Luton,Beds,,LU3 2NJ,Tel: 01582 503616, - ,,,No ratings yet Rate it yourself - /Services/opticians/LeaveReview/DefaultView.aspx?id=OP-5GC__000004_LU32NJ,0,0,
John Carrington,OP_5AC_11760__000002_NN127BT,OPT,215 - 217 Watling Street,,,Towcester,,NN12 6BX,Tel: 01327 351998, - ,,,No ratings yet Rate it yourself - /Services/opticians/LeaveReview/DefaultView.aspx?id=OP_5AC_11760__000002_NN127BT,0,0,
D W Roberts,OP_5AC_9161__000001_NN126BT,OPT,6 Sponne House Shopping Centre,,Towcester,,,NN12 6BY,Tel: 01327 350240, - ,,,No ratings yet Rate it yourself - /Services/opticians/LeaveReview/DefaultView.aspx?id=OP_5AC_9161__000001_NN126BT,0,0,
Specsavers Opticians,OP_5GD_4520__000001_MK401PS,OPT,Unit 1,47 -51 The Harpur Centre,,Bedford,,MK40 1TP,Tel: 01234 348944, - ,,,No ratings yet Rate it yourself - /Services/opticians/LeaveReview/DefaultView.aspx?id=OP_5GD_4520__000001_MK401PS,0,0,
Vision Express (UK) Ltd,OP_5GD_431__000001_MK401TG,OPT,26 The Harpur Centre,,Bedford,,,MK40 1TG,Tel: 01234 347344, - ,,,No ratings yet Rate it yourself - /Services/opticians/LeaveReview/DefaultView.aspx?id=OP_5GD_431__000001_MK401TG,0,0,
Boots-Bedford - Harper Centre,OP_5GD_2980__000002_MK401TN,OPT,33-37 Harpur Centre,,,Bedford,Bedfordshire,MK40 1TN,Tel: 01234 219153, - ,,,No ratings yet Rate it yourself - /Services/opticians/LeaveReview/DefaultView.aspx?id=OP_5GD_2980__000002_MK401TN,0,0,
Allders Opticians,OP_5GD_10844__000001_MK401RY,OPT,49 High Street,,Bedford,,,MK40 1RY,Tel: 01234 344866, - ,,,No ratings yet Rate it yourself - /Services/opticians/LeaveReview/DefaultView.aspx?id=OP_5GD_10844__000001_MK401RY,0,0,
Donne & Browning Opticians,OP_5GD_2__000001_MK401NS,OPT,,3-4 The Arcade,,Bedford,Bedfordshire,MK40 1NS,Tel: 01234 349933, - ,,,No ratings yet Rate it yourself - /Services/opticians/LeaveReview/DefaultView.aspx?id=OP_5GD_2__000001_MK401NS,0,0,
Humphriss & Burgess,OP_5GD_2276__000001_MK403HD,OPT,28a Mill Street,,,Bedford,,MK40 3HD,Tel: 01234 354343, - ,,,No ratings yet Rate it yourself - /Services/opticians/LeaveReview/DefaultView.aspx?id=OP_5GD_2276__000001_MK403HD,0,0,
Alan Brunker,OP_5GD_1__000001_MK402NP,OPT,25 St Peter's Street,,Bedford,,,MK40 2PN,Tel: 01234 353410, - ,,,No ratings yet Rate it yourself - /Services/opticians/LeaveReview/DefaultView.aspx?id=OP_5GD_1__000001_MK402NP,0,0,
Homesight,OP_5P2_42__000001_MK402PJ,OPT,1 Pemberley Lane,1 Pemberley Lane,Bedford,Bedford,Bedfordshire,MK40 2PJ,Tel: 07772 981725, - ,,,No ratings yet Rate it yourself - /Services/opticians/LeaveReview/DefaultView.aspx?id=OP_5P2_42__000001_MK402PJ,0,0,
Brian Clark Opticians,OP_5GW_8971__000001_HP234AF,OPT,110 High Street,,Tring,,,HP23 4AF,Tel: 01442 823034, - ,,,No ratings yet Rate it yourself - /Services/opticians/LeaveReview/DefaultView.aspx?id=OP_5GW_8971__000001_HP234AF,0,0,
Wootton Opticians,OP_5LW_NN46FF__000002_NN46FF,OPT,"9 Tudor Court, Wootton Hope Drive",Wootton Fields,Northampton,Northamptonshire,,NN4 6FF,Tel: 01604 875111, - ,,,No ratings yet Rate it yourself - /Services/opticians/LeaveReview/DefaultView.aspx?id=OP_5LW_NN46FF__000002_NN46FF,0,0,
Kanzaria Opticians,OP_5GC_2101__000003_LU11EH,OPT,104 Dunstable Road,,Luton,Beds,,LU1 1EW,Tel: 01582 480776, - ,,,No ratings yet Rate it yourself - /Services/opticians/LeaveReview/DefaultView.aspx?id=OP_5GC_2101__000003_LU11EH,0,0,
Allders Opticians,OP_5GC_10407__000002_LU11EH,OPT,88 Dunstable Road,,Luton,Beds,,LU1 1EH,Tel: 01582 725136, - ,,,No ratings yet Rate it yourself - /Services/opticians/LeaveReview/DefaultView.aspx?id=OP_5GC_10407__000002_LU11EH,0,0,
Brown & White Opticians,OP_5GC_6142__000001_LU12RD,OPT,,172 The Mall,,Luton,Bedfordshire,LU1 2TL,Tel: 01582 720106, - ,,,No ratings yet Rate it yourself - /Services/opticians/LeaveReview/DefaultView.aspx?id=OP_5GC_6142__000001_LU12RD,0,0,
John Kaye Optometrist,OP_5GD10215__000001_MK418HF,OPT,8 Library Walk,,Bedford,,,MK41 8HF,Tel: 01234 325060, - ,,,28 ratings Rate it yourself - /Services/opticians/LeaveReview/DefaultView.aspx?id=OP_5GD10215__000001_MK418HF,,,
Luton Vision Express,OP_5GC_12947__000004_LU12TJ,OPT,,94 The Mall,,Luton,Bedfordshire,LU1 2TQ,Tel: 01582 417417, - ,,,1 rating Rate it yourself - /Services/opticians/LeaveReview/DefaultView.aspx?id=OP_5GC_12947__000004_LU12TJ,,,
Specsavers Opticians,OP_5GC_12037__000001_LU12AX,OPT,26 George Street,,Luton,Beds,,LU1 2AX,Tel: 01582 484300, - ,,,No ratings yet Rate it yourself - /Services/opticians/LeaveReview/DefaultView.aspx?id=OP_5GC_12037__000001_LU12AX,0,0,
Boots-Luton - Arndale Centre (in Boots UK),OP_5GC_4768__000002_LU12BG,OPT,82-86 The Arndale Centre,,Luton,Beds,,LU1 2BG,Tel: 01582 424730, - ,,,3 ratings Rate it yourself - /Services/opticians/LeaveReview/DefaultView.aspx?id=OP_5GC_4768__000002_LU12BG,,,
Elcott Opticians,OP_5GC__000001_LU12AF,OPT,Elcott Opticians,19 George Street,,Luton,Bedfordshire,LU1 2AF,Tel: 01582 415379, - ,,,No ratings yet Rate it yourself - /Services/opticians/LeaveReview/DefaultView.aspx?id=OP_5GC__000001_LU12AF,0,0,
iCareCentre Opticians,OP_5GC_489__000003_LU12TJ,OPT,Unit 16 The Mall,,,Luton,Bedfordshire,LU1 2TE,Tel: 01582 728731, - ,,,1 rating Rate it yourself - /Services/opticians/LeaveReview/DefaultView.aspx?id=OP_5GC_489__000003_LU12TJ,,,
Direkt Optik,OP_5GC___000002_LU12AA,OPT,3-5 George Street,,Luton,Beds,,LU1 2AA,Tel: 01582 455513, - ,,,No ratings yet Rate it yourself - /Services/opticians/LeaveReview/DefaultView.aspx?id=OP_5GC___000002_LU12AA,0,0,
Luton Optical Centre,OP_5GC_16__000001_LU12TA,OPT,32 Market Hall,The Arndale Centre,Luton,Beds,,LU1 2TA,Tel: 01582 402773, - ,,,1 rating Rate it yourself - /Services/opticians/LeaveReview/DefaultView.aspx?id=OP_5GC_16__000001_LU12TA,,,
Mark Darling Opticians,OP_5LW _NN49DL__000001_NN49DL,OPT,29 St Leonards Road,Far Cotton,Northampton,Northamptonshire,,NN4 8DL,Tel: 01604 765855, - ,,,No ratings yet Rate it yourself - /Services/opticians/LeaveReview/DefaultView.aspx?id=OP_5LW _NN49DL__000001_NN49DL,0,0,
Stephen Hing Opticians,OP_5GE_7326__000001_SG175AE,OPT,14a Clifton Road,,Shefford,Beds,,SG17 5AE,Tel: 01462 811852, - ,,,No ratings yet Rate it yourself - /Services/opticians/LeaveReview/DefaultView.aspx?id=OP_5GE_7326__000001_SG175AE,0,0,
Eye to Eye Opticians,OP_5LW_7343__000001_NN15BD,OPT,Northampton General Hospital NHS Trust,,Northampton,Northamptonshire,,NN1 5BD,Tel: 01604 545722, - ,,,No ratings yet Rate it yourself - /Services/opticians/LeaveReview/DefaultView.aspx?id=OP_5LW_7343__000001_NN15BD,0,0,
Mode Designer Eyewear,OP_5LW_NN11JW__000001_NN11JW,OPT,38 St Giles Street,,Northampton,Northamptonshire,,NN1 1JW,Tel: 01604 632600, - ,,,No ratings yet Rate it yourself - /Services/opticians/LeaveReview/DefaultView.aspx?id=OP_5LW_NN11JW__000001_NN11JW,0,0,
Optical Express,NN1 2BN_33345,OPT,Aquila House,St Giles Terrace,,Northampton,Northamptonshire,NN1 2BN,Tel: 0800 023 2020, - ,,,No ratings yet Rate it yourself - /Services/opticians/LeaveReview/DefaultView.aspx?id=NN1 2BN_33345,0,0,
Specsavers,OP_5LW_1800__000001_NN12AD,OPT,50-52 Abington Street,,Northampton,,,NN1 2AP,Tel: 01604 604996, - ,,,No ratings yet Rate it yourself - /Services/opticians/LeaveReview/DefaultView.aspx?id=OP_5LW_1800__000001_NN12AD,0,0,
SHEINMAN OPTICIANS,OP_5LW_2934__000001_NN12BP,OPT,Turville House,106-110 Abington Street,Northampton,,,NN1 2BP,Tel: 01604 626161, - ,,,No ratings yet Rate it yourself - /Services/opticians/LeaveReview/DefaultView.aspx?id=OP_5LW_2934__000001_NN12BP,0,0,
Eyeclinic of Northampton,EYECLINIC__000001_NN11RS,OPT,24 Gold Street,,Northampton,Northamptonshire,,NN1 1RS,Tel: 01604 624723, - ,,,No ratings yet Rate it yourself - /Services/opticians/LeaveReview/DefaultView.aspx?id=EYECLINIC__000001_NN11RS,0,0,
Boots-Northampton - Abington St,OP_5LW_1076__000001_NN12BH,OPT,73a Abington Street,,Northampton,Northampton,,NN1 2BH,Tel: 01604 636864, - ,,,No ratings yet Rate it yourself - /Services/opticians/LeaveReview/DefaultView.aspx?id=OP_5LW_1076__000001_NN12BH,0,0,
Chec Northampton,C5U5V,OPT,,Units 1A & 1B Sol,,Northampton,Northamptonshire,NN1 1SR,Tel: 0330 100 4730, - ,,,27 ratings Rate it yourself - /Services/opticians/LeaveReview/DefaultView.aspx?id=C5U5V,,,