Organisation Name,NACS Code,Organisation Type,Address1,Address2,Address3,Address4,Address5,PostCode,Telephone Number,Opening time,Value  (Opening time),Banding Classification  (Opening time),NHS.UK users rating,Value  (NHS.UK users rating),Banding Classification  (NHS.UK users rating),Car parking (Is there car parking at this organisation?)
David Hodes Ltd,OP_5JX_9703__000002_M251AY,OPT,14 Longfield Centre,Bury New Road,Prestwich,,,M25 1AY,Tel: 0161 773 9584, - ,,,4 ratings Rate it yourself - /Services/opticians/LeaveReview/DefaultView.aspx?id=OP_5JX_9703__000002_M251AY,,,
The Village Optician Ltd,OP_5JX_493__000001_M251AX,OPT,470 Bury New Road,Prestwich,Manchester,,,M25 1AX,Tel: 0161 773 0069, - ,,,No ratings yet Rate it yourself - /Services/opticians/LeaveReview/DefaultView.aspx?id=OP_5JX_493__000001_M251AX,0,0,
I C Optical Limited,OP_5J5_14215__000001_M250AS,OPT,56 Bishops  Road,Prestwich,Manchester,,,M25 0AS,Tel: 0161 773 3343, - ,,,No ratings yet Rate it yourself - /Services/opticians/LeaveReview/DefaultView.aspx?id=OP_5J5_14215__000001_M250AS,0,0,
Domicillary only Ian Clyne,OP_5LH_14231__000002_M250AS,OPT,56 Bishops Road,Prestwich,Manchester,,,M25 0AS,Tel: 0161 773 3343, - ,,,No ratings yet Rate it yourself - /Services/opticians/LeaveReview/DefaultView.aspx?id=OP_5LH_14231__000002_M250AS,0,0,
Travers Opticians,OP-5J5 -473__000013_M418TW,OPT,,39 Bishops Road,,manchester,,M25 0HT,Tel: 0161 746 8098, - ,,,2 ratings Rate it yourself - /Services/opticians/LeaveReview/DefaultView.aspx?id=OP-5J5 -473__000013_M418TW,,,
Prais Opticians,OP_5JX_13741__000001_M250JU,OPT,46 Bury New Road,Prestwich,Manchester,,,M25 0JU,Tel: 0161 798 8800, - ,,,1 rating Rate it yourself - /Services/opticians/LeaveReview/DefaultView.aspx?id=OP_5JX_13741__000001_M250JU,,,
Instore Optician,CO-5188,OPT,,"Morrisons, 5 Stanley Road",,Whitefield,Greater Manchester,M45 8QH,Tel: 0161 2220 920, - ,,,2 ratings Rate it yourself - /Services/opticians/LeaveReview/DefaultView.aspx?id=CO-5188,,,
Specs Direct Opticians,OP_5JX_13738__000001_M456BG,OPT,8 Elms Square,Whitefield,Manchester,,,M45 7TA,Tel: 0161 767 9740, - ,,,No ratings yet Rate it yourself - /Services/opticians/LeaveReview/DefaultView.aspx?id=OP_5JX_13738__000001_M456BG,0,0,
Robert Glass Opticians,OP_5F5_7774__000001_M74QJ,OPT,3 King Edward Buildings,Bury Old Road,Salford,Manchester,,M7 4QJ,Tel: 0161 740 3069, - ,,,No ratings yet Rate it yourself - /Services/opticians/LeaveReview/DefaultView.aspx?id=OP_5F5_7774__000001_M74QJ,0,0,
Harris S J,OP_5F5_14700__000001_M74EF,OPT,37 Legh Street,Salford,,Manchester,,M7 4EF,Tel: 0161 792 0380, - ,,,No ratings yet Rate it yourself - /Services/opticians/LeaveReview/DefaultView.aspx?id=OP_5F5_14700__000001_M74EF,0,0,
The Eye Site Opticians ,OP_5CR_3302__000001_M85BN,OPT,58 Bury Old Road,Cheetham,Manchester,,,M8 5BN,Tel: 0161 795 2341, - ,,,1 rating Rate it yourself - /Services/opticians/LeaveReview/DefaultView.aspx?id=OP_5CR_3302__000001_M85BN,,,
Stotts Opticians,OP_5JX_5509__000001_BL98JN,OPT,113 Parr Lane,Unsworth,Bury,,,BL9 8JN,Tel: 0161 796 6170, - ,,,No ratings yet Rate it yourself - /Services/opticians/LeaveReview/DefaultView.aspx?id=OP_5JX_5509__000001_BL98JN,0,0,
The Eye Site (Opticians) Ltd,OP_5F5_14706__000003_M74AS,OPT,,47 Leicester Road,Salford,Manchester,,M7 4AS,Tel: 0161 792 8181, - ,,,No ratings yet Rate it yourself - /Services/opticians/LeaveReview/DefaultView.aspx?id=OP_5F5_14706__000003_M74AS,0,0,
Vision Service Opticians,OP_5CR_11066__000001_M87ER,OPT,4 Progress Buildings,Halliwell Lane,Cheetham Hill,Manchester,,M8 9ER,Tel: 0161 740 9009, - ,,,1 rating Rate it yourself - /Services/opticians/LeaveReview/DefaultView.aspx?id=OP_5CR_11066__000001_M87ER,,,
Domiciliary Iris Services Ltd,2465LH__000001_M66DQ,OPT,1st Floor Cromwell House,Cromwell Road,Salford,,,M6 6DQ,Tel: 0161 737 4971, - ,,,No ratings yet Rate it yourself - /Services/opticians/LeaveReview/DefaultView.aspx?id=2465LH__000001_M66DQ,0,0,
Rose Optical Services (North) Ltd,OP_5F5_14701__000004_M66DE,OPT,"1st Floor, Cromwell House",Cromwell Road,Salford,Manchester,,M6 6DE,Tel: 0161 925 9888, - ,,,No ratings yet Rate it yourself - /Services/opticians/LeaveReview/DefaultView.aspx?id=OP_5F5_14701__000004_M66DE,0,0,
Iris Domiciliary,OL/6735169 5NP__000012_M66DE,OPT,Cromwell Road,,Salford,,,M6 6DE,, - ,,,No ratings yet Rate it yourself - /Services/opticians/LeaveReview/DefaultView.aspx?id=OL/6735169 5NP__000012_M66DE,0,0,
Maudsley Opticians,OP_5F5_14703__000001_M272EW,OPT,718 Bolton Road,Pendlebury,,Manchester,,M27 6EW,Tel: 0161 794 2661, - ,,,No ratings yet Rate it yourself - /Services/opticians/LeaveReview/DefaultView.aspx?id=OP_5F5_14703__000001_M272EW,0,0,
Maxwell Kay Opticians Ltd,OP_5JX_2911__000001_M261NQ,OPT,26 Blackburn Street,Radcliffe,Manchester,,,M26 1NQ,Tel: 0161 723 3397, - ,,,No ratings yet Rate it yourself - /Services/opticians/LeaveReview/DefaultView.aspx?id=OP_5JX_2911__000001_M261NQ,0,0,
Arrowsmith Eyecare,OP_5CR_9836__000002_M95TT,OPT,672 Rochdale Road,Harpurhey,,Manchester,,M9 5TT,Tel: 0161 205 2575, - ,,,1 rating Rate it yourself - /Services/opticians/LeaveReview/DefaultView.aspx?id=OP_5CR_9836__000002_M95TT,,,
Healthcall Optical Services Limited,OP_5J5_14219__000001_M67HL,OPT,36/37 Leslie Hough Way,Salford,Manchester,,,M6 6AJ,Tel: 0845 601 7241, - ,,,No ratings yet Rate it yourself - /Services/opticians/LeaveReview/DefaultView.aspx?id=OP_5J5_14219__000001_M67HL,0,0,
Specsavers Home Visits  (Domiciliary only)  ,OP_5LH_14239__000002_M66DE,OPT,,Lesley Hough Way,Manchester,Salford,,M6 6AJ,Tel: 0161 925 9888, - ,,,40 ratings Rate it yourself - /Services/opticians/LeaveReview/DefaultView.aspx?id=OP_5LH_14239__000002_M66DE,,,
Optical Express ,OP_5CR_3256__000002_M91DH,OPT,"Unit 31, North City Shopping Centre",Lee Road,,Manchester,Lancashire,M9 4DH,Tel: 0800 023 2020, - ,,,No ratings yet Rate it yourself - /Services/opticians/LeaveReview/DefaultView.aspx?id=OP_5CR_3256__000002_M91DH,0,0,
Specsavers Harpurhey ,000006__000001_M94DH,OPT,Unit 41,North City Shopping Centre,,Harpurhey,,M9 4DH,Tel: 0161 202 8710, - ,,,1 rating Rate it yourself - /Services/opticians/LeaveReview/DefaultView.aspx?id=000006__000001_M94DH,,,
Optieye Care,OP_5F5_2755__000003_M71QE,OPT,6 Mocha Parade,Salford,,Manchester,,M7 1QE,Tel: 0161 839 2884, - ,,,No ratings yet Rate it yourself - /Services/opticians/LeaveReview/DefaultView.aspx?id=OP_5F5_2755__000003_M71QE,0,0,
Value Vision ,OP_5F5_14707__000003_M274BH,OPT,,27 The Parade,Swinton,Manchester,,M27 4BH,Tel: 0161 794 3532, - ,,,9 ratings Rate it yourself - /Services/opticians/LeaveReview/DefaultView.aspx?id=OP_5F5_14707__000003_M274BH,,,
Specsavers Opticians,OP_5F5_8729__000002_M274BH,OPT,15 The Parade,Swinton,,Manchester,Lancashire,M27 4BH,Tel: 0161 794 1887, - ,,,No ratings yet Rate it yourself - /Services/opticians/LeaveReview/DefaultView.aspx?id=OP_5F5_8729__000002_M274BH,0,0,yes
Stotts Opticians,OP_5F5_108__000001_M274AE,OPT,137 Chorley Road,Swinton,Manchester,,,M27 4AE,Tel: 0161 7947703, - ,,,No ratings yet Rate it yourself - /Services/opticians/LeaveReview/DefaultView.aspx?id=OP_5F5_108__000001_M274AE,0,0,
Asda Stores Ltd,OP_5JX_11062__000002_BL98RS,OPT,Asda Store,Pilsworth Road,Pilsworth,Bury,,BL9 8RS,Tel: 0161 3512520, - ,,,No ratings yet Rate it yourself - /Services/opticians/LeaveReview/DefaultView.aspx?id=OP_5JX_11062__000002_BL98RS,0,0,
Scrivens Opticians and Hearing Centre,OP_5F5_14697__000002_M65JA,OPT,,79 Pendleton Way,Salford,Manchester,,M6 5JA,Tel: 0161 736 4732, - ,,,No ratings yet Rate it yourself - /Services/opticians/LeaveReview/DefaultView.aspx?id=OP_5F5_14697__000002_M65JA,0,0,
Specsavers Opticians,OP_5F5_12099__000001_M65FD,OPT,24 Briar Hill Way,Salford,Manchester,,,M6 5FD,Tel: 0161 743 8182, - ,,,1 rating Rate it yourself - /Services/opticians/LeaveReview/DefaultView.aspx?id=OP_5F5_12099__000001_M65FD,,,
Boots-Middleton ,OP_5F4_625__000004_M244EL,OPT,G8 Arndale Centre,,,Middleton,Lancashire,M24 4EL,Tel: 0161 655 3021, - ,,,No ratings yet Rate it yourself - /Services/opticians/LeaveReview/DefaultView.aspx?id=OP_5F4_625__000004_M244EL,0,0,
Specsavers Opticians,OP_5F4_3314__000005_M244EL,OPT,Unit G15,Arndale Shopping Centre,Middleton,,,M24 4EL,Tel: 0161 654 0440, - ,,,No ratings yet Rate it yourself - /Services/opticians/LeaveReview/DefaultView.aspx?id=OP_5F4_3314__000005_M244EL,0,0,
Eyeline Opticians,OP_5F5_4988__000001_M65HW,OPT,60 Fitzgerald Way,Salford,Manchester,,,M6 5HW,Tel: 0161 737 1557, - ,,,No ratings yet Rate it yourself - /Services/opticians/LeaveReview/DefaultView.aspx?id=OP_5F5_4988__000001_M65HW,0,0,
Tesco Opticians,OP_5NQ_1998__000002_M241HB,OPT,Tesco Extra,Barton Road,,Middleton,,M24 1HB,Tel: 0845 601 3479, - ,,,No ratings yet Rate it yourself - /Services/opticians/LeaveReview/DefaultView.aspx?id=OP_5NQ_1998__000002_M241HB,0,0,
D Igoe Optometrists,OP_5F4_3971__000002_M246UQ,OPT,36 Long Street,Middleton,Manchester,,,M24 6UQ,Tel: 0161 653 0771, - ,,,No ratings yet Rate it yourself - /Services/opticians/LeaveReview/DefaultView.aspx?id=OP_5F4_3971__000002_M246UQ,0,0,
Alan Miller Ltd,OP_5F5_10806__000001_M65GY,OPT,,557 Liverpool Street,Salford,Manchester,,M6 5GY,Tel: 0161 736 3640, - ,,,No ratings yet Rate it yourself - /Services/opticians/LeaveReview/DefaultView.aspx?id=OP_5F5_10806__000001_M65GY,0,0,
Vision Express Ltd,OP_5CR_12274__000001_M42HU,OPT,Unit 62,City Centre,Manchester,,,M4 3AQ,Tel: 0161 832 8855, - ,,,No ratings yet Rate it yourself - /Services/opticians/LeaveReview/DefaultView.aspx?id=OP_5CR_12274__000001_M42HU,0,0,
City Specs,OP_M14AJ_30180,OPT,,6 Royal Exchange Aracade,,Manchester,,M2 7EA,Tel: 0161 236 6697, - ,,,No ratings yet Rate it yourself - /Services/opticians/LeaveReview/DefaultView.aspx?id=OP_M14AJ_30180,0,0,
Specsavers Opticians,OP_5CR_11534__000002_M42HU,OPT,Unit 84,Halle Mall,Manchester,,,M4 2HU,Tel: 0161 834 6665, - ,,,No ratings yet Rate it yourself - /Services/opticians/LeaveReview/DefaultView.aspx?id=OP_5CR_11534__000002_M42HU,0,0,
Boots-Manchester - Market Street,OP_5CR_13076__000001_M11PL,OPT,32 Market Street,,,Manchester,Lancashire,M1 1PL,Tel: 0161 832 3823, - ,,,3 ratings Rate it yourself - /Services/opticians/LeaveReview/DefaultView.aspx?id=OP_5CR_13076__000001_M11PL,,,
Framed Opticians,00008__000001_M26AB,OPT,1-3 St Ann's Passage,"1-3 St Ann's Passage, King Street",,Manchester,,M2 6AB,Tel: 0161 839 6753, - ,,,No ratings yet Rate it yourself - /Services/opticians/LeaveReview/DefaultView.aspx?id=00008__000001_M26AB,0,0,
Wallwork Opticians,OP_5F5_11862__000001_M270AG,OPT,,308 Worsley Road,Swinton,Manchester,,M27 0AG,Tel: 0161 794 2454, - ,,,2 ratings Rate it yourself - /Services/opticians/LeaveReview/DefaultView.aspx?id=OP_5F5_11862__000001_M270AG,,,
Jones & Co Styling Opticians,OP_5CR_13204__000001_M24WQ,OPT,82 King Street,City Centre,,Manchester,,M2 4WQ,Tel: 0161 834 7798, - ,,,No ratings yet Rate it yourself - /Services/opticians/LeaveReview/DefaultView.aspx?id=OP_5CR_13204__000001_M24WQ,0,0,
Optical Express,OP_12345_M3 4DN,OPT,7 St John Street,,Deansgate,Manchester,Lancashire,M3 4DN,Tel: 0800 023 2020, - ,,,No ratings yet Rate it yourself - /Services/opticians/LeaveReview/DefaultView.aspx?id=OP_12345_M3 4DN,0,0,
Mobile Vision Care Ltd,01-27946,OPT,,26-28 Hilton St,,Manchester,,M1 2EH,, - ,,,No ratings yet Rate it yourself - /Services/opticians/LeaveReview/DefaultView.aspx?id=01-27946,0,0,
Eyeline Opticians,OP_M53PH_45793,OPT,,100 Phoebe Street,,"Radclyffe Park, Salford",,M5 3PH,, - ,,,No ratings yet Rate it yourself - /Services/opticians/LeaveReview/DefaultView.aspx?id=OP_M53PH_45793,0,0,
The Optical Shop,,OPT,,15 Princess Parade,Mill Gate Shopping Centre,Bury,Greater Manchester,BL9 0QL,Tel: 0161 2225020, - ,,,N/A - Data not available,,,
Yates & Suddell,OP_5JX_100__000001_BL90QG,OPT,,15-19 Minden Parade,,Bury,Greater Manchester,BL9 0QG,Tel: 0161 7642209, - ,,,No ratings yet Rate it yourself - /Services/opticians/LeaveReview/DefaultView.aspx?id=OP_5JX_100__000001_BL90QG,0,0,
Sime W E,OP_5F5_8547__000001_M300DF,OPT,15 Church Street,Eccles,,Manchester,,M30 0DF,Tel: 0161 789 1322, - ,,,No ratings yet Rate it yourself - /Services/opticians/LeaveReview/DefaultView.aspx?id=OP_5F5_8547__000001_M300DF,0,0,
Boots-Bury - Union Arcade,OP_5JX_10975__000001_BL90QF,OPT,Unit 7 Union Arcade,Millgate Shopping Centre,,Bury,Lancashire,BL9 0QF,Tel: 0161 705 1157, - ,,,No ratings yet Rate it yourself - /Services/opticians/LeaveReview/DefaultView.aspx?id=OP_5JX_10975__000001_BL90QF,0,0,
Specsavers Opticians,OP_5JX_717__000001_BL90BX,OPT,39/41,The Haymarket,Millgate Shopping Centre,Bury,Lancashire,BL9 0BX,Tel: 0161 763 3916, - ,,,No ratings yet Rate it yourself - /Services/opticians/LeaveReview/DefaultView.aspx?id=OP_5JX_717__000001_BL90BX,0,0,
Rose & Tarrant Opticians,OP_5JX_13736__000001_BL90AD,OPT,,14 Crompton Street,Lancashire,Bury,Lancashire,BL9 0AD,Tel: 0161 764 4420, - ,,,1 rating Rate it yourself - /Services/opticians/LeaveReview/DefaultView.aspx?id=OP_5JX_13736__000001_BL90AD,,,
Specscart (Union Street),TP9EC,OPT,Specscart Bury,10 Union Street,,Bury,Greater Manchester,BL9 0NY,Tel: 01613125767, - ,,,No ratings yet Rate it yourself - /Services/opticians/LeaveReview/DefaultView.aspx?id=TP9EC,0,0,
Specsavers Opticians,C/052__000002_M300EA,OPT,,.16 The Mall,Eccles,Manchester,,M30 0EA,Tel: 0161 787 6900, - ,,,No ratings yet Rate it yourself - /Services/opticians/LeaveReview/DefaultView.aspx?id=C/052__000002_M300EA,0,0,
Gent Brothers Opticians ,OP_5CR_11412__000001_M400JA,OPT,325 Hollinwood Avenue,New Moston,Manchester,,,M40 0JA,Tel: 0161 681 1348, - ,,,3 ratings Rate it yourself - /Services/opticians/LeaveReview/DefaultView.aspx?id=OP_5CR_11412__000001_M400JA,,,
Domiciliary only Ian Creek Opticians ,OP_5LH_14225__000002_M400JA,OPT,325 Hollinwood Avenue,New Moston,Manchester,,,M40 0JA,Tel: 0161 681 1348, - ,,,No ratings yet Rate it yourself - /Services/opticians/LeaveReview/DefaultView.aspx?id=OP_5LH_14225__000002_M400JA,0,0,
Vision Express Ltd,OP_5JX_BL90JN__000001_BL90JN,OPT,19 Central Street,The Rock,Bury,,,BL9 0JN,Tel: 0161 797 6639, - ,,,No ratings yet Rate it yourself - /Services/opticians/LeaveReview/DefaultView.aspx?id=OP_5JX_BL90JN__000001_BL90JN,0,0,
Domiciliary only Martin J Berry,OP_5LH_14230__000003_M300LH,OPT,110 Church Street,Eccles,,Manchester,,M30 0LH,Tel: 0161 789 3875, - ,,,No ratings yet Rate it yourself - /Services/opticians/LeaveReview/DefaultView.aspx?id=OP_5LH_14230__000003_M300LH,0,0,
Smiths Opticians Ltd,OP_5F5_8802__000001_M309LF,OPT,263 Monton Road,Eccles,Manchester,Eccles,,M30 9LF,Tel: 0161 789 1353, - ,,,1 rating Rate it yourself - /Services/opticians/LeaveReview/DefaultView.aspx?id=OP_5F5_8802__000001_M309LF,,,
P Toleman Opticians,OP_5CR_8861__000001_M106JF,OPT,86 Old Church Street,Newton Heath,Manchester,,,M40 2JF,Tel: 0161 681 5931, - ,,,1 rating Rate it yourself - /Services/opticians/LeaveReview/DefaultView.aspx?id=OP_5CR_8861__000001_M106JF,,,
J M Bluston Opticians,OP_5HQ_13084__000001_BL31HN,OPT,38 Market Street,Little Lever,,Bolton,,BL3 1HN,Tel: 01204 575441, - ,,,2 ratings Rate it yourself - /Services/opticians/LeaveReview/DefaultView.aspx?id=OP_5HQ_13084__000001_BL31HN,,,
Shaw's Opticians,OP_5F4_1008__000002_OL101HX,OPT,39 Market Street,39 Market Street,Heywood,Heywood,,OL10 1HX,Tel: 01706 369369, - ,,,1 rating Rate it yourself - /Services/opticians/LeaveReview/DefaultView.aspx?id=OP_5F4_1008__000002_OL101HX,,,
The Eye Centre (Heywood) Ltd,OPT_OL104LY_1,OPT,,58 Market Street,,Heywood,Lancashire,OL10 4LY,Tel: 01706 620432, - ,,,1 rating Rate it yourself - /Services/opticians/LeaveReview/DefaultView.aspx?id=OPT_OL104LY_1,,,
Anderson J Opticians,OP_5F5_3112__000001_M300WZ,OPT,,118 Liverpool Road,Eccles,Manchester,,M30 0WZ,Tel: 0161 789 2137, - ,,,No ratings yet Rate it yourself - /Services/opticians/LeaveReview/DefaultView.aspx?id=OP_5F5_3112__000001_M300WZ,0,0,
DG Opticians,OP_5F4_4583__000001_OL101AA,OPT,7 Hornby Street,,Heywood,,,OL10 1AA,Tel: 01706 369525, - ,,,No ratings yet Rate it yourself - /Services/opticians/LeaveReview/DefaultView.aspx?id=OP_5F4_4583__000001_OL101AA,0,0,
Costco Wholesale UK Limited,OP_OL98AU_46293,OPT,,The Broadway,Chadderton,Oldham,,OL9 8AU,Tel: 0161 684 2015, - ,,,No ratings yet Rate it yourself - /Services/opticians/LeaveReview/DefaultView.aspx?id=OP_OL98AU_46293,0,0,
Asda Vision Centre,00003__000001_M113BD,OPT,"Sports City , Ashton New Road",Beswick,,Manchester,,M11 3BD,Tel: 01612 303512, - ,,,No ratings yet Rate it yourself - /Services/opticians/LeaveReview/DefaultView.aspx?id=00003__000001_M113BD,0,0,
Eye Pad Opticians ,CO-4696,OPT,,4 Seymour Grove,Old Trafford,Manchester,Lancashire,M16 0LH,Tel: 0161 478 0908, - ,,,No ratings yet Rate it yourself - /Services/opticians/LeaveReview/DefaultView.aspx?id=CO-4696,0,0,
Revolution Eyecare Opticians,OLCO32025HQ__000001_BL49DJ,OPT,,26 Higher Market Street,Farnworth,Bolton,,BL4 9AJ,Tel: 01204 570800, - ,,,No ratings yet Rate it yourself - /Services/opticians/LeaveReview/DefaultView.aspx?id=OLCO32025HQ__000001_BL49DJ,0,0,
Tesco Opticians,OP_19985J5__000002_M350EJ,OPT,Oldham Road,Failsworth,Oldham,Oldham,,M35 0EJ,Tel: 0161 251 7438, - ,,,No ratings yet Rate it yourself - /Services/opticians/LeaveReview/DefaultView.aspx?id=OP_19985J5__000002_M350EJ,0,0,
Focus Optics,5J5 8408,OPT,Focus Optics,Failsworth District Centre,Ashton Road West,"Failsworth, Manchester",,M35 0AD,Tel: 0161 684 8659, - ,,,No ratings yet Rate it yourself - /Services/opticians/LeaveReview/DefaultView.aspx?id=5J5 8408,0,0,
Martin Berry Ltd,OP_5HQ_2317__000001_BL49AE,OPT,116 Market Street,Farnworth,Bolton,,,BL4 9AE,Tel: 01204 572838, - ,,,No ratings yet Rate it yourself - /Services/opticians/LeaveReview/DefaultView.aspx?id=OP_5HQ_2317__000001_BL49AE,0,0,
Optometry Clinics,000007__000004_M601QD,OPT,Carys Bannister Building,Dover Street,,Manchester,,M13 9PT,Tel: 0161 306 3860, - ,,,No ratings yet Rate it yourself - /Services/opticians/LeaveReview/DefaultView.aspx?id=000007__000004_M601QD,0,0,
Spurretts Opticians,OP_5HQ_5178__000002_BL49DR,OPT,21 Brackley Street,,,"Farnworth, Bolton",Lancashire,BL4 9DS,Tel: 01204 706971, - ,,,1 rating Rate it yourself - /Services/opticians/LeaveReview/DefaultView.aspx?id=OP_5HQ_5178__000002_BL49DR,,,
Optical Direct Ltd,OLO1185525HQ__000003_BL49DR,OPT,Brackley Street,Farnworth,Bolton,,,BL4 9DR,Tel: 01204 707470, - ,,,No ratings yet Rate it yourself - /Services/opticians/LeaveReview/DefaultView.aspx?id=OLO1185525HQ__000003_BL49DR,0,0,
Tesco Opticians,OP_M320ZS_84741,OPT,,Chester Road,,Stretford,,M32 0ZS,Tel: 0845 601 3479, - ,,,No ratings yet Rate it yourself - /Services/opticians/LeaveReview/DefaultView.aspx?id=OP_M320ZS_84741,0,0,
Vision Care for Homeless People,OPT_M156JS_1,OPT,Cornerstone Day Centre,104B Denmark Road,,Manchester,,M15 6JS,Tel: 020 3286 4186, - ,,,No ratings yet Rate it yourself - /Services/opticians/LeaveReview/DefaultView.aspx?id=OPT_M156JS_1,0,0,
Lyne J,OP_5F5_9055__000001_M283KT,OPT,Walkden Eye Centre,14 Hodge Road,Walkden,Manchester,,M28 3AT,Tel: 0161 790 2367, - ,,,No ratings yet Rate it yourself - /Services/opticians/LeaveReview/DefaultView.aspx?id=OP_5F5_9055__000001_M283KT,0,0,
Costco Wholesale UK Ltd,CO-1833-12,OPT,,"Barton Dock Road, Trafford Park",,Manchester,,M41 7PP,Tel: 0161 749 4375, - ,,,No ratings yet Rate it yourself - /Services/opticians/LeaveReview/DefaultView.aspx?id=CO-1833-12,0,0,
Asda Opticians,OP_5F6_M417P2__000003_M417PP,OPT,Barton Dock Road,,Trafford Park,Manchester,,M41 7PP,Tel: 0161 629 2320, - ,,,2 ratings Rate it yourself - /Services/opticians/LeaveReview/DefaultView.aspx?id=OP_5F6_M417P2__000003_M417PP,,,
Addison R,OP_5F5_14704__000001_M286AE,OPT,3 Bridgewater Road,Walkden,,Manchester,,M28 3JE,Tel: 0161 790 2000, - ,,,No ratings yet Rate it yourself - /Services/opticians/LeaveReview/DefaultView.aspx?id=OP_5F5_14704__000001_M286AE,0,0,
Specscart (Ellesmere Shopping Centre),TP8GJ,OPT,,"Unit 79, Ellesmere Shopping Centre, Bolton Road",,Manchester,Greater Manchester,M28 3ZD,Tel: 01613125767, - ,,,No ratings yet Rate it yourself - /Services/opticians/LeaveReview/DefaultView.aspx?id=TP8GJ,0,0,
Yates & Suddell,OP_5F5_8326__000002_M283ZD,OPT,Unit 79,144 Lady Harriet Walk,Walkden,Manchester,,M28 3ZH,Tel: 0161 702 9000, - ,,,No ratings yet Rate it yourself - /Services/opticians/LeaveReview/DefaultView.aspx?id=OP_5F5_8326__000002_M283ZD,0,0,
"Tesco Opticians (Walkden Branch, Manchester)",5F5-1998__000002_M283BT,OPT,Ellesmere Shopping Centre,Walkden,,Manchester,,M28 3BT,Tel: 0345 601 3479, - ,,,No ratings yet Rate it yourself - /Services/opticians/LeaveReview/DefaultView.aspx?id=5F5-1998__000002_M283BT,0,0,
Chadderton Opticians,OP_5J5_9837__000002_OL90LQ,OPT,"Unit 18, The Shopping Precinct",Middleton Road,Chadderton,Oldham,Lancashire,OL9 0LQ,Tel: 0161 678 7784, - ,,,1 rating Rate it yourself - /Services/opticians/LeaveReview/DefaultView.aspx?id=OP_5J5_9837__000002_OL90LQ,,,
Boots-Manchester - Trafford Centre ,OP_5F6_1351__000002_M178BD,OPT,10 Peel Avenue,The Trafford Centre,Manchester,Manchester,,M17 8BD,Tel: 0161 747 6460, - ,,,2 ratings Rate it yourself - /Services/opticians/LeaveReview/DefaultView.aspx?id=OP_5F6_1351__000002_M178BD,,,
J H  Fisher (Optometrist),OP_5JY_2528__000001_OL113AW,OPT,778-780 Manchester Road,Castleton,,Rochdale,,OL11 3AW,Tel: 01706 343505, - ,,,No ratings yet Rate it yourself - /Services/opticians/LeaveReview/DefaultView.aspx?id=OP_5JY_2528__000001_OL113AW,0,0,
Vision Express (UK) Ltd,OP_5F6_12712__000001_M178BN,OPT,31 Peel Avenue,The Trafford Centre,Manchester,,,M17 8BN,Tel: 0161 202 9708, - ,,,No ratings yet Rate it yourself - /Services/opticians/LeaveReview/DefaultView.aspx?id=OP_5F6_12712__000001_M178BN,0,0,
Optical Express,OPTICAL EXPRESS 5NR__000002_M178BN,OPT,"55 Peel Avenue, Trafford Centre",,,Manchester,Lancashire,M17 8BN,Tel: 0800 023 2020, - ,,,No ratings yet Rate it yourself - /Services/opticians/LeaveReview/DefaultView.aspx?id=OPTICAL EXPRESS 5NR__000002_M178BN,0,0,
Murrays Opticians,OP_5CL_8609__000002_M144RL,OPT,173 Princess Road,Moss Side,Manchester,Manchester,,M14 4RL,Tel: 0161 226 1031, - ,,,No ratings yet Rate it yourself - /Services/opticians/LeaveReview/DefaultView.aspx?id=OP_5CL_8609__000002_M144RL,0,0,
Greenhalgh Opticians,OP_5HQ_3339__000002_BL26PA,OPT,834 Bury Road,,Bolton,,,BL2 6PA,Tel: 01204 370760, - ,,,No ratings yet Rate it yourself - /Services/opticians/LeaveReview/DefaultView.aspx?id=OP_5HQ_3339__000002_BL26PA,0,0,
A R Gregory ,OP_5J5_3345__000001_OL84SA,OPT,764 Hollins Road,Hollinwood,Oldham,,,OL8 4SA,Tel: 0161 681 3011, - ,,,1 rating Rate it yourself - /Services/opticians/LeaveReview/DefaultView.aspx?id=OP_5J5_3345__000001_OL84SA,,,
Selby & Glover,OP_5LH_2460__000001_M436QF,OPT,393 Manchester Road,Droylsden,Manchester,,,M43 6QF,Tel: 0161 370 1017, - ,,,No ratings yet Rate it yourself - /Services/opticians/LeaveReview/DefaultView.aspx?id=OP_5LH_2460__000001_M436QF,0,0,
J S R Opticians,OP_5CL_9823__000002_M145AL,OPT,60 Wilmslow Road,Rusholme,Manchester,,,M14 5AL,Tel: 0161 224 0163, - ,,,2 ratings Rate it yourself - /Services/opticians/LeaveReview/DefaultView.aspx?id=OP_5CL_9823__000002_M145AL,,,
You & Eye Opticians,OP5NT__000001_M145LQ,OPT,172 Wilmslow Road,Rusholme,Manchester,,,M14 5LQ,Tel: 0161 224 6550, - ,,,1 rating Rate it yourself - /Services/opticians/LeaveReview/DefaultView.aspx?id=OP5NT__000001_M145LQ,,,
J S R Opticians,OP_5CL_9668__000001_M124JJ,OPT,558 Stockport Road,Longsight,Manchester,,,M12 4JJ,Tel: 0161 225 5943, - ,,,1 rating Rate it yourself - /Services/opticians/LeaveReview/DefaultView.aspx?id=OP_5CL_9668__000001_M124JJ,,,
Specsavers Openshaw,01-19246,OPT,,"Unit 17&18 Lime Sq, Ashton old Rd ",,"Openshaw,  Manchester",,M11 1DA,, - ,,,3 ratings Rate it yourself - /Services/opticians/LeaveReview/DefaultView.aspx?id=01-19246,,,