Organisation Name,NACS Code,Organisation Type,Address1,Address2,Address3,Address4,Address5,PostCode,Telephone Number,Opening time,Value  (Opening time),Banding Classification  (Opening time),NHS.UK users rating,Value  (NHS.UK users rating),Banding Classification  (NHS.UK users rating),Car parking (Is there car parking at this organisation?)
Harris Opticians,OP_5F8_10646__000001_CH484HB,OPT,,8 Banks Road,,West Kirby,Merseyside,CH48 4HB,Tel: 0151 625 7742, - ,,,No ratings yet Rate it yourself - /Services/opticians/LeaveReview/DefaultView.aspx?id=OP_5F8_10646__000001_CH484HB,0,0,
A D Melling Ltd,OP_5F8_115__000003_CH484HL,OPT,9 The Crescent,West Kirby,Wirral,,,CH48 4HL,Tel: 0151 625 3743, - ,,,No ratings yet Rate it yourself - /Services/opticians/LeaveReview/DefaultView.aspx?id=OP_5F8_115__000003_CH484HL,0,0,
Harris Opticians,OP_5F8_3453__000001_CH607SE,OPT,,175 -177 Telegraph Road,,Heswall,Merseyside,CH60 7SE,Tel: 0151 342 4130, - ,,,2 ratings Rate it yourself - /Services/opticians/LeaveReview/DefaultView.aspx?id=OP_5F8_3453__000001_CH607SE,,,
Specsavers,TP8L1,OPT,,183 Telegraph Road,,"Heswall, Wirral",,CH60 7SE,, - ,,,No ratings yet Rate it yourself - /Services/opticians/LeaveReview/DefaultView.aspx?id=TP8L1,0,0,
"Eye 2 Eye, (Gartshore Optical Centre)",OP_5F8_5092__000001_CH607SG,OPT,240 Telegraph Road,Heswall,,Wirral,Cheshire,CH60 7SG,Tel: 0151 342 8328, - ,,,5 ratings Rate it yourself - /Services/opticians/LeaveReview/DefaultView.aspx?id=OP_5F8_5092__000001_CH607SG,,,
Greasby Opticians,OP_5F8_8200__000002_CH493NQ,OPT,150 Greasby Road,Greasby,Wirral,Wirral,,CH49 3NQ,Tel: 0151 605 0822, - ,,,32 ratings Rate it yourself - /Services/opticians/LeaveReview/DefaultView.aspx?id=OP_5F8_8200__000002_CH493NQ,,,
Frederick Howard Opticians,OP_5F8_8878__000002_CH619PF,OPT,403 Pensby Road,Pensby,Wirral,Merseyside,,CH61 9PF,Tel: 0151 648 1182, - ,,,No ratings yet Rate it yourself - /Services/opticians/LeaveReview/DefaultView.aspx?id=OP_5F8_8878__000002_CH619PF,0,0,
J A Allister Opticians Ltd,OP_5H6_535__000001_CH649UB,OPT,The Optician,9 The Cross,Neston,Cheshire,Cheshire,CH64 9UB,Tel: 0151 336 6629, - ,,,2 ratings Rate it yourself - /Services/opticians/LeaveReview/DefaultView.aspx?id=OP_5H6_535__000001_CH649UB,,,
Paul Moore Opticians,OP_5H2_9600__000001_CH460SL,OPT,255 Hoylake Road,Moreton,Wirral,,,CH46 0SL,Tel: 0151 678 3400, - ,,,1 rating Rate it yourself - /Services/opticians/LeaveReview/DefaultView.aspx?id=OP_5H2_9600__000001_CH460SL,,,
The Eyeworks ,OP_5H2_14388__000003_CH490UB,OPT,1 Arrowe Park Road,Upton,Wirral,Merseysdie,,CH49 0UB,Tel: 0151 677 2133, - ,,,1 rating Rate it yourself - /Services/opticians/LeaveReview/DefaultView.aspx?id=OP_5H2_14388__000003_CH490UB,,,yes
"Eye 2 Eye, (Gartshore Optical Centre)",OP_5H2_4205__000002_CH490UB,OPT,31 Arrowe Park Road,Upton,,Wirral,Merseyside,CH49 0UB,Tel: 0151 677 3913, - ,,,No ratings yet Rate it yourself - /Services/opticians/LeaveReview/DefaultView.aspx?id=OP_5H2_4205__000002_CH490UB,0,0,
R Millican Opticians,OP_5H2_7652__000002_CH467TE,OPT,2 Chadwick Street,Moreton,Wirral,,,CH46 7TE,Tel: 0151 677 3402, - ,,,No ratings yet Rate it yourself - /Services/opticians/LeaveReview/DefaultView.aspx?id=OP_5H2_7652__000002_CH467TE,0,0,
I R McGarvey Opticians,OP_5H2_9244__000001_CH428PG,OPT,354 Woodchurch Road,Prenton,Birkenhead,,,CH42 8PG,Tel: 0151 608 2823, - ,,,No ratings yet Rate it yourself - /Services/opticians/LeaveReview/DefaultView.aspx?id=OP_5H2_9244__000001_CH428PG,0,0,
R T Booth & Co Ltd,OP_5H2_6272__000001_CH428PF,OPT,393 Woodchurch Road,Prenton,Birkenhead,,,CH42 8PF,Tel: 0151 608 7870, - ,,,No ratings yet Rate it yourself - /Services/opticians/LeaveReview/DefaultView.aspx?id=OP_5H2_6272__000001_CH428PF,0,0,
Tesco Opticians,CH437AA060716,OPT,,Bidston Link Road,,Birkenhead,,CH43 7AA,Tel: 0345 601 3479, - ,,,No ratings yet Rate it yourself - /Services/opticians/LeaveReview/DefaultView.aspx?id=CH437AA060716,0,0,
Frederick Howard Opticians,OP_5F8_13831__000002_CH638QT,OPT,108 Teehey Lane,Bebington,,Wirral,,CH63 8QT,Tel: 0151 609 0990, - ,,,2 ratings Rate it yourself - /Services/opticians/LeaveReview/DefaultView.aspx?id=OP_5F8_13831__000002_CH638QT,,,
Price Wynne Opticians,C2855NK__000002_CH410DD,OPT,161 Park Road North,,Birkenhead,Merseyside,,CH41 0DD,, - ,,,1 rating Rate it yourself - /Services/opticians/LeaveReview/DefaultView.aspx?id=C2855NK__000002_CH410DD,,,
Brumpton Opticians,OP_5H2_9828__000001_CH418EN,OPT,102 Laird Street,Birkenhead,Merseyside,,,CH41 8EN,Tel: 0151 652 2562, - ,,,No ratings yet Rate it yourself - /Services/opticians/LeaveReview/DefaultView.aspx?id=OP_5H2_9828__000001_CH418EN,0,0,
I Care Opticians,OPT_CH416EB_1,OPT,i care opticians,254 Grange Road,,Birkenhead,Cheshire,CH41 6EB,Tel: 0151 647 5310, - ,,,No ratings yet Rate it yourself - /Services/opticians/LeaveReview/DefaultView.aspx?id=OPT_CH416EB_1,0,0,
I Care Opticians,OPT_CH416EB_3,OPT,,254 Grange Road,,Birkenhead,,CH41 6EB,, - ,,,No ratings yet Rate it yourself - /Services/opticians/LeaveReview/DefaultView.aspx?id=OPT_CH416EB_3,0,0,
"Eye 2 Eye, (Gartshore Optical Centre)",OP_5H2_3393__000002_CH412PH,OPT,231 Grange Road,Birkenhead,,Wirral,Merseyside,CH41 2PH,Tel: 0151 647 3048, - ,,,1 rating Rate it yourself - /Services/opticians/LeaveReview/DefaultView.aspx?id=OP_5H2_3393__000002_CH412PH,,,
R A Carr,OP_5M5_14750__000001_L31,OPT,Bridgefoot Farm,Hall Lane,Lydiate,,,L41 4LR,Tel: 01704 841315, - ,,,No ratings yet Rate it yourself - /Services/opticians/LeaveReview/DefaultView.aspx?id=OP_5M5_14750__000001_L31,0,0,
Boots-Birkenhead,OP_5H2_10569__000001_CH412ZL,OPT,"Unit 21, The Pyramids",,,Birkenhead,Merseyside,CH41 2ZL,Tel: 0151 666 1499, - ,,,No ratings yet Rate it yourself - /Services/opticians/LeaveReview/DefaultView.aspx?id=OP_5H2_10569__000001_CH412ZL,0,0,
Vision Express (UK) Ltd,OP_5H2_323__000002_CH412ZL,OPT,Unit 1,"The Pyramids, Grange Road",Birkenhead,,,CH41 2ZL,Tel: 0151 647 4068, - ,,,No ratings yet Rate it yourself - /Services/opticians/LeaveReview/DefaultView.aspx?id=OP_5H2_323__000002_CH412ZL,0,0,
Specsavers Opticians,OP_5H2_7164__000001_CH412XX,OPT,29 Borough Pavement,Grange Precinct,Birkenhead,,,CH41 2XX,Tel: 0151 650 1666, - ,,,No ratings yet Rate it yourself - /Services/opticians/LeaveReview/DefaultView.aspx?id=OP_5H2_7164__000001_CH412XX,0,0,
Rayner Opticians ,OP_5H2_8427__000001_CH412XZ,OPT,,9 St. Werburghs Square,Grange Precinct,Birkenhead,,CH41 2XZ,Tel: 0151 647 8277, - ,,,No ratings yet Rate it yourself - /Services/opticians/LeaveReview/DefaultView.aspx?id=OP_5H2_8427__000001_CH412XZ,0,0,
Frederick Howard Opticians,OP_5H2_14978__000001_CH454NW,OPT,40 Wallasey Road,Liscard,,Wirral,,CH45 4NW,Tel: 0151 630 0066, - ,,,No ratings yet Rate it yourself - /Services/opticians/LeaveReview/DefaultView.aspx?id=OP_5H2_14978__000001_CH454NW,0,0,
Specsavers Wallasey,OP_5H2_94__000001_CH445XX,OPT,"Unit 33, Cherry Tree Centre",Liscard Way,Wallasey,Merseyside,,CH44 5XX,Tel: 0151 638 3341, - ,,,6 ratings Rate it yourself - /Services/opticians/LeaveReview/DefaultView.aspx?id=OP_5H2_94__000001_CH445XX,,,
Scrivens Opticians & Hearing Care,OP_5H2_9957__000001_CH454NE,OPT,Unit 7A,Liscard Way,,Wallasey,,CH44 5TL,Tel: 0151 639 2280, - ,,,No ratings yet Rate it yourself - /Services/opticians/LeaveReview/DefaultView.aspx?id=OP_5H2_9957__000001_CH454NE,0,0,
R J Orrell Opticians Ltd,OP_5H2_13833__000001_CH452JD,OPT,123 Victoria Road,New Brighton,Wirral,,,CH45 2JD,Tel: 0151 639 3263, - ,,,No ratings yet Rate it yourself - /Services/opticians/LeaveReview/DefaultView.aspx?id=OP_5H2_13833__000001_CH452JD,0,0,
Blundellsands Optical Ltd,GOC - 1-18588,OPT,,13-15 Merseyview,Brighton le sands,Liverpool,,L22 6QA,Tel: 0151 931 4619, - ,,,1 rating Rate it yourself - /Services/opticians/LeaveReview/DefaultView.aspx?id=GOC - 1-18588,,,
Waterloo Eye Centre,OP_5M5_4281__000001_L220ND,OPT,,108 South Road,Waterloo,Liverpool,Merseyside,L22 0ND,Tel: 0151 928 6645, - ,,,1 rating Rate it yourself - /Services/opticians/LeaveReview/DefaultView.aspx?id=OP_5M5_4281__000001_L220ND,,,
Jonathan Kay Ltd,OP_5M5_8498__000001_L220QB,OPT,55 Crosby Road North,Waterloo,,Liverpool,Merseyside,L22 4QD,Tel: 0151 928 5982, - ,,,1 rating Rate it yourself - /Services/opticians/LeaveReview/DefaultView.aspx?id=OP_5M5_8498__000001_L220QB,,,
Glenns Opticians,OP_5M5_13844__000001_L235SS,OPT,89 Liverpool Road,Crosby,,Liverpool,,L23 5TD,Tel: 0151 924 4615, - ,,,No ratings yet Rate it yourself - /Services/opticians/LeaveReview/DefaultView.aspx?id=OP_5M5_13844__000001_L235SS,0,0,
Specsavers Formby,99999__000002_L373PX,OPT,"Unit 3, The Cloisters, Halsall La",,Formby,Merseyside,,L37 3PX,Tel: 01704 832311, - ,,,No ratings yet Rate it yourself - /Services/opticians/LeaveReview/DefaultView.aspx?id=99999__000002_L373PX,0,0,
alice @ conlon,OP_5F9_6607__000001_L373PX,OPT,,4 The Beacons,Halsall Lane,Formby,Merseyside,L37 3NW,Tel: 01704 878 680, - ,,,No ratings yet Rate it yourself - /Services/opticians/LeaveReview/DefaultView.aspx?id=OP_5F9_6607__000001_L373PX,0,0,
S R Drinnan,OP_5M2_5706__000001_SY111AD,OPT,28 Willow Street,,Oswestry,Shropshire,,SY11 1AD,Tel: 01691 652875, - ,,,No ratings yet Rate it yourself - /Services/opticians/LeaveReview/DefaultView.aspx?id=OP_5M2_5706__000001_SY111AD,0,0,
Rayner Opticians ,OP_5M2_1951__000001_SY111PU,OPT,,26 Bailey Street,,Oswestry,Shropshire,SY11 1PU,Tel: 01691 653936, - ,,,No ratings yet Rate it yourself - /Services/opticians/LeaveReview/DefaultView.aspx?id=OP_5M2_1951__000001_SY111PU,0,0,no
Specsavers Oswestry,OP5M254__000002_SY111PU,OPT,24 Bailey Street,,Oswestry,Shropshire,,SY11 1PU,Tel: 01691 684820, - ,,,1 rating Rate it yourself - /Services/opticians/LeaveReview/DefaultView.aspx?id=OP5M254__000002_SY111PU,,,
BBR Opticians,OP5M252__000001_SY112NN,OPT,BBR Opticians Ltd,23 Leg Street,,Oswestry,Shropshire,SY11 2NN,Tel: 01691 654327, - ,,,No ratings yet Rate it yourself - /Services/opticians/LeaveReview/DefaultView.aspx?id=OP5M252__000001_SY112NN,0,0,
