Organisation Name,NACS Code,Organisation Type,Address1,Address2,Address3,Address4,Address5,PostCode,Telephone Number,Opening time,Value  (Opening time),Banding Classification  (Opening time),NHS.UK users rating,Value  (NHS.UK users rating),Banding Classification  (NHS.UK users rating),Car parking (Is there car parking at this organisation?)
Ian Michael Hadfield,OP_5D1_13860__000001_B376BB,OPT,,37 The Parade,Kingshurst,Birmingham,,B37 6BB,Tel: 0121 770 3226, - ,,,No ratings yet Rate it yourself - /Services/opticians/LeaveReview/DefaultView.aspx?id=OP_5D1_13860__000001_B376BB,0,0,
Cook Eyecare Ltd,COOKS__000001_B347HR,OPT,,6 Hurst Lane,Castle Bromwich,Birmingham,,B34 7HR,Tel: 0121 747 3847, - ,,,No ratings yet Rate it yourself - /Services/opticians/LeaveReview/DefaultView.aspx?id=COOKS__000001_B347HR,0,0,
Specsavers Opticians,5QW048,OPT,,"Unit 34, 2-4 Greenwood Square",Chelmsley Wood Shopping Centre,Birmingham,,B37 5TR,Tel: 0121 329 5510, - ,,,No ratings yet Rate it yourself - /Services/opticians/LeaveReview/DefaultView.aspx?id=5QW048,0,0,
Vision Replublic Opticians,5PG129,OPT,,15 Ownall Road,Shard End,Birmingham,,B34 7AH,Tel: 0121 439 7979, - ,,,No ratings yet Rate it yourself - /Services/opticians/LeaveReview/DefaultView.aspx?id=5PG129,0,0,
Scrivens Ltd,OP_5MY_5456__000002_B339SB,OPT,300 Kitts Green Road,Lea Hall,,Birmingham,West Midlands,B33 9SB,Tel: 0121 783 3159, - ,,,No ratings yet Rate it yourself - /Services/opticians/LeaveReview/DefaultView.aspx?id=OP_5MY_5456__000002_B339SB,0,0,
Maginnis Opticians (Optometrists) Ltd,OP_5D1_4083__000001_B377AE,OPT,32a Holly Lane,Marston Green,Birmingham,,,B37 7AE,Tel: 0121 779 4242, - ,,,No ratings yet Rate it yourself - /Services/opticians/LeaveReview/DefaultView.aspx?id=OP_5D1_4083__000001_B377AE,0,0,
Scrivens Opticians,OP_5MP_453__000002_B463AG,OPT,91 High Street,Coleshill,Birmingham,,,B46 3AG,Tel: 01675 464507, - ,,,No ratings yet Rate it yourself - /Services/opticians/LeaveReview/DefaultView.aspx?id=OP_5MP_453__000002_B463AG,0,0,
Direct Vision Opticians at Pan Pharmacy,,OPT,Direct Vision Opticians,297-299 Church Road,Sheldon,Birmingham,West Midlands,B26 3YH,Tel: 0121 742 9599 (ext. 3), - ,,,N/A - Data not available,,,yes
Scrivens Opticians & Hearing Care,5PG126,OPT,,146 Church Road,Yardley,Birmingham,,B25 8UT,Tel: 0121 784 8022, - ,,,No ratings yet Rate it yourself - /Services/opticians/LeaveReview/DefaultView.aspx?id=5PG126,0,0,
Colin Lee Opticians,5PG150,OPT,12 Fox & Goose Shopping Centre,Washwood Heath Road,Ward End,Birmingham,,B8 2EP,Tel: 0121 784 5888, - ,,,No ratings yet Rate it yourself - /Services/opticians/LeaveReview/DefaultView.aspx?id=5PG150,0,0,
S W Optics Ltd,5MY32__000003_B368TY,OPT,140 Bromford Drive,Bromford,Birmingham,,,B36 8TY,Tel: 0121 749 2660, - ,,,No ratings yet Rate it yourself - /Services/opticians/LeaveReview/DefaultView.aspx?id=5MY32__000003_B368TY,0,0,
Boots-Sheldon,OP_5MY_2665__000002_B263JH,OPT,2236 Coventry Road,Sheldon,,Birmingham,,B26 3JH,Tel: 0121 743 3360, - ,,,No ratings yet Rate it yourself - /Services/opticians/LeaveReview/DefaultView.aspx?id=OP_5MY_2665__000002_B263JH,0,0,
Home Eye Clinic Ltd,C/3004__000005_B82LX,OPT,Ward End,,Birmingham,,,B8 2LX,Tel: 0121 3266624, - ,,,No ratings yet Rate it yourself - /Services/opticians/LeaveReview/DefaultView.aspx?id=C/3004__000005_B82LX,0,0,
Mikah Opticians,5MX096,OPT,,941 Alum Rock Road,Ward End,Birmingham,,B8 2LX,Tel: 0121 246 3777, - ,,,No ratings yet Rate it yourself - /Services/opticians/LeaveReview/DefaultView.aspx?id=5MX096,0,0,
Scrivens Ltd,OP_5MY_6315__000002_B263JB,OPT,2162 Coventry Road,Sheldon,,Birmingham,West Midlands,B26 3JB,Tel: 0121 743 2704, - ,,,No ratings yet Rate it yourself - /Services/opticians/LeaveReview/DefaultView.aspx?id=OP_5MY_6315__000002_B263JB,0,0,
Asda Opticians,5MW23__000002_B768XL,OPT,Walmley Ash Road,Minworth,,Sutton Coldfield,,B76 1XL,Tel: 0121 313 7157, - ,,,No ratings yet Rate it yourself - /Services/opticians/LeaveReview/DefaultView.aspx?id=5MW23__000002_B768XL,0,0,
Manor Opticians,5PG120,OPT,,1752 Coventry Road,Sheldon,Birmingham,,B26 1PB,Tel: 0121 722 7226, - ,,,No ratings yet Rate it yourself - /Services/opticians/LeaveReview/DefaultView.aspx?id=5PG120,0,0,
Krystal Vision,5MY26__000002_B261AD,OPT,,1592 Coventry Road,Yardley,Birmingham,,B26 1AL,Tel: 0121 707 7004, - ,,,No ratings yet Rate it yourself - /Services/opticians/LeaveReview/DefaultView.aspx?id=5MY26__000002_B261AD,0,0,
Vision Express (UK) Ltd,5PG15__000001_B249FP,OPT,Unit9a The Fort Shopping Park,Erdington,,Birmingham,,B24 9FP,Tel: 0121 384 3110, - ,,,No ratings yet Rate it yourself - /Services/opticians/LeaveReview/DefaultView.aspx?id=5PG15__000001_B249FP,0,0,
Boots-Birmingham - Erdington Fort ,OP_5MY_6131__000002_B249QS,OPT,Unit 8 Fort Retail Park,20 Fort Parkway,Erdington,Birmingham,West Midlands,B24 9FP,Tel: 01213 826673, - ,,,No ratings yet Rate it yourself - /Services/opticians/LeaveReview/DefaultView.aspx?id=OP_5MY_6131__000002_B249QS,0,0,
Tesco Opticians,5PG121,OPT,,Swan Shopping Centre,Coventry Road,Birmingham,,B26 1AD,Tel: 0121 601 3438, - ,,,No ratings yet Rate it yourself - /Services/opticians/LeaveReview/DefaultView.aspx?id=5PG121,0,0,
Specsavers,5PG117,OPT,,"Unit 3, The Swan Shopping Centre",Yardley,Birmingham,,B25 8UJ,Tel: 0121 765 5700, - ,,,No ratings yet Rate it yourself - /Services/opticians/LeaveReview/DefaultView.aspx?id=5PG117,0,0,
Specs Direct (Ward End) Ltd,5PG156,OPT,,659 Washwood Heath Road,Washwood Heath,Birmingham,,B8 2HJ,Tel: 0121 328 2964, - ,,,No ratings yet Rate it yourself - /Services/opticians/LeaveReview/DefaultView.aspx?id=5PG156,0,0,
Eyeworld Opticians,5PG155,OPT,,678 Alum Rock Road,Pelham,Birmingham,,B8 3NU,Tel: 0121 328 4328, - ,,,No ratings yet Rate it yourself - /Services/opticians/LeaveReview/DefaultView.aspx?id=5PG155,0,0,
Neil Berry Opticians,OP_5MY_2324__000001_B249LY,OPT,556 Holly Lane,Erdington,,Birmingham,,B24 9LY,Tel: 0121 377 7393, - ,,,No ratings yet Rate it yourself - /Services/opticians/LeaveReview/DefaultView.aspx?id=OP_5MY_2324__000001_B249LY,0,0,
T. Cox Opticians,5MX079,OPT,T. Cox Opticians,565 Washwood Heath Road,Ward End,Birmingham,,B8 2HB,Tel: 0121 327 1814, - ,,,No ratings yet Rate it yourself - /Services/opticians/LeaveReview/DefaultView.aspx?id=5MX079,0,0,
Complete Community Care,C/7200/5PK,OPT,Complete Community Care Birmingham,42 Ringswood Road,,Solihull,West Midlands,B92 7NH,Tel: 0121 439 6496, - ,,,No ratings yet Rate it yourself - /Services/opticians/LeaveReview/DefaultView.aspx?id=C/7200/5PK,0,0,
Eye Specialist Opticians,OP_5D1_13861__000002_B928JL,OPT,,83 Hobs Moat Road,,Solihull,,B92 8JL,Tel: 0121 742 6043, - ,,,No ratings yet Rate it yourself - /Services/opticians/LeaveReview/DefaultView.aspx?id=OP_5D1_13861__000002_B928JL,0,0,
Boots-Birmingham - Yardley,OP_5MY_9735__000002_B258LP,OPT,1321 Coventry Road,Yardley,,Birmingham,,B25 8LP,Tel: 0121 707 9177, - ,,,No ratings yet Rate it yourself - /Services/opticians/LeaveReview/DefaultView.aspx?id=OP_5MY_9735__000002_B258LP,0,0,
Matthew Spencer,5PG174,OPT,,11 Shipley Fields,Erdington,Birmingham,,B24 9BW,Tel: 0121 382 8183, - ,,,No ratings yet Rate it yourself - /Services/opticians/LeaveReview/DefaultView.aspx?id=5PG174,0,0,
Visioncraft (UK) Ltd,OP_B95PU_34397,OPT,,41 Yardley Green Road,Bordesley Green,Birmingham,,B9 5PU,Tel: 0121 772 4424, - ,,,No ratings yet Rate it yourself - /Services/opticians/LeaveReview/DefaultView.aspx?id=OP_B95PU_34397,0,0,
Charles Morris Optometrists,OP_5MW_8335__000001_B761QN,OPT,28 Walmley Road,Walmley,,Sutton Coldfield,,B76 1QN,Tel: 0121 351 2344, - ,,,No ratings yet Rate it yourself - /Services/opticians/LeaveReview/DefaultView.aspx?id=OP_5MW_8335__000001_B761QN,0,0,
Eyesavers ,5PG151,OPT,,467 Bordesley Green,Bordesley Green,Birmingham,,B9 5XF,Tel: 0121 771 4488, - ,,,No ratings yet Rate it yourself - /Services/opticians/LeaveReview/DefaultView.aspx?id=5PG151,0,0,
The I Clinic,OP_B83BH_30203,OPT,,227 Alum Rock Road,Alum Rock,Birmingham,,B8 3BH,Tel: 0121 326 9008, - ,,,No ratings yet Rate it yourself - /Services/opticians/LeaveReview/DefaultView.aspx?id=OP_B83BH_30203,0,0,
New Image Opticians,5PG152,OPT,,1120 Warwick Road,Acocks Green,Birmingham,,B27 6BL,Tel: 0121 707 9733, - ,,,No ratings yet Rate it yourself - /Services/opticians/LeaveReview/DefaultView.aspx?id=5PG152,0,0,
Specsavers Opticians,OP_5MY_7640__000002_B236RS,OPT,138B High Street,Erdington,,Birmingham,,B23 6RS,Tel: 0121 382 1477, - ,,,No ratings yet Rate it yourself - /Services/opticians/LeaveReview/DefaultView.aspx?id=OP_5MY_7640__000002_B236RS,0,0,
Euro Spex Opticians Ltd,OP_5MY_10353__000002_B81HU,OPT,158 Alum Rock Road,Saltley,,Birmingham,,B8 1HU,Tel: 0121 326 8181, - ,,,No ratings yet Rate it yourself - /Services/opticians/LeaveReview/DefaultView.aspx?id=OP_5MY_10353__000002_B81HU,0,0,
Asda Optician,OPT_B10 0HH,OPT,,SMALL HEATH,"859, COVENTRY ROAD",BIRMINGHAM,,B10 0HH,Tel: 0121 7664810, - ,,,No ratings yet Rate it yourself - /Services/opticians/LeaveReview/DefaultView.aspx?id=OPT_B10 0HH,0,0,
Banks Opticians,5PG02__000005_B276RA,OPT,,1115A Warwick Road,Acocks Green,Birmingham,West Midlands,B27 6RA,Tel: 0121 706 6604, - ,,,No ratings yet Rate it yourself - /Services/opticians/LeaveReview/DefaultView.aspx?id=5PG02__000005_B276RA,0,0,
Onkar Eye Care Opticians,5MY33__000002_B81NH,OPT,151 Alum Rock Road,Saltley,,Birmingham,,B8 1NH,Tel: 0121 327 0620, - ,,,No ratings yet Rate it yourself - /Services/opticians/LeaveReview/DefaultView.aspx?id=5MY33__000002_B81NH,0,0,
Boots-Acocks Green,OP_5MY_2664__000002_B276BH,OPT,1082 Warwick Road,Acocks Green,,Birmingham,,B27 6BH,Tel: 0121 706 1386, - ,,,No ratings yet Rate it yourself - /Services/opticians/LeaveReview/DefaultView.aspx?id=OP_5MY_2664__000002_B276BH,0,0,
Realeyes Opticians ,OP_5MY_9140__000001_B236TE,OPT,169 High Street,Erdington,,Birmingham,,B23 6SY,Tel: 0121 373 0368, - ,,,No ratings yet Rate it yourself - /Services/opticians/LeaveReview/DefaultView.aspx?id=OP_5MY_9140__000001_B236TE,0,0,yes
Ward ( Ophthalmic Opticians) Ltd,OP_5MY_13858__000001_B236QU,OPT,202 Sutton New Road,Erdington,,Birmingham,,B23 6QU,Tel: 0121 373 6897, - ,,,No ratings yet Rate it yourself - /Services/opticians/LeaveReview/DefaultView.aspx?id=OP_5MY_13858__000001_B236QU,0,0,
Sodha Optometrists,5MY34__000001_B87ND,OPT,95 Alum Rock Road,Alum Rock,Birmingham,,,B8 1ND,Tel: 0121 326 0334, - ,,,No ratings yet Rate it yourself - /Services/opticians/LeaveReview/DefaultView.aspx?id=5MY34__000001_B87ND,0,0,
Rightspex Opticians,5PG154,OPT,,329 Green Lane,Small Heath,Birmingham,,B9 5PW,Tel: 0121 773 6690, - ,,,No ratings yet Rate it yourself - /Services/opticians/LeaveReview/DefaultView.aspx?id=5PG154,0,0,
Bainbridge Optometrists,OP_5MY_8779__000002_B236SN,OPT,240 High Street,Erdington,,Birmingham,,B23 6SN,Tel: 0121 377 7459, - ,,,No ratings yet Rate it yourself - /Services/opticians/LeaveReview/DefaultView.aspx?id=OP_5MY_8779__000002_B236SN,0,0,
Scrivens Ltd,OP_5MY_10763__000001_B236SN,OPT,246 High Street,Erdington,,Birmingham,West Midlands,B23 6SN,Tel: 0121 373 0680, - ,,,No ratings yet Rate it yourself - /Services/opticians/LeaveReview/DefaultView.aspx?id=OP_5MY_10763__000001_B236SN,0,0,
A B Optics Ltd,5PG123,OPT,,360 Birmingham Road,Wylde Green,Sutton Coldfield,,B72 1YH,Tel: 0121 384 5743, - ,,,No ratings yet Rate it yourself - /Services/opticians/LeaveReview/DefaultView.aspx?id=5PG123,0,0,
Lad & Turner Optical Practice,OP_5MW_8465__000001_B721YG,OPT,8 The Lanes shopping centre,340 Birmingham Road,Wylde Green,sutton coldfield,West Midlands,B72 1YG,Tel: 01213505872, - ,,,No ratings yet Rate it yourself - /Services/opticians/LeaveReview/DefaultView.aspx?id=OP_5MW_8465__000001_B721YG,0,0,
Eyecare at Home,EYECAREATHOME1,OPT,208 Wharf lane,,,Solihull,West Midlands,B91 2UN,Tel: 0845 299 6069, - ,,,No ratings yet Rate it yourself - /Services/opticians/LeaveReview/DefaultView.aspx?id=EYECAREATHOME1,0,0,
Costco,OPT_B75SA_1,OPT,,100 Watson Road,Nechells,Birmingham,,B7 5SA,Tel: 0121 326 3515, - ,,,No ratings yet Rate it yourself - /Services/opticians/LeaveReview/DefaultView.aspx?id=OPT_B75SA_1,0,0,
Eyecare Opticians,B10 0LL_11111,OPT,,503a Coventry Road,Small Heath,Birmingham,West Midlands,B10 0LL,Tel: 0121 773 2129, - ,,,No ratings yet Rate it yourself - /Services/opticians/LeaveReview/DefaultView.aspx?id=B10 0LL_11111,0,0,
Mahendra Mohanlal Davda,OP_5MX_8213__000001_B100UN,OPT,,554a Coventry Road,Small Heath,Birmingham,,B10 0UN,Tel: 0121 772 2902, - ,,,No ratings yet Rate it yourself - /Services/opticians/LeaveReview/DefaultView.aspx?id=OP_5MX_8213__000001_B100UN,0,0,
Supa Spex Opticians,5MX122,OPT,,14 Muntz Street,,Birmingham,,B10 9SN,Tel: 0121 448 7176, - ,,,No ratings yet Rate it yourself - /Services/opticians/LeaveReview/DefaultView.aspx?id=5MX122,0,0,
Walford & Round,OP_5D1_8708__000002_B911BQ,OPT,,Dovehouse Parade,33 Warwick Road,Solihull,,B91 1BQ,Tel: 0121 706 4522, - ,,,No ratings yet Rate it yourself - /Services/opticians/LeaveReview/DefaultView.aspx?id=OP_5D1_8708__000002_B911BQ,0,0,
Specs Direct,5PG14__000001_B237RJ,OPT,184 Slade Road,Erdington,Birmingham,,,B23 7RJ,Tel: 0121 384 2828, - ,,,No ratings yet Rate it yourself - /Services/opticians/LeaveReview/DefaultView.aspx?id=5PG14__000001_B237RJ,0,0,
Alan Tyler Opticians,5PG01__000003_B277PS,OPT,,291 Fox Hollies Road,,Birmingham,West Midlands,B27 7PS,Tel: 0121 706 3998, - ,,,No ratings yet Rate it yourself - /Services/opticians/LeaveReview/DefaultView.aspx?id=5PG01__000003_B277PS,0,0,
Eurospex Opticians Ltd,OP_5MX_10352__000002_B100UF,OPT,386 Coventry Road,Small Heath,Birmingham,,,B10 0UF,Tel: 0121 773 7327, - ,,,No ratings yet Rate it yourself - /Services/opticians/LeaveReview/DefaultView.aspx?id=OP_5MX_10352__000002_B100UF,0,0,
Vision Call Midlands,01259__000003_B112JP,OPT,463-465 Warwick Road,Tylesley,Tylesley,,,B11 2JP,Tel: 0121 708 1349, - ,,,No ratings yet Rate it yourself - /Services/opticians/LeaveReview/DefaultView.aspx?id=01259__000003_B112JP,0,0,
Eyespec,OPT_B100XE_1,OPT,,340 Coventry Road,Small Heath,Birmingham,,B10 0XE,Tel: 0121 772 1526, - ,,,No ratings yet Rate it yourself - /Services/opticians/LeaveReview/DefaultView.aspx?id=OPT_B100XE_1,0,0,
Home Eye Clinic Ltd,OP_B81AE_46764,OPT,,"Unit 2, Urban House",,Birmingham,West Midlands,B8 1AE,Tel: 0800 6122145, - ,,,No ratings yet Rate it yourself - /Services/opticians/LeaveReview/DefaultView.aspx?id=OP_B81AE_46764,0,0,
Portland Eye Care Services Ltd,5MX72__000001_B100SN,OPT,,345 Coventry Road,Small Heath,Birmingham,,B10 0SN,Tel: 0121 772 1442, - ,,,No ratings yet Rate it yourself - /Services/opticians/LeaveReview/DefaultView.aspx?id=5MX72__000001_B100SN,0,0,
Banks Opticians,OP_5MY_10216__000001_B237JG,OPT,511 Slade Road,Erdington,Birmingham,West Midlands,,B23 7JG,Tel: 0121 373 0435, - ,,,No ratings yet Rate it yourself - /Services/opticians/LeaveReview/DefaultView.aspx?id=OP_5MY_10216__000001_B237JG,0,0,
Community Eyecare trading as Vision Call,OP_B920AJ_20418,OPT,463-465 Warwick Road,"Cleeves House, Hampton Court, 55 Marsh Lane, Hampton-in-Arden",,Solihull,,B92 0AJ,Tel: 01675 446 065, - ,,,No ratings yet Rate it yourself - /Services/opticians/LeaveReview/DefaultView.aspx?id=OP_B920AJ_20418,0,0,
Eye Centre Opticians,5MW24__000001_B757DX,OPT,,53c Reddicap Heath Road,,Sutton Coldfield,,B75 7DX,Tel: 0121 378 4724, - ,,,No ratings yet Rate it yourself - /Services/opticians/LeaveReview/DefaultView.aspx?id=5MW24__000001_B757DX,0,0,
20-20 Vision,5PG131,OPT,,226 Warwick Road,Acocks Green,Birmingham,,B11 2ND,Tel: 0121 772 7709, - ,,,No ratings yet Rate it yourself - /Services/opticians/LeaveReview/DefaultView.aspx?id=5PG131,0,0,
Eye Centre (Birmingham) Ltd,5PG04__000004_B112NB,OPT,,202 Warwick Road,Greet,Birmingham,,B11 2NB,Tel: 0121 772 2505, - ,,,No ratings yet Rate it yourself - /Services/opticians/LeaveReview/DefaultView.aspx?id=5PG04__000004_B112NB,0,0,
Focus Eye Clinic,5MX109,OPT,,65 Rupert Street,Nechells,Birmingham,,B7 5DT,Tel: 0121 359 2666, - ,,,No ratings yet Rate it yourself - /Services/opticians/LeaveReview/DefaultView.aspx?id=5MX109,0,0,
A B Optics,OP_5D1_13858__000001_B913DA,OPT,,681 Warwick Road,,Solihull,,B91 3DA,Tel: 0121 704 2615, - ,,,No ratings yet Rate it yourself - /Services/opticians/LeaveReview/DefaultView.aspx?id=OP_5D1_13858__000001_B913DA,0,0,
Boots-Solihull,OP_5D1_3193__000001_B913AT,OPT,57 Mill Lane,,,Solihull,West Midlands,B91 3AT,Tel: 0121 705 2152, - ,,,No ratings yet Rate it yourself - /Services/opticians/LeaveReview/DefaultView.aspx?id=OP_5D1_3193__000001_B913AT,0,0,
Perspective Opticians ,OP_5D1_5333__000001_B913BH,OPT,56 Drury Lane,Mell Square,Solihull,Solihull,,B91 3BH,Tel: 0121 709 1000, - ,,,No ratings yet Rate it yourself - /Services/opticians/LeaveReview/DefaultView.aspx?id=OP_5D1_5333__000001_B913BH,0,0,
Andrew Martin Optometrist Ltd,5MW224__000003_B735TJ,OPT,66 Boldmere Road,Boldmere,Sutton Coldfield,West Midlands,,B73 5TJ,Tel: 0121 354 6411, - ,,,No ratings yet Rate it yourself - /Services/opticians/LeaveReview/DefaultView.aspx?id=5MW224__000003_B735TJ,0,0,yes
The Eye Clinic,5MX124,OPT,Sparkbrook Community and Health Centre,34 Grantham Road,B11 1LU,Birmingham,,B11 1LU,Tel: 0121 464 9860, - ,,,No ratings yet Rate it yourself - /Services/opticians/LeaveReview/DefaultView.aspx?id=5MX124,0,0,
Eagle Eyes Opticians Ltd,SOUTH102__000003_B288AE,OPT,1132 Stratford Road,Hall Green,Birmingham,,,B28 8AE,Tel: 0121 777 8889, - ,,,No ratings yet Rate it yourself - /Services/opticians/LeaveReview/DefaultView.aspx?id=SOUTH102__000003_B288AE,0,0,
Vision Express (UK) Ltd,5QW005,OPT,,Touchwood Shopping Centre,,Solihull,,B91 3QE,Tel: 0121 704 7150, - ,,,No ratings yet Rate it yourself - /Services/opticians/LeaveReview/DefaultView.aspx?id=5QW005,0,0,
Specsavers Opticians,OP_5D1_3685__000001_B913TA,OPT,,90 High Street,,Solihull,,B91 3TA,Tel: 0121 711 3411, - ,,,No ratings yet Rate it yourself - /Services/opticians/LeaveReview/DefaultView.aspx?id=OP_5D1_3685__000001_B913TA,0,0,
Neil Berry Optometrists,OP_5MW_2323__000001_B721RR,OPT,Neil Berry Optometrists,6 Holland Street,,Sutton Coldfield,West Midlands,B72 1RR,Tel: 0121 355 6895, - ,,,No ratings yet Rate it yourself - /Services/opticians/LeaveReview/DefaultView.aspx?id=OP_5MW_2323__000001_B721RR,0,0,
Eye Sight Centre Opticians,5MX099,OPT,,485 Stratford Road,Sparkhill,Birmingham,,B11 4LE,Tel: 0121 771 1277, - ,,,No ratings yet Rate it yourself - /Services/opticians/LeaveReview/DefaultView.aspx?id=5MX099,0,0,
Midlands Community Eyecare Limited,TP9FV,OPT,Kings Court,17 School Road,,Birmingham,West Midlands,B28 8JG,Tel: 0121 517 0218, - ,,,No ratings yet Rate it yourself - /Services/opticians/LeaveReview/DefaultView.aspx?id=TP9FV,0,0,
A S Gill Optometrists,5MX59__000003_B114LP,OPT,537 Stratford Road,Sparkhill,Birmingham,Birmingham,,B11 4LP,Tel: 0121 766 5491, - ,,,No ratings yet Rate it yourself - /Services/opticians/LeaveReview/DefaultView.aspx?id=5MX59__000003_B114LP,0,0,
A S Gill Optometrists,5PG159,OPT,,537 Stratford Road,Sparkhill,Birmingham,,B11 4LP,Tel: 0121 766 5491, - ,,,No ratings yet Rate it yourself - /Services/opticians/LeaveReview/DefaultView.aspx?id=5PG159,0,0,
Banks Opticians,5PG162,OPT,,467 Stratford Road,Sparkhill,Birmingham,West Midlands,B11 4LD,Tel: 0121 773 2047, - ,,,No ratings yet Rate it yourself - /Services/opticians/LeaveReview/DefaultView.aspx?id=5PG162,0,0,
Gurmail Singh Gangar,OP_5MW_8140__000001_B721QY,OPT,,2 South Parade,,Sutton Coldfield,,B72 1QY,Tel: 0121 354 3124, - ,,,No ratings yet Rate it yourself - /Services/opticians/LeaveReview/DefaultView.aspx?id=OP_5MW_8140__000001_B721QY,0,0,
Maxton Saunders Ltd,5PG175,OPT,,842 Stratford Road,Sparkhill,Birmingham,,B11 4BS,Tel: 0121 777 4081, - ,,,No ratings yet Rate it yourself - /Services/opticians/LeaveReview/DefaultView.aspx?id=5PG175,0,0,
Vision Care for Homeless People,5MX121,OPT,SIFA Fireside,48-52 Allcock Street,,Birmingham,,B9 4DY,Tel: 0121 766 1700, - ,,,No ratings yet Rate it yourself - /Services/opticians/LeaveReview/DefaultView.aspx?id=5MX121,0,0,
Optical Clinic,B114DA_0001__000002_B114DA,OPT,837 Stratford Road,Sparkhill,Birmingham,West Midlands,,B11 4DA,Tel: 0121 777 2111, - ,,,No ratings yet Rate it yourself - /Services/opticians/LeaveReview/DefaultView.aspx?id=B114DA_0001__000002_B114DA,0,0,
Scrivens Ltd,OP_5MW_10794__000002_B721PU,OPT,115 Parade,,,Sutton Coldfield,West Midlands,B72 1PU,Tel: 0121 354 4534, - ,,,No ratings yet Rate it yourself - /Services/opticians/LeaveReview/DefaultView.aspx?id=OP_5MW_10794__000002_B721PU,0,0,
Visioncraft (UK) Ltd,5PG194,OPT,,166 Streetsbrook Road,Shirley,Solihull,,B90 3PH,Tel: 0121 772 4424, - ,,,No ratings yet Rate it yourself - /Services/opticians/LeaveReview/DefaultView.aspx?id=5PG194,0,0,
Boots-Birmingham - Sutton Coldfield,OP_5MW_9692__000005_B721PD,OPT,24 The Parade,44-46 Gracechurch Shopping Centre,,Sutton Coldfield,West Midlands,B72 1PD,Tel: 0121 354 4177, - ,,,No ratings yet Rate it yourself - /Services/opticians/LeaveReview/DefaultView.aspx?id=OP_5MW_9692__000005_B721PD,0,0,
Boots Opticians Professional Services Ltd,OP_5MW_7022__000006_B721PD,OPT,44-46 The Parade,Gracechurch Shopping Centre,,Sutton Coldfield,,B72 1PD,Tel: 0121 354 9856, - ,,,No ratings yet Rate it yourself - /Services/opticians/LeaveReview/DefaultView.aspx?id=OP_5MW_7022__000006_B721PD,0,0,
Specsavers Opticians,OP_5MW_1958__000001_B721XX,OPT,"Unit 4, Red Rose Centre",57b Lower Parade,,Sutton Coldfield,West Midlands,B72 1XX,Tel: 0121 354 4143, - ,,,No ratings yet Rate it yourself - /Services/opticians/LeaveReview/DefaultView.aspx?id=OP_5MW_1958__000001_B721XX,0,0,
Vision Express,OP_5MW_6348__000001_B721PA,OPT,198 Gracechurch Centre,Sutton Coldfield,,West Midlands,,B72 1PA,Tel: 0121 321 3353, - ,,,No ratings yet Rate it yourself - /Services/opticians/LeaveReview/DefaultView.aspx?id=OP_5MW_6348__000001_B721PA,0,0,
Opticare Ophthalmic Opticians,5MX70__000001_B128JS,OPT,150a Ladypool Road,Sparkbrook,Birmingham,,,B12 8JS,Tel: 0121 771 3222, - ,,,No ratings yet Rate it yourself - /Services/opticians/LeaveReview/DefaultView.aspx?id=5MX70__000001_B128JS,0,0,
Eyecon Opticians,TP830,OPT,,190b Stoney Lane,Ballsall Health,Birmingham,West Midlands,B12 8AN,Tel: 0121 449 2111, - ,,,No ratings yet Rate it yourself - /Services/opticians/LeaveReview/DefaultView.aspx?id=TP830,0,0,
Ward (Opthalmic Opticians) Ltd,OP_5MW_12170__000001_B735BA,OPT,85a Chester Road,Sutton Coldfield,West Midlands,,,B73 5BA,Tel: 0121 354 8168, - ,,,No ratings yet Rate it yourself - /Services/opticians/LeaveReview/DefaultView.aspx?id=OP_5MW_12170__000001_B735BA,0,0,
Syed Hassan Abbas Abdi,OP_5MX_01__000001_B66SP,OPT,,403 Witton Road,Aston,Birmingham,,B6 6SP,Tel: 0121 356 9390, - ,,,No ratings yet Rate it yourself - /Services/opticians/LeaveReview/DefaultView.aspx?id=OP_5MX_01__000001_B66SP,0,0,
Mohammed Dilwar Khan,5MX65__000001_B128AR,OPT,,259 Stoney Lane,Balsall Heath,Birmingham,,B12 8AR,Tel: 0121 449 2111, - ,,,No ratings yet Rate it yourself - /Services/opticians/LeaveReview/DefaultView.aspx?id=5MX65__000001_B128AR,0,0,
Shah-Jallal Opticians,5MX113,OPT,,420 Witton Road,,Birmingham,,B6 6PP,, - ,,,No ratings yet Rate it yourself - /Services/opticians/LeaveReview/DefaultView.aspx?id=5MX113,0,0,
Aston Eye Clinic,OP_5MX_1502__000001_B47ET,OPT,,Aston Eye Clinic,"Vision Science, Aston University",Birmingham,West Midlands,B4 7ET,Tel: 0121 204 3900, - ,,,No ratings yet Rate it yourself - /Services/opticians/LeaveReview/DefaultView.aspx?id=OP_5MX_1502__000001_B47ET,0,0,
Specs at Home (Midlands) Ltd,5MX105__000001_B280PH,OPT,249 Wake Green Rd,Moseley,Birmingham,B13 9XH,West Midlands,B13 9XH,Tel: 0121 769 2672, - ,,,No ratings yet Rate it yourself - /Services/opticians/LeaveReview/DefaultView.aspx?id=5MX105__000001_B280PH,0,0,
Mahendra Mohanlal Davda ,OP_5MX_8215__000001_B66PD,OPT,,364 Witton Road,Aston,Birmingham,,B6 6PD,Tel: 0121 327 7792, - ,,,No ratings yet Rate it yourself - /Services/opticians/LeaveReview/DefaultView.aspx?id=OP_5MX_8215__000001_B66PD,0,0,