Organisation Name,NACS Code,Organisation Type,Address1,Address2,Address3,Address4,Address5,PostCode,Telephone Number,Opening time,Value  (Opening time),Banding Classification  (Opening time),NHS.UK users rating,Value  (NHS.UK users rating),Banding Classification  (NHS.UK users rating),Car parking (Is there car parking at this organisation?)
Kinver Opticians,OP_5MN_1681__000001_DY76HE,OPT,51a High Street,Kinver,,Stourbridge,,DY7 6HE,Tel: 01384 872035, - ,,,No ratings yet Rate it yourself - /Services/opticians/LeaveReview/DefaultView.aspx?id=OP_5MN_1681__000001_DY76HE,0,0,
Clive G Stephens,OP_5DR_4342__000001_DY102AD,OPT,2 Church Street,,Kidderminster,,,DY10 2AD,Tel: 01562 822803, - ,,,No ratings yet Rate it yourself - /Services/opticians/LeaveReview/DefaultView.aspx?id=OP_5DR_4342__000001_DY102AD,0,0,
Blink Vision,TP80T,OPT,,201-203 Park Lane,,Kidderminster,,DY11 6TQ,Tel: 0000000000, - ,,,No ratings yet Rate it yourself - /Services/opticians/LeaveReview/DefaultView.aspx?id=TP80T,0,0,
Specsavers Opticians,OP_5DR_9273__000002_DY102DG,OPT,2 Coventry Street,Swan Centre,Kidderminster,,,DY10 2DG,Tel: 01562 823 552, - ,,,No ratings yet Rate it yourself - /Services/opticians/LeaveReview/DefaultView.aspx?id=OP_5DR_9273__000002_DY102DG,0,0,
Vision Express Ltd,000000063__000001_DY102DQ,OPT,6 High Street,,Kidderminster,Worcestershire,,DY10 2DQ,Tel: 01562 824846, - ,,,No ratings yet Rate it yourself - /Services/opticians/LeaveReview/DefaultView.aspx?id=000000063__000001_DY102DQ,0,0,
Boots-Kidderminster,DY10 1AA_19172,OPT,,"Unit 15, Weavers Wharf Retail Park",,Kidderminster,Worcestershire,DY10 1AA,Tel: 01562 824474, - ,,,1 rating Rate it yourself - /Services/opticians/LeaveReview/DefaultView.aspx?id=DY10 1AA_19172,,,
Chapman & Myers Opticians,OP_5DR_11705__000001_DY101EJ,OPT,,5 Vicar Street,Kidderminster,Worcestershire,,DY10 1DE,Tel: 01562 822276, - ,,,2 ratings Rate it yourself - /Services/opticians/LeaveReview/DefaultView.aspx?id=OP_5DR_11705__000001_DY101EJ,,,
P Crawford,OP_5DR_3243__000001_DY101BB,OPT,8 Oxford Street,,Kidderminster,,,DY10 1BB,Tel: 01562 822577, - ,,,No ratings yet Rate it yourself - /Services/opticians/LeaveReview/DefaultView.aspx?id=OP_5DR_3243__000001_DY101BB,0,0,
Eyecare Kidderminster Ltd,M2B9S,OPT,,"Unit 1 in Morrisons Supermarket, Green Street",,Kidderminster,,DY10 1AZ,, - ,,,No ratings yet Rate it yourself - /Services/opticians/LeaveReview/DefaultView.aspx?id=M2B9S,0,0,
The Factory Opticians,00000064__000001_DY101HJ,OPT,Dixon Street,,Kidderminster,Worcestershire,,DY10 1HJ,Tel: 01562 747087, - ,,,No ratings yet Rate it yourself - /Services/opticians/LeaveReview/DefaultView.aspx?id=00000064__000001_DY101HJ,0,0,
MC Perrigo,00000065__000002_DY122AW,OPT,71 Load Street,,Bewdley,Worcestershire,,DY12 2AW,Tel: 01299 403722, - ,,,No ratings yet Rate it yourself - /Services/opticians/LeaveReview/DefaultView.aspx?id=00000065__000002_DY122AW,0,0,
J & S Bangay,OP_5HT_3598__000001_DY83QG,OPT,60 Bridgnorth Road,Wollaston,,Stourbridge,West Midlands,DY8 3QG,Tel: 01384 396585, - ,,,1 rating Rate it yourself - /Services/opticians/LeaveReview/DefaultView.aspx?id=OP_5HT_3598__000001_DY83QG,,,yes
Edmund Proctor & Associates,00000066__000002_DY102BX,OPT,Coppice Gate,Tanners Hill,Bewdley,Worcestershire,,DY12 2LP,Tel: 07701 281081, - ,,,1 rating Rate it yourself - /Services/opticians/LeaveReview/DefaultView.aspx?id=00000066__000002_DY102BX,,,
Robinson & Sproson,OP_5DR_12006__000001_DY90NW,OPT,143 - 145 Worcester Road,Hagley,West Midlands,Hagley,,DY9 0NW,Tel: 01562 882444, - ,,,No ratings yet Rate it yourself - /Services/opticians/LeaveReview/DefaultView.aspx?id=OP_5DR_12006__000001_DY90NW,0,0,
P W Optics Ltd,TP8NN,OPT,,Unit 2 Market Street,,Stourbridge,West Midlands,DY8 1YD,Tel: 01384 936020, - ,,,No ratings yet Rate it yourself - /Services/opticians/LeaveReview/DefaultView.aspx?id=TP8NN,0,0,yes
Eyewise Opticians,OP_5HT_4692__000001_DY81YD,OPT,,7 Market Street,Stourbridge,West Midlands,,DY8 1AB,Tel: 01384 395333, - ,,,12 ratings Rate it yourself - /Services/opticians/LeaveReview/DefaultView.aspx?id=OP_5HT_4692__000001_DY81YD,,,
Boots-Stourbridge,OP_5HT_6791__000001_DY81DT,OPT,119 High Street,,,Stourbridge,West Midlands,DY8 1DT,Tel: 01384 440 594, - ,,,No ratings yet Rate it yourself - /Services/opticians/LeaveReview/DefaultView.aspx?id=OP_5HT_6791__000001_DY81DT,0,0,
Specsavers Opticians,OP_5HT_7393__000001_DY81DX,OPT,71 High Street,,Stourbridge,,,DY8 1DX,Tel: 01384 440464, - ,,,No ratings yet Rate it yourself - /Services/opticians/LeaveReview/DefaultView.aspx?id=OP_5HT_7393__000001_DY81DX,0,0,
Special Look's Opticians,00299__000002_DY98LP,OPT,84a Pedmore Road,Lye,Stourbridge,West Midlands,,DY9 8LP,Tel: 01384 340 101, - ,,,No ratings yet Rate it yourself - /Services/opticians/LeaveReview/DefaultView.aspx?id=00299__000002_DY98LP,0,0,
Julian Hill Opticians,OP_5HT_4772__000002_DY81QU,OPT,108 Hagley Road,Oldswinford,Stourbridge,,,DY8 1QU,Tel: 01384 374 232, - ,,,1 rating Rate it yourself - /Services/opticians/LeaveReview/DefaultView.aspx?id=OP_5HT_4772__000002_DY81QU,,,
Docker & Wilson Ltd,OP_5HT_3049__000001_DY81ED,OPT,84 High Street,,Stourbridge,,,DY8 1ED,Tel: 01384 394300, - ,,,No ratings yet Rate it yourself - /Services/opticians/LeaveReview/DefaultView.aspx?id=OP_5HT_3049__000001_DY81ED,0,0,
John Hamer Opticians,OP_5HT_3163__000002_DY85PD,OPT,11 Wordsley Green Shopping Centre,Wordsley Green,Stourbridge,,,DY8 5PD,Tel: 01384 401 201, - ,,,No ratings yet Rate it yourself - /Services/opticians/LeaveReview/DefaultView.aspx?id=OP_5HT_3163__000002_DY85PD,0,0,
Hagley Eyecare Studio,201220160917,OPT,,Unit 42 The Old Woodyard,,Hagley,,DY9 9LQ,, - ,,,2 ratings Rate it yourself - /Services/opticians/LeaveReview/DefaultView.aspx?id=201220160917,,,
Pinder & Moore Optometrists,OP_5HT_448__000001_DY69LE,OPT,58 Market Street,Mill House,Kingswinford,West Midlands,,DY6 9LE,Tel: 01384 274426, - ,,,No ratings yet Rate it yourself - /Services/opticians/LeaveReview/DefaultView.aspx?id=OP_5HT_448__000001_DY69LE,0,0,
Krystal Vision,OP_5HT_14937__000001_DY69JU,OPT,34 Market Street,Kingswinford,West Midlands,,,DY6 9JU,Tel: 01384 271971, - ,,,No ratings yet Rate it yourself - /Services/opticians/LeaveReview/DefaultView.aspx?id=OP_5HT_14937__000001_DY69JU,0,0,
R A Lawley Ltd,OP_5HT_3004__000001_DY69JA,OPT,3-3a The Cross,Summer Hill,Kingswinford,,,DY6 9JA,Tel: 01384 271 888, - ,,,No ratings yet Rate it yourself - /Services/opticians/LeaveReview/DefaultView.aspx?id=OP_5HT_3004__000001_DY69JA,0,0,
The Eyecare Centre Ltd,OP_5HT_14936__000001_DY68AA,OPT,796 High Street,Kingswinford,West Midlands,,,DY6 8AA,Tel: 01384 292505, - ,,,No ratings yet Rate it yourself - /Services/opticians/LeaveReview/DefaultView.aspx?id=OP_5HT_14936__000001_DY68AA,0,0,
Seymour & Easlea Ltd.,(5DR)__000001_DY138DJ,OPT,2a High Street,,Stourport On Severn,Worcestershire,,DY13 8DJ,Tel: 01299 877171, - ,,,No ratings yet Rate it yourself - /Services/opticians/LeaveReview/DefaultView.aspx?id=(5DR)__000001_DY138DJ,0,0,
Specsavers Opticians,OP_5DR_12005__000001_DY138BL,OPT,45 High Street,Stourport-on-Severn,Worcestershire,,,DY13 8BX,Tel: 01299 877999, - ,,,No ratings yet Rate it yourself - /Services/opticians/LeaveReview/DefaultView.aspx?id=OP_5DR_12005__000001_DY138BL,0,0,
Specsavers Opticians,5PL 00000__000001_DY139JW,OPT,45 The High Street,,Stourport On Severn,Worcestershire,,DY13 8BX,Tel: 01299 877999, - ,,,1 rating Rate it yourself - /Services/opticians/LeaveReview/DefaultView.aspx?id=5PL 00000__000001_DY139JW,,,
Special Look's Opticians,00292__000002_DY60JJ,OPT,52 Enville Road,,Wall Heath,West Midlands,,DY6 0JT,Tel: 01384 294617, - ,,,No ratings yet Rate it yourself - /Services/opticians/LeaveReview/DefaultView.aspx?id=00292__000002_DY60JJ,0,0,
Spectacle Wearhouse,OP_5DR_2669__000001_DY139EH,OPT,29 York Street,,Stourport-on-Severn,,,DY13 9EH,Tel: 01299 826688, - ,,,No ratings yet Rate it yourself - /Services/opticians/LeaveReview/DefaultView.aspx?id=OP_5DR_2669__000001_DY139EH,0,0,
Robert Hill Opticians,OP_5HT_8972__000001_DY98LB,OPT,39 High Street,Lye,,Stourbridge,West Midlands,DY9 8LF,Tel: 01384 422270, - ,,,3 ratings Rate it yourself - /Services/opticians/LeaveReview/DefaultView.aspx?id=OP_5HT_8972__000001_DY98LB,,,
Sanjeev Singh Sanghera,5MX083,OPT,,39 High Street,Lye,Stourbridge,,DY9 8LF,Tel: 01384 422270, - ,,,No ratings yet Rate it yourself - /Services/opticians/LeaveReview/DefaultView.aspx?id=5MX083,0,0,
Budgetspex Ltd,5M2149__000003_DY90NW,OPT,8 Baird House Second Avenue,Pensett Trading Estate,Kingswinford,West Midlands,,DY6 7YA,Tel: 0871 2503601, - ,,,No ratings yet Rate it yourself - /Services/opticians/LeaveReview/DefaultView.aspx?id=5M2149__000003_DY90NW,0,0,
J S Edmunds,OP_5HT_7829__000001_DY53AU,OPT,101 High Street,,Brierley Hill,,,DY5 3AU,Tel: 01384 77025, - ,,,No ratings yet Rate it yourself - /Services/opticians/LeaveReview/DefaultView.aspx?id=OP_5HT_7829__000001_DY53AU,0,0,
Pickford Opticians,OP_5HT_12084__000001_DY53BU,OPT,177 High Street,,Brierley Hill,,,DY5 3BU,Tel: 01384 77326, - ,,,4 ratings Rate it yourself - /Services/opticians/LeaveReview/DefaultView.aspx?id=OP_5HT_12084__000001_DY53BU,,,
Vision Express (UK) Ltd,OP_5HT_290__000003_DY51SY,OPT,Units U44-U45,The Merry Hill Centre,Brierley Hill,West Midlands,,DY5 1SY,Tel: 01384 481 616, - ,,,No ratings yet Rate it yourself - /Services/opticians/LeaveReview/DefaultView.aspx?id=OP_5HT_290__000003_DY51SY,0,0,
Boots Opticians and Hearing Care,OP_5HT_242__000002_DY51SY,OPT,The Merry Hill Centre,Brierley Hill,Dudley,West Midlands,,DY5 1QT,Tel: 01384 74817, - ,,,13 ratings Rate it yourself - /Services/opticians/LeaveReview/DefaultView.aspx?id=OP_5HT_242__000002_DY51SY,,,
Optical Express,OP_5HT_1213__000001_DY51SS,OPT,U83,Upper Mall,Merry Hill Shopping Centre,Brierley Hill,West Midlands,DY5 1SS,Tel: 0800 023 2020, - ,,,3 ratings Rate it yourself - /Services/opticians/LeaveReview/DefaultView.aspx?id=OP_5HT_1213__000001_DY51SS,,,
Boots-Brierley Hill - Merry Hill Centre (next to Boots UK),OP_5HT_2764__000001_DY51QX,OPT,Unit 66,Merry Hill Centre,,Brierley Hill,West Midlands,DY5 1QX,Tel: 01384 74817, - ,,,1 rating Rate it yourself - /Services/opticians/LeaveReview/DefaultView.aspx?id=OP_5HT_2764__000001_DY51QX,,,
Perrigo Opticians,OP_5MN_4235__000001_WV59JB,OPT,"The Willows, Maypole Street",Wombourne,Wolverhampton,,,WV5 9JB,Tel: 01902 893732, - ,,,1 rating Rate it yourself - /Services/opticians/LeaveReview/DefaultView.aspx?id=OP_5MN_4235__000001_WV59JB,,,
Taylor Biddle Opticians Wombourne,CO-3769,OPT,,34 Windmill Bank,,WOMBOURNE,,WV5 9JD,, - ,,,No ratings yet Rate it yourself - /Services/opticians/LeaveReview/DefaultView.aspx?id=CO-3769,0,0,
DUDLEY WOOD OPTICIANS,OPT_DY20BH_1,OPT,,2 Bush Road,,Dudley,,DY2 0BH,Tel: 01384 412 600, - ,,,3 ratings Rate it yourself - /Services/opticians/LeaveReview/DefaultView.aspx?id=OPT_DY20BH_1,,,
Eye Society,OP_5MH_10164__000002_B645HH,OPT,33 High Street,,Cradley Heath,,,B64 5HL,Tel: 01384 633336, - ,,,No ratings yet Rate it yourself - /Services/opticians/LeaveReview/DefaultView.aspx?id=OP_5MH_10164__000002_B645HH,0,0,
The Eyecare Centre Ltd,OP_5HV_13510__000001_DY32UB,OPT,42 Louise Street,Gornal Wood,Dudley,West Midlands,,DY3 2UB,Tel: 01384 256 248, - ,,,No ratings yet Rate it yourself - /Services/opticians/LeaveReview/DefaultView.aspx?id=OP_5HV_13510__000001_DY32UB,0,0,
Arnold Opticians,OP_5MH_10243__000001_B645HG,OPT,17-18 High Street,,Cradley Heath,,,B64 5HG,Tel: 01384 561969, - ,,,No ratings yet Rate it yourself - /Services/opticians/LeaveReview/DefaultView.aspx?id=OP_5MH_10243__000001_B645HG,0,0,
R Meredith,OP_5MH_7811__000001_B645HP,OPT,6 High Street,,Cradley Heath,,,B64 5HP,Tel: 01384 566 770, - ,,,No ratings yet Rate it yourself - /Services/opticians/LeaveReview/DefaultView.aspx?id=OP_5MH_7811__000001_B645HP,0,0,
David Wright Opticians,OP_5HV_3943__000001_DY29PS,OPT,88 Halesowen Road,Netherton,Dudley,West Midlands,,DY2 9PS,Tel: 01384 238084, - ,,,2 ratings Rate it yourself - /Services/opticians/LeaveReview/DefaultView.aspx?id=OP_5HV_3943__000001_DY29PS,,,
D Wright,OP_5MH_3944__000001_B646HU,OPT,178 Halesowen Road,,Cradley Heath,,,B64 6HU,Tel: 01384 568622, - ,,,No ratings yet Rate it yourself - /Services/opticians/LeaveReview/DefaultView.aspx?id=OP_5MH_3944__000001_B646HU,0,0,
Specsavers ,OP_5HT_14938__000002_B634AL,OPT,36 Hagley Mall,The Cornbow Centre,Halesowen,,,B63 4AL,Tel: 0121 504 4940, - ,,,No ratings yet Rate it yourself - /Services/opticians/LeaveReview/DefaultView.aspx?id=OP_5HT_14938__000002_B634AL,0,0,
Scrivens Ltd,OP_5HT_5770__000001_B634AL,OPT,5 Hagley Mall,The Cornbow Centre,,Halesowen,,B63 4AL,Tel: 0121 501 1010, - ,,,No ratings yet Rate it yourself - /Services/opticians/LeaveReview/DefaultView.aspx?id=OP_5HT_5770__000001_B634AL,0,0,
Chapman & Myers Opticians,OP_5HT_437__000001_B634AB,OPT,14 Hagley Mall,The Cornbow Centre,,Halesowen,,B63 4AL,Tel: 0121 585 7065, - ,,,1 rating Rate it yourself - /Services/opticians/LeaveReview/DefaultView.aspx?id=OP_5HT_437__000001_B634AB,,,
Vivid Optical Ltd,06266214,OPT,,Faraday Drive,,"Bridgnorth, Shropshire",,WV15 5BA,, - ,,,1 rating Rate it yourself - /Services/opticians/LeaveReview/DefaultView.aspx?id=06266214,,,
Boots-Halesowen,OP_5HT_690__000001_B633AS,OPT,2 Hagley Street,Halesowen,,West Midlands,,B63 3AS,Tel: 0121 550 1610, - ,,,2 ratings Rate it yourself - /Services/opticians/LeaveReview/DefaultView.aspx?id=OP_5HT_690__000001_B633AS,,,
Eye Society Opticians,OP_5HT_3430__000002_B633AW,OPT,,4 Peckingham Street,,Halesowen,West Midlands,B63 3AW,Tel: 0121 585 5347, - ,,,1 rating Rate it yourself - /Services/opticians/LeaveReview/DefaultView.aspx?id=OP_5HT_3430__000002_B633AW,,,
Taylor Made Specs,OP_DY32DA_34272,OPT,,"6 The Arcade, Kent Street",,Upper Gornal,,DY3 2DA,Tel: 01902 664783, - ,,,1 rating Rate it yourself - /Services/opticians/LeaveReview/DefaultView.aspx?id=OP_DY32DA_34272,,,
Eye Health Clinic,01-23489,OPT,,168 High Street (corner of stafford street),,Dudley,,DY1 1QD,Tel: 01384 936438, - ,,,4 ratings Rate it yourself - /Services/opticians/LeaveReview/DefaultView.aspx?id=01-23489,,,yes
Bonham & Butler Opticians ,OP_5HV_13508__000001_DY11ED,OPT,216 Wolverhampton Street,,Dudley,West Midlands,,DY1 1ED,Tel: 01384 253696, - ,,,No ratings yet Rate it yourself - /Services/opticians/LeaveReview/DefaultView.aspx?id=OP_5HV_13508__000001_DY11ED,0,0,
Dollond & Aitchison,OP_5HV_3000__000002_DY11PD,OPT,219 High Street,Dudley,West Midlands,,,DY1 1PD,Tel: 01384 253859, - ,,,No ratings yet Rate it yourself - /Services/opticians/LeaveReview/DefaultView.aspx?id=OP_5HV_3000__000002_DY11PD,0,0,
4 Sight,OP_5HV_5402__000001_DY27BL,OPT,15 Churchill Shopping Centre,,Dudley,,,DY2 7BL,Tel: 01384 242444, - ,,,No ratings yet Rate it yourself - /Services/opticians/LeaveReview/DefaultView.aspx?id=OP_5HV_5402__000001_DY27BL,0,0,
Specsavers Opticians,OP_5HV_8264__000001_DY11LF,OPT,13 Castle Street,,Dudley,,,DY1 1LF,Tel: 01384 214 851, - ,,,No ratings yet Rate it yourself - /Services/opticians/LeaveReview/DefaultView.aspx?id=OP_5HV_8264__000001_DY11LF,0,0,
A.J. Moore,OP_5HV_13509__000001_DY11LQ,OPT,"264, Castle Street",,Dudley,West Midlands,,DY1 1LQ,Tel: 01384 252903, - ,,,1 rating Rate it yourself - /Services/opticians/LeaveReview/DefaultView.aspx?id=OP_5HV_13509__000001_DY11LQ,,,
R T Knight Opticians,OP_5HV_8488__000002_DY31SB,OPT,8 Dudley Street,Sedgley,Dudley,,,DY3 1SB,Tel: 01902 883 260, - ,,,2 ratings Rate it yourself - /Services/opticians/LeaveReview/DefaultView.aspx?id=OP_5HV_8488__000002_DY31SB,,,
Specs Direct,OP_5HV_1048__000001_DY31RU,OPT,"3, The Bull Ring",Sedgley,Dudley,,,DY3 1RU,Tel: 01902 676410, - ,,,No ratings yet Rate it yourself - /Services/opticians/LeaveReview/DefaultView.aspx?id=OP_5HV_1048__000001_DY31RU,0,0,
Trevor Phillips Opticians,OP_5M2_4743__000001_WV164EG,OPT,8 Waterloo Terrace,,Bridgnorth,Shropshire,,WV16 4EG,Tel: 01746 766227, - ,,,No ratings yet Rate it yourself - /Services/opticians/LeaveReview/DefaultView.aspx?id=OP_5M2_4743__000001_WV164EG,0,0,
Biddle + Liage Opticians,OP_5M2_790__000001_WV164QN,OPT,,59 High Street,,Bridgnorth,Shropshire,WV16 4DX,Tel: 01746 762895, - ,,,No ratings yet Rate it yourself - /Services/opticians/LeaveReview/DefaultView.aspx?id=OP_5M2_790__000001_WV164QN,0,0,
Evenett Opticians Ltd,OP_5M2_8312__000001_WV164AW,OPT,3 Listley Street,,Bridgnorth,Shropshire,,WV16 4AW,Tel: 01746 763330, - ,,,No ratings yet Rate it yourself - /Services/opticians/LeaveReview/DefaultView.aspx?id=OP_5M2_8312__000001_WV164AW,0,0,
Rileys Opticians,OP_5MH_959__000002_B650DR,OPT,38-39 High Street,,,Rowley Regis,,B65 0DR,Tel: 0121 559 1314, - ,,,No ratings yet Rate it yourself - /Services/opticians/LeaveReview/DefaultView.aspx?id=OP_5MH_959__000002_B650DR,0,0,
Cleobury Opticians,CO-5117,OPT,,16 Church Street,,Kidderminster,,DY14 8BX,, - ,,,No ratings yet Rate it yourself - /Services/opticians/LeaveReview/DefaultView.aspx?id=CO-5117,0,0,
Bridgnorth Specsavers,OP5M2_3320__000001_WV164DX,OPT,60 High Street,,Bridgnorth,Shropshire,,WV16 4DB,Tel: 01746 713950, - ,,,2 ratings Rate it yourself - /Services/opticians/LeaveReview/DefaultView.aspx?id=OP5M2_3320__000001_WV164DX,,,
Eyeland,OP_5MH_13682__000001_B650DT,OPT,4 High Street,,Rowley Regis,,,B65 0DT,Tel: 0121 559 1054, - ,,,No ratings yet Rate it yourself - /Services/opticians/LeaveReview/DefaultView.aspx?id=OP_5MH_13682__000001_B650DT,0,0,
Eyes & Vision,OP_5MH_13683__000001_B650HP,OPT,1 Market Place,High Street,Rowley Regis,,,B65 0HP,Tel: 0121 559 5552, - ,,,No ratings yet Rate it yourself - /Services/opticians/LeaveReview/DefaultView.aspx?id=OP_5MH_13683__000001_B650HP,0,0,
JK Opticians,OP_5MG_8449__000001_B650JN,OPT,8 Oldbury Road,,Rowley Regis,Birmingham,,B65 0JN,Tel: 0121 559 6041, - ,,,No ratings yet Rate it yourself - /Services/opticians/LeaveReview/DefaultView.aspx?id=OP_5MG_8449__000001_B650JN,0,0,
Miracle Eyes Ltd,OP_5MV_635__000002_WV45QF,OPT,317a Penn Road,Penn,,Wolverhampton,,WV4 5QF,Tel: 01902 621111, - ,,,No ratings yet Rate it yourself - /Services/opticians/LeaveReview/DefaultView.aspx?id=OP_5MV_635__000002_WV45QF,0,0,
C Cacoullis,OP_5HT_10204__000001_B629BB,OPT,68 Halesowen Road,Halesowen,West Midlands,,,B62 9BB,Tel: 0121 422 3356, - ,,,No ratings yet Rate it yourself - /Services/opticians/LeaveReview/DefaultView.aspx?id=OP_5HT_10204__000001_B629BB,0,0,
Dalvinder Singh Sidhu,5PG164,OPT,,29 Halesowen Road,Halesowen,West Midlands,,B62 9AB,Tel: 0121 454 6569, - ,,,No ratings yet Rate it yourself - /Services/opticians/LeaveReview/DefaultView.aspx?id=5PG164,0,0,
Troth Opticians,00000051__000003_B459JR,OPT,135 New Road,Rubery,Birmingham,,,B45 9JR,Tel: 0121 453 2146, - ,,,No ratings yet Rate it yourself - /Services/opticians/LeaveReview/DefaultView.aspx?id=00000051__000003_B459JR,0,0,
Beacon Opticians Plus +,CO-5239,OPT,Beacon Centre,Wolverhampton Road East,,Wolverhampton,West Midlands,WV4 6AZ,Tel: 01902 886794, - ,,,No ratings yet Rate it yourself - /Services/opticians/LeaveReview/DefaultView.aspx?id=CO-5239,0,0,
On Call Opticians - Home Visits for an Eye Test,TAMOPTICIAN0001,OPT,WEST MIDLANDS ONLY SERVICE Registered at,61 Trafalgar Road,,Oldbury,West Midlands,B69 1RE,Tel: 01384 234 779, - ,,,77 ratings Rate it yourself - /Services/opticians/LeaveReview/DefaultView.aspx?id=TAMOPTICIAN0001,,,yes
Eye Deal Opticians,OP_5MH_13686__000001_DY48LY,OPT,Neptune Health Park,Sedgley Road West,,Tipton,West Midlands,DY4 8LY,Tel: 0121 612 1919, - ,,,1 rating Rate it yourself - /Services/opticians/LeaveReview/DefaultView.aspx?id=OP_5MH_13686__000001_DY48LY,,,
Williams Optometrists,OP_5MR_9056__000002_B459JW,OPT,161 New Road,Rubery,Birmingham,,,B45 9JW,Tel: 0121 453 2581, - ,,,No ratings yet Rate it yourself - /Services/opticians/LeaveReview/DefaultView.aspx?id=OP_5MR_9056__000002_B459JW,0,0,
Penn Eyecare,OP_5MV_512__000001_WV44AD,OPT,Penn Eyecare,252 Penn Road,Penn,Wolverhampton,West Midlands,WV4 4AD,Tel: 01902 342999, - ,,,No ratings yet Rate it yourself - /Services/opticians/LeaveReview/DefaultView.aspx?id=OP_5MV_512__000001_WV44AD,0,0,yes
Spex4U Limited,OL5PL01__000005_B459JA,OPT,174 New Road,Rubery,,Birmingham,Worcestershire,B45 9JA,Tel: 0121 453 7179, - ,,,1 rating Rate it yourself - /Services/opticians/LeaveReview/DefaultView.aspx?id=OL5PL01__000005_B459JA,,,
Eyecare Opticians Parkside,B61 0AZ,OPT,BHI Parkside Medical Centre,Stourbridge Road,,Bromsgrove,,B61 0AZ,Tel: 01527 888599, - ,,,No ratings yet Rate it yourself - /Services/opticians/LeaveReview/DefaultView.aspx?id=B61 0AZ,0,0,
NVision Eyecare,01-21451 - 1,OPT,,84 Windmill Lane,Castle Croft,Wolverhampton,,WV3 8HG,Tel: 01902 380 000, - ,,,1 rating Rate it yourself - /Services/opticians/LeaveReview/DefaultView.aspx?id=01-21451 - 1,,,
Hamptons Optical Ltd.,00000052__000001_B618DJ,OPT,Crown House,11 Crown Close,Bromsgrove,Worcestershire,,B61 8DJ,, - ,,,No ratings yet Rate it yourself - /Services/opticians/LeaveReview/DefaultView.aspx?id=00000052__000001_B618DJ,0,0,
Specsavers Opticians,OP_5MR_12187__000001_B618DD,OPT,131 High Street,Bromsgrove,Worcestershire,,,B61 8AE,Tel: 01527 579 815, - ,,,2 ratings Rate it yourself - /Services/opticians/LeaveReview/DefaultView.aspx?id=OP_5MR_12187__000001_B618DD,,,
Chapman Opticians,OP_5MR_8077__000002_B618AQ,OPT,103 High Street,,Bromsgrove,,,B61 8AE,Tel: 01527 836290, - ,,,1 rating Rate it yourself - /Services/opticians/LeaveReview/DefaultView.aspx?id=OP_5MR_8077__000002_B618AQ,,,
Boots-Bromsgrove,OP_5MR_276__000002_B618EX,OPT,64 High Street,Bromsgrove,,Worcestershire,Worcestershire,B61 8EX,Tel: 01527 872 583, - ,,,No ratings yet Rate it yourself - /Services/opticians/LeaveReview/DefaultView.aspx?id=OP_5MR_276__000002_B618EX,0,0,
Myoptics Eye Clinic,I2T1M,OPT,,14 Curdale Road,Bartley Green,Birmingham,West Midlands,B32 4HB,Tel: 01214754920, - ,,,2 ratings Rate it yourself - /Services/opticians/LeaveReview/DefaultView.aspx?id=I2T1M,,,
Portway Opticians,CO-4566,OPT,,51A New Birmingham Road,,Oldbury,,B69 2JQ,Tel: 0121 544 1854, - ,,,2 ratings Rate it yourself - /Services/opticians/LeaveReview/DefaultView.aspx?id=CO-4566,,,
H. Wyn  Williams Optometrist,OP_5MV_4776__000002_WV37HT,OPT,6 Trysull Road,Bradmore,,Wolverhampton,West Midlands,WV3 7HT,Tel: 01902 620352, - ,,,1 rating Rate it yourself - /Services/opticians/LeaveReview/DefaultView.aspx?id=OP_5MV_4776__000002_WV37HT,,,yes
Taylor Biddle Opticians,OP_5MV_1765__000002_WV68AF,OPT,39 Bridgnorth Road,Compton,,Wolverhampton,,WV6 8AF,Tel: 01902 750325, - ,,,18 ratings Rate it yourself - /Services/opticians/LeaveReview/DefaultView.aspx?id=OP_5MV_1765__000002_WV68AF,,,
Eyecare Opticians,5112 ,OPT,,"Bank Buildings, Langley High Street",,"Langley, Oldbury",,B69 4SN,Tel: 0121 552 4698, - ,,,No ratings yet Rate it yourself - /Services/opticians/LeaveReview/DefaultView.aspx?id=5112,0,0,
Scrivens Ltd,OP_5MG_5453__000001_B680DJ,OPT,496 Hagley Road West,Quinton,Oldbury,Smethwick,West Midlands,B68 0DJ,Tel: 0121 422 3007, - ,,,No ratings yet Rate it yourself - /Services/opticians/LeaveReview/DefaultView.aspx?id=OP_5MG_5453__000001_B680DJ,0,0,
Scrivens Ltd,OP_5MG_12079__000002_B694DT,OPT,9 Birmingham Street,,,Oldbury,West Midlands,B69 4DT,Tel: 0121 552 1189, - ,,,No ratings yet Rate it yourself - /Services/opticians/LeaveReview/DefaultView.aspx?id=OP_5MG_12079__000002_B694DT,0,0,
Eye Deal Opticians,OP_5MH_8755__000001_DY49JA,OPT,Glebefields Health Centre,St Marks Road,,Tipton,West Midlands,DY4 0UB,Tel: 0121 557 1465, - ,,,No ratings yet Rate it yourself - /Services/opticians/LeaveReview/DefaultView.aspx?id=OP_5MH_8755__000001_DY49JA,0,0,
The Right Vision Ophthalmic Opticians,OP_5PF_1381__000001_B694DS,OPT,34 Birmingham Street,,Oldbury,West Midlands,,B69 4DS,Tel: 0121 544 2323, - ,,,No ratings yet Rate it yourself - /Services/opticians/LeaveReview/DefaultView.aspx?id=OP_5PF_1381__000001_B694DS,0,0,