Organisation Name,NACS Code,Organisation Type,Address1,Address2,Address3,Address4,Address5,PostCode,Telephone Number,Opening time,Value  (Opening time),Banding Classification  (Opening time),NHS.UK users rating,Value  (NHS.UK users rating),Banding Classification  (NHS.UK users rating),Car parking (Is there car parking at this organisation?)
J & D Mason Opticians,5M143__000001_B380SD,OPT,,2 The Green,Kings Norton,Birmingham,,B38 8SD,Tel: 0121 451 3485, - ,,,5 ratings Rate it yourself - /Services/opticians/LeaveReview/DefaultView.aspx?id=5M143__000001_B380SD,,,
Scrivens Ltd,OP_5M1_7540__000001_B303EG,OPT,37 Pershore Road South,Cotteridge,,Birmingham,West Midlands,B30 3EG,Tel: 0121 458 3335, - ,,,No ratings yet Rate it yourself - /Services/opticians/LeaveReview/DefaultView.aspx?id=OP_5M1_7540__000001_B303EG,0,0,
Eyeworld Optometrists,5MX053,OPT,,1863 Pershore Road,Cotteridge,Birmingham,,B30 3DJ,Tel: 0121 458 1359, - ,,,No ratings yet Rate it yourself - /Services/opticians/LeaveReview/DefaultView.aspx?id=5MX053,0,0,
Eyecare Mobile Opticians Ltd,5QW049,OPT,,16 Watford Road,Cotteridge,Birmingham,,B30 1JA,Tel: 0800 633 5092, - ,,,No ratings yet Rate it yourself - /Services/opticians/LeaveReview/DefaultView.aspx?id=5QW049,0,0,
Ashtree Eyecare Centre,5M1106,OPT,,1547 Pershore Road,Stirchley,Birmingham,,B30 2JH,Tel: 0121 458 4595, - ,,,No ratings yet Rate it yourself - /Services/opticians/LeaveReview/DefaultView.aspx?id=5M1106,0,0,
Maginnis Opticians (Optometrists) Ltd,OP_5M1_7062__000003_B302JR,OPT,1379 Pershore Road,Stirchley,Birmingham,,,B30 2JR,Tel: 0121 458 2920, - ,,,No ratings yet Rate it yourself - /Services/opticians/LeaveReview/DefaultView.aspx?id=OP_5M1_7062__000003_B302JR,0,0,
Pabari Opticians Ltd,OP_5M1_4727__000002_B313JW,OPT,3 Alvechurch Road,West Heath,Birmingham,,,B31 3JW,Tel: 0121 477 5252, - ,,,No ratings yet Rate it yourself - /Services/opticians/LeaveReview/DefaultView.aspx?id=OP_5M1_4727__000002_B313JW,0,0,
Penzer Opticians,OP_5M1_5811__000001_B145HG,OPT,1024 Alcester Road South,Maypole,Nr Kings Heath,Birmingham,,B14 5NG,Tel: 0121 430 5538, - ,,,1 rating Rate it yourself - /Services/opticians/LeaveReview/DefaultView.aspx?id=OP_5M1_5811__000001_B145HG,,,yes
Vision Replublic,5M1098,OPT,,1003 Alcester Road South,Maypole,Birmingham,,B14 5JA,Tel: 0121 430 6572, - ,,,No ratings yet Rate it yourself - /Services/opticians/LeaveReview/DefaultView.aspx?id=5M1098,0,0,
Vincent Roberts Optometrist,OP_5M1_3786__000001_B146EB,OPT,267 Alcester Road South,Kings Heath,Birmingham,,,B14 6EB,Tel: 0121 441 2843, - ,,,4 ratings Rate it yourself - /Services/opticians/LeaveReview/DefaultView.aspx?id=OP_5M1_3786__000001_B146EB,,,
Specsavers Opticians,OP_5M1_8153__000002_B312NN,OPT,,"Unit 3, 780-792 Bristol Road South",Northfield,Birmingham,,B31 2NN,Tel: 0121 476 4717, - ,,,No ratings yet Rate it yourself - /Services/opticians/LeaveReview/DefaultView.aspx?id=OP_5M1_8153__000002_B312NN,0,0,
Virdi & Pepall Ltd,5M1105,OPT,,826 Bristol Road South,Northfield,Birmingham,,B31 2NS,Tel: 0121 475 4342, - ,,,5 ratings Rate it yourself - /Services/opticians/LeaveReview/DefaultView.aspx?id=5M1105,,,
Eyewise ,OP_5M1_2922__000002_B312JU,OPT,892 Bristol Road South,Northfield,Birmingham,,,B31 2NS,Tel: 0121 477 6550, - ,,,No ratings yet Rate it yourself - /Services/opticians/LeaveReview/DefaultView.aspx?id=OP_5M1_2922__000002_B312JU,0,0,
Boots-Northfield,5M1089,OPT,816 Bristol Road South,,Northfield,Birmingham,,B31 2NS,Tel: 0121 475 1072, - ,,,No ratings yet Rate it yourself - /Services/opticians/LeaveReview/DefaultView.aspx?id=5M1089,0,0,
Scrivens Ltd,OP_5M1_6295__000001_B312NG,OPT,731 Bristol Road South,Northfield,,Birmingham,West Midlands,B31 2NG,Tel: 0121 475 1152, - ,,,No ratings yet Rate it yourself - /Services/opticians/LeaveReview/DefaultView.aspx?id=OP_5M1_6295__000001_B312NG,0,0,
Specs Direct,5M147__000002_B312PA,OPT,871 Bristol Road South,Northfield,Birmingham,,,B31 2PA,Tel: 0121 477 7474, - ,,,No ratings yet Rate it yourself - /Services/opticians/LeaveReview/DefaultView.aspx?id=5M147__000002_B312PA,0,0,
Pabari Opticians,5M1068,OPT,,84 Raddlebarn Road,,Birmingham,,B29 6HH,, - ,,,No ratings yet Rate it yourself - /Services/opticians/LeaveReview/DefaultView.aspx?id=5M1068,0,0,
Cox Opticians,5M1096,OPT,,57 Raddlebarn Road,Selly Oak,Birmingham,,B29 6HQ,Tel: 0121 472 7888, - ,,,No ratings yet Rate it yourself - /Services/opticians/LeaveReview/DefaultView.aspx?id=5M1096,0,0,
Boots-Kings Heath - Alcester Rd Sth,OP_5M1_3509__000001_B147JQ,OPT,51A Alcester Rd South,,Kings Heath,Birmingham,West Midlands,B14 7JQ,Tel: 0121 444 2376, - ,,,1 rating Rate it yourself - /Services/opticians/LeaveReview/DefaultView.aspx?id=OP_5M1_3509__000001_B147JQ,,,
Scrivens Ltd,OP_5M1_5464__000002_B147LG,OPT,124 High Street,Kings Heath,,Birmingham,West Midlands,B14 7LG,Tel: 0121 444 2656, - ,,,No ratings yet Rate it yourself - /Services/opticians/LeaveReview/DefaultView.aspx?id=OP_5M1_5464__000002_B147LG,0,0,
Specsavers Opticians,OP_5M1_5794__000001_B147LG,OPT,,132 High Street,Kings Heath,Birmingham,,B14 7LG,Tel: 0121 441 1322, - ,,,No ratings yet Rate it yourself - /Services/opticians/LeaveReview/DefaultView.aspx?id=OP_5M1_5794__000001_B147LG,0,0,
Pabari Opticians,00000055__000001_B475DX,OPT,Unit2 Drakes Cross Shopping Parade,,Wythall,Worcestershire,,B47 5HD,Tel: 01564 824482, - ,,,1 rating Rate it yourself - /Services/opticians/LeaveReview/DefaultView.aspx?id=00000055__000001_B475DX,,,
Portland Eyecare Services Ltd,5M152__000002_B147EG,OPT,,1 Institute Road,Birmingham,Birmingham,,B14 7EG,Tel: 0121 444 4838, - ,,,No ratings yet Rate it yourself - /Services/opticians/LeaveReview/DefaultView.aspx?id=5M152__000002_B147EG,0,0,
Lakis Stelios Stylianou,5M1011,OPT,,22 School Road,,Birmingham,,B14 4BJ,Tel: 0121 474 3359, - ,,,No ratings yet Rate it yourself - /Services/opticians/LeaveReview/DefaultView.aspx?id=5M1011,0,0,
The Eye Collective Selly Oak,S6Z1Q,OPT,,14 Selly Oak Shopping Park,Aston Webb,Birmingham,,B29 6SQ,Tel: 0121 472 0211, - ,,,No ratings yet Rate it yourself - /Services/opticians/LeaveReview/DefaultView.aspx?id=S6Z1Q,0,0,
Knights Ophthalmic Opticians,5M154__000001_B295QL,OPT,130 Castle Square,Weoley Castle,Birmingham,,,B29 5QL,Tel: 0121 411 1555, - ,,,1 rating Rate it yourself - /Services/opticians/LeaveReview/DefaultView.aspx?id=5M154__000001_B295QL,,,
Scrivens Ltd,OP_5M1_10750__000001_B295QG,OPT,167 Weoley Castle Road,Weoley Castle,,Birmingham,West Midlands,B29 5QH,Tel: 0121 427 1021, - ,,,No ratings yet Rate it yourself - /Services/opticians/LeaveReview/DefaultView.aspx?id=OP_5M1_10750__000001_B295QG,0,0,
S W Optics Ltd,5M1148__000002_B152TT,OPT,"University Of Birmingham, University Centre",Edgbaston,Birmingham,,,B15 2TT,Tel: 0121 414 2714, - ,,,4 ratings Rate it yourself - /Services/opticians/LeaveReview/DefaultView.aspx?id=5M1148__000002_B152TT,,,
Pabari Opticians Ltd,OP_5M1_4726__000001_B138JG,OPT,14 St. Marys Row,Moseley,Birmingham,,,B13 8JG,Tel: 0121 449 0845, - ,,,No ratings yet Rate it yourself - /Services/opticians/LeaveReview/DefaultView.aspx?id=OP_5M1_4726__000001_B138JG,0,0,
Onkar Eye Society,5M1003,OPT,,5 St Mary's Row,Moseley,Birmingham,,B13 8HW,Tel: 0121 249 2071, - ,,,No ratings yet Rate it yourself - /Services/opticians/LeaveReview/DefaultView.aspx?id=5M1003,0,0,
Asda Opticians,OPT_B29 5UP,OPT,,BARNSHILL,"51, BARNES HILL",BIRMINGHAM,,B29 5UP,Tel: 0121 296 0659, - ,,,No ratings yet Rate it yourself - /Services/opticians/LeaveReview/DefaultView.aspx?id=OPT_B29 5UP,0,0,
Michael Wolffe,5M140__000001_B138DH,OPT,22 Chantry Road,Moseley,Birmingham,Birmingham,,B13 8DH,Tel: 0121 449 1724, - ,,,No ratings yet Rate it yourself - /Services/opticians/LeaveReview/DefaultView.aspx?id=5M140__000001_B138DH,0,0,
Specs at Home (Midlands) Ltd,5MX105__000001_B280PH,OPT,249 Wake Green Rd,Moseley,Birmingham,B13 9XH,West Midlands,B13 9XH,Tel: 0121 769 2672, - ,,,No ratings yet Rate it yourself - /Services/opticians/LeaveReview/DefaultView.aspx?id=5MX105__000001_B280PH,0,0,
Waddam Opticians Ltd,OP_5M1_12038__000002_B280XB,OPT,278 Baldwins Lane,Hall Green,Birmingham,,,B28 0XB,Tel: 0121 745 3663, - ,,,No ratings yet Rate it yourself - /Services/opticians/LeaveReview/DefaultView.aspx?id=OP_5M1_12038__000002_B280XB,0,0,
Bainbridge Opticians,5M1032,OPT,,174 High Street,Harborne,Birmingham,,B17 9PP,Tel: 0121 427 8201, - ,,,No ratings yet Rate it yourself - /Services/opticians/LeaveReview/DefaultView.aspx?id=5M1032,0,0,
Looks Opticians Ltd,OP_5M1_6928__000001_B179PN,OPT,154 High Street,Harborne,Birmingham,,,B17 9PN,Tel: 0121 427 3535, - ,,,No ratings yet Rate it yourself - /Services/opticians/LeaveReview/DefaultView.aspx?id=OP_5M1_6928__000001_B179PN,0,0,
Specsavers,5M1108,OPT,,136 High Street,Harborne,Birmingham,,B17 9NN,Tel: 0121 426 0810, - ,,,No ratings yet Rate it yourself - /Services/opticians/LeaveReview/DefaultView.aspx?id=5M1108,0,0,
Harborne VE LTD ,5M155__000001_B179NP,OPT,,144 High Street,Harborne,Birmingham,West Midlands,B17 9NP,Tel: 0121 428 4835, - ,,,2 ratings Rate it yourself - /Services/opticians/LeaveReview/DefaultView.aspx?id=5M155__000001_B179NP,,,
Brittain Opticians Ltd,5MX080,OPT,,97 High Street,Harborne,Birmingham,,B17 9NR,Tel: 0121 427 1007, - ,,,No ratings yet Rate it yourself - /Services/opticians/LeaveReview/DefaultView.aspx?id=5MX080,0,0,
Peter Bainbridge Optometrists,OP_5M1_10531__000001_B179PP,OPT,93 High Street,Harborne,,Birmingham,West Midlands,B17 9NR,Tel: 0121 427 8201, - ,,,3 ratings Rate it yourself - /Services/opticians/LeaveReview/DefaultView.aspx?id=OP_5M1_10531__000001_B179PP,,,
Eye Sight Centre Opticians,5PG165,OPT,,385 Ladypool Road,Balsall Heath,Birmingham,,B12 8LA,Tel: 0121 449 4530, - ,,,No ratings yet Rate it yourself - /Services/opticians/LeaveReview/DefaultView.aspx?id=5PG165,0,0,
Myoptics Eye Clinic,I2T1M,OPT,,14 Curdale Road,Bartley Green,Birmingham,West Midlands,B32 4HB,Tel: 01214754920, - ,,,2 ratings Rate it yourself - /Services/opticians/LeaveReview/DefaultView.aspx?id=I2T1M,,,
RJ Eye Centre,5MX129,OPT,,204 Edward Road,Balsall Heath,Birmingham,,B12 9LY,Tel: 0121 448 0677, - ,,,No ratings yet Rate it yourself - /Services/opticians/LeaveReview/DefaultView.aspx?id=5MX129,0,0,
Mohammed Dilwar Khan,5MX65__000001_B128AR,OPT,,259 Stoney Lane,Balsall Heath,Birmingham,,B12 8AR,Tel: 0121 449 2111, - ,,,No ratings yet Rate it yourself - /Services/opticians/LeaveReview/DefaultView.aspx?id=5MX65__000001_B128AR,0,0,
Optical Clinic,B114DA_0001__000002_B114DA,OPT,837 Stratford Road,Sparkhill,Birmingham,West Midlands,,B11 4DA,Tel: 0121 777 2111, - ,,,No ratings yet Rate it yourself - /Services/opticians/LeaveReview/DefaultView.aspx?id=B114DA_0001__000002_B114DA,0,0,
Eyecon Opticians,TP830,OPT,,190b Stoney Lane,Ballsall Health,Birmingham,West Midlands,B12 8AN,Tel: 0121 449 2111, - ,,,No ratings yet Rate it yourself - /Services/opticians/LeaveReview/DefaultView.aspx?id=TP830,0,0,
Shifa Eye Clinic,5MX117,OPT,,512-514 Moseley Road,Balsall Heath,Birmingham,,B12 9AH,Tel: 0121 440 6065, - ,,,No ratings yet Rate it yourself - /Services/opticians/LeaveReview/DefaultView.aspx?id=5MX117,0,0,
Spex4U Limited,OL5PL01__000005_B459JA,OPT,174 New Road,Rubery,,Birmingham,Worcestershire,B45 9JA,Tel: 0121 453 7179, - ,,,1 rating Rate it yourself - /Services/opticians/LeaveReview/DefaultView.aspx?id=OL5PL01__000005_B459JA,,,
Maxton Saunders Ltd,5PG175,OPT,,842 Stratford Road,Sparkhill,Birmingham,,B11 4BS,Tel: 0121 777 4081, - ,,,1 rating Rate it yourself - /Services/opticians/LeaveReview/DefaultView.aspx?id=5PG175,,,
Williams Optometrists,OP_5MR_9056__000002_B459JW,OPT,161 New Road,Rubery,Birmingham,,,B45 9JW,Tel: 0121 453 2581, - ,,,No ratings yet Rate it yourself - /Services/opticians/LeaveReview/DefaultView.aspx?id=OP_5MR_9056__000002_B459JW,0,0,
J & D Mason Opticians ,OP_5PL_9067__000003_B487LA,OPT,23 The Square,"23 The Square,",Birmingham,Alvechurch,,B48 7LA,Tel: 0121 447 8682, - ,,,1 rating Rate it yourself - /Services/opticians/LeaveReview/DefaultView.aspx?id=OP_5PL_9067__000003_B487LA,,,
Midlands Community Eyecare Limited,TP9FV,OPT,Kings Court,17 School Road,,Birmingham,West Midlands,B28 8JG,Tel: 0121 517 0218, - ,,,3 ratings Rate it yourself - /Services/opticians/LeaveReview/DefaultView.aspx?id=TP9FV,,,
Eagle Eyes Opticians Ltd,SOUTH102__000003_B288AE,OPT,1132 Stratford Road,Hall Green,Birmingham,,,B28 8AE,Tel: 0121 777 8889, - ,,,No ratings yet Rate it yourself - /Services/opticians/LeaveReview/DefaultView.aspx?id=SOUTH102__000003_B288AE,0,0,
Troth Opticians,00000051__000003_B459JR,OPT,135 New Road,Rubery,Birmingham,,,B45 9JR,Tel: 0121 453 2146, - ,,,No ratings yet Rate it yourself - /Services/opticians/LeaveReview/DefaultView.aspx?id=00000051__000003_B459JR,0,0,
Optical Eye Lusions,5M1017,OPT,,1514 Stratford Road,Hall Green,Birmingham,,B28 9ET,Tel: 0121 744 2805, - ,,,1 rating Rate it yourself - /Services/opticians/LeaveReview/DefaultView.aspx?id=5M1017,,,
Barnt Green Opticians,OP_5MR_7851__000001_B458NF,OPT,12 Hewell Road,Barnt Green,,Birmingham,,B45 8NE,Tel: 0121 445 6015, - ,,,No ratings yet Rate it yourself - /Services/opticians/LeaveReview/DefaultView.aspx?id=OP_5MR_7851__000001_B458NF,0,0,
Opticare Ophthalmic Opticians,5MX70__000001_B128JS,OPT,150a Ladypool Road,Sparkbrook,Birmingham,,,B12 8JS,Tel: 0121 771 3222, - ,,,1 rating Rate it yourself - /Services/opticians/LeaveReview/DefaultView.aspx?id=5MX70__000001_B128JS,,,
A S Gill Optometrists,5MX59__000003_B114LP,OPT,537 Stratford Road,Sparkhill,Birmingham,Birmingham,,B11 4LP,Tel: 0121 766 5491, - ,,,No ratings yet Rate it yourself - /Services/opticians/LeaveReview/DefaultView.aspx?id=5MX59__000003_B114LP,0,0,
A S Gill Optometrists,5PG159,OPT,,537 Stratford Road,Sparkhill,Birmingham,,B11 4LP,Tel: 0121 766 5491, - ,,,No ratings yet Rate it yourself - /Services/opticians/LeaveReview/DefaultView.aspx?id=5PG159,0,0,
Low Vision Centre,5PG173,OPT,,62 Woodville Road,Harborne,Birmingham,,B17 9AT,Tel: 0121 478 5252, - ,,,No ratings yet Rate it yourself - /Services/opticians/LeaveReview/DefaultView.aspx?id=5PG173,0,0,
Dickens Eye Clinic,DICKENS__000001_B901UB,OPT,39 Main Street,Dickens Heath,Solihull,West Midlands,,B90 1UB,Tel: 0121 744 5544, - ,,,2 ratings Rate it yourself - /Services/opticians/LeaveReview/DefaultView.aspx?id=DICKENS__000001_B901UB,,,
Eye Sight Centre Opticians,5MX099,OPT,,485 Stratford Road,Sparkhill,Birmingham,,B11 4LE,Tel: 0121 771 1277, - ,,,No ratings yet Rate it yourself - /Services/opticians/LeaveReview/DefaultView.aspx?id=5MX099,0,0,
Banks Opticians,5PG162,OPT,,467 Stratford Road,Sparkhill,Birmingham,West Midlands,B11 4LD,Tel: 0121 773 2047, - ,,,No ratings yet Rate it yourself - /Services/opticians/LeaveReview/DefaultView.aspx?id=5PG162,0,0,
Asda Opticians,OPT_B90 3GG,OPT,,STRATFORD ROAD,PARKGATE,SHIRLEY,,B90 3GG,Tel: 0121 296 3736, - ,,,No ratings yet Rate it yourself - /Services/opticians/LeaveReview/DefaultView.aspx?id=OPT_B90 3GG,0,0,
Scrivens Opticians & Hearing Care,13022015_B90 3AU,OPT,,191 Stratford Road,,"Shirley, Solihull",,B90 3AU,, - ,,,No ratings yet Rate it yourself - /Services/opticians/LeaveReview/DefaultView.aspx?id=13022015_B90 3AU,0,0,
Boots-Birmingham- Shirley,OP_5D1_862__000001_B903AU,OPT,,199 Stratford Road,Shirley,Solihull,,B90 3AU,Tel: 0121 744 1207, - ,,,1 rating Rate it yourself - /Services/opticians/LeaveReview/DefaultView.aspx?id=OP_5D1_862__000001_B903AU,,,
Specsavers Opticians,TAM01__000004_B903AH,OPT,,207 Stratford Road,Shirley,Solihull,,B90 3AH,Tel: 0121 506 8650, - ,,,No ratings yet Rate it yourself - /Services/opticians/LeaveReview/DefaultView.aspx?id=TAM01__000004_B903AH,0,0,
Peter E Waite (Optometrist),5MX71__000003_B120YR,OPT,,8 Horton Square,Highgate,Birmingham,,B12 0YR,Tel: 0121 440 1636, - ,,,No ratings yet Rate it yourself - /Services/opticians/LeaveReview/DefaultView.aspx?id=5MX71__000003_B120YR,0,0,
Eye Centre (Birmingham) Ltd,5PG04__000004_B112NB,OPT,,202 Warwick Road,Greet,Birmingham,,B11 2NB,Tel: 0121 772 2505, - ,,,No ratings yet Rate it yourself - /Services/opticians/LeaveReview/DefaultView.aspx?id=5PG04__000004_B112NB,0,0,
Homespecs,5QW052,OPT,,383 Stratford Road,Shirley,Birmingham,,B90 3BW,Tel: 0121 733 1232, - ,,,No ratings yet Rate it yourself - /Services/opticians/LeaveReview/DefaultView.aspx?id=5QW052,0,0,
20-20 Vision,5PG131,OPT,,226 Warwick Road,Acocks Green,Birmingham,,B11 2ND,Tel: 0121 772 7709, - ,,,No ratings yet Rate it yourself - /Services/opticians/LeaveReview/DefaultView.aspx?id=5PG131,0,0,
Sims Opticians,OP_5D1_11728__000002_B903BT,OPT,,1 Union Road,Solihull,Solihull,,B90 3BT,Tel: 0121 744 6036, - ,,,No ratings yet Rate it yourself - /Services/opticians/LeaveReview/DefaultView.aspx?id=OP_5D1_11728__000002_B903BT,0,0,
Pike Opticians Ltd,OP_5D1_13856__000001_B903BB,OPT,,452 Stratford Road,Shirley,Solihull,,B90 4AQ,Tel: 0121 744 9093, - ,,,No ratings yet Rate it yourself - /Services/opticians/LeaveReview/DefaultView.aspx?id=OP_5D1_13856__000001_B903BB,0,0,
Boots-Birmingham - Hagley Rd,5M1099,OPT,,235-237 Hagley Road,Edgbaston,Birmingham,West Midlands,B16 9RR,Tel: 0121 454 3355, - ,,,2 ratings Rate it yourself - /Services/opticians/LeaveReview/DefaultView.aspx?id=5M1099,,,
Eye Opticians Ltd,5MX63__000004_B151LD,OPT,,44 Islington Row,Edgbaston,Birmingham,,B15 1LD,Tel: 0121 456 5676, - ,,,No ratings yet Rate it yourself - /Services/opticians/LeaveReview/DefaultView.aspx?id=5MX63__000004_B151LD,0,0,
The Eye Clinic,5MX124,OPT,Sparkbrook Community and Health Centre,34 Grantham Road,B11 1LU,Birmingham,,B11 1LU,Tel: 0121 464 9860, - ,,,1 rating Rate it yourself - /Services/opticians/LeaveReview/DefaultView.aspx?id=5MX124,,,
Peter Ian McLauchlan,5M151__000003_B169HN,OPT,17 Portland Road,Edgbaston,Birmingham,,,B16 9HN,Tel: 0121 454 6307, - ,,,No ratings yet Rate it yourself - /Services/opticians/LeaveReview/DefaultView.aspx?id=5M151__000003_B169HN,0,0,
Vision Call Midlands,01259__000003_B112JP,OPT,463-465 Warwick Road,Tylesley,Tylesley,,,B11 2JP,Tel: 0121 708 1349, - ,,,No ratings yet Rate it yourself - /Services/opticians/LeaveReview/DefaultView.aspx?id=01259__000003_B112JP,0,0,
Alan Tyler Opticians,5PG01__000003_B277PS,OPT,,291 Fox Hollies Road,,Birmingham,West Midlands,B27 7PS,Tel: 0121 706 3998, - ,,,2 ratings Rate it yourself - /Services/opticians/LeaveReview/DefaultView.aspx?id=5PG01__000003_B277PS,,,
Visioncraft (UK) Ltd,5PG194,OPT,,166 Streetsbrook Road,Shirley,Solihull,,B90 3PH,Tel: 0121 772 4424, - ,,,No ratings yet Rate it yourself - /Services/opticians/LeaveReview/DefaultView.aspx?id=5PG194,0,0,
Scrivens Ltd,OP_5MG_5453__000001_B680DJ,OPT,496 Hagley Road West,Quinton,Oldbury,Smethwick,West Midlands,B68 0DJ,Tel: 0121 422 3007, - ,,,No ratings yet Rate it yourself - /Services/opticians/LeaveReview/DefaultView.aspx?id=OP_5MG_5453__000001_B680DJ,0,0,
Ocean Optical,OP_5MG_10351__000001_B664BL,OPT,641 Bearwood Road,,Smethwick,BEARWOOD,,B66 4BL,Tel: 0121 429 3711, - ,,,1 rating Rate it yourself - /Services/opticians/LeaveReview/DefaultView.aspx?id=OP_5MG_10351__000001_B664BL,,,
Scrivens Ltd,OP_5MG_7977__000002_B664BH,OPT,Bearwood Shopping Centre,575 Bearwood Road,,Smethwick,West Midlands,B66 4BH,Tel: 0121 420 1089, - ,,,No ratings yet Rate it yourself - /Services/opticians/LeaveReview/DefaultView.aspx?id=OP_5MG_7977__000002_B664BH,0,0,
The Vision Centre,OP_5MG_6643__000001_B664BT,OPT,546 Bearwood Road,,Smethwick,,,B66 4BT,Tel: 0121 420 1705, - ,,,No ratings yet Rate it yourself - /Services/opticians/LeaveReview/DefaultView.aspx?id=OP_5MG_6643__000001_B664BT,0,0,
Eyecare Mobile Opticians Ltd,5MX066,OPT,,546 Bearwood Road,Smethwick,Birmingham,,B66 4BT,Tel: 0121 429 7752, - ,,,No ratings yet Rate it yourself - /Services/opticians/LeaveReview/DefaultView.aspx?id=5MX066,0,0,
Vision Express (UK) Ltd,5MX76__000001_B54BE,OPT,,SU522 Middle Mall,Bull Ring,Birmingham,,B5 4BE,Tel: 0121 643 3324, - ,,,1 rating Rate it yourself - /Services/opticians/LeaveReview/DefaultView.aspx?id=5MX76__000001_B54BE,,,
Bainbridge Optometrists,5MX049,OPT,,502 Bearwood Road,Smethwick,Birmingham,,B66 4BX,Tel: 0121 429 6006, - ,,,No ratings yet Rate it yourself - /Services/opticians/LeaveReview/DefaultView.aspx?id=5MX049,0,0,
Piccadilly Opticians,5MX084,OPT,,13 Piccadilly Arcade,,Birmingham,,B2 4HD,, - ,,,1 rating Rate it yourself - /Services/opticians/LeaveReview/DefaultView.aspx?id=5MX084,,,
The Contact Lens Practice Ltd,OP_5MX_10123__000001_B24JD,OPT,5 Lower Temple Street (First Floor),,Birmingham,West Midlands,,B2 4JD,Tel: 0121 643 3848, - ,,,No ratings yet Rate it yourself - /Services/opticians/LeaveReview/DefaultView.aspx?id=OP_5MX_10123__000001_B24JD,0,0,
Specsavers Opticians ,5MX75__000001_B24RQ,OPT,,14-15 New Street,,Birmingham,,B2 4RQ,Tel: 0121 616 2220, - ,,,No ratings yet Rate it yourself - /Services/opticians/LeaveReview/DefaultView.aspx?id=5MX75__000001_B24RQ,0,0,
Opticial Express,OP_12345_B4 7SL,OPT,41 High Street,,,Birmingham,West Midlands,B4 7SL,Tel: 0800 023 2020, - ,,,No ratings yet Rate it yourself - /Services/opticians/LeaveReview/DefaultView.aspx?id=OP_12345_B4 7SL,0,0,
Vision Care for Homeless People,5MX121,OPT,SIFA Fireside,48-52 Allcock Street,,Birmingham,,B9 4DY,Tel: 0121 766 1700, - ,,,No ratings yet Rate it yourself - /Services/opticians/LeaveReview/DefaultView.aspx?id=5MX121,0,0,
Portland Eye Care Services Ltd,5MX72__000001_B100SN,OPT,,345 Coventry Road,Small Heath,Birmingham,,B10 0SN,Tel: 0121 772 1442, - ,,,No ratings yet Rate it yourself - /Services/opticians/LeaveReview/DefaultView.aspx?id=5MX72__000001_B100SN,0,0,
Eyecare Opticians,B10 0LL_11111,OPT,,503a Coventry Road,Small Heath,Birmingham,West Midlands,B10 0LL,Tel: 0121 773 2129, - ,,,No ratings yet Rate it yourself - /Services/opticians/LeaveReview/DefaultView.aspx?id=B10 0LL_11111,0,0,
Boots-Acocks Green,OP_5MY_2664__000002_B276BH,OPT,1082 Warwick Road,Acocks Green,,Birmingham,,B27 6BH,Tel: 0121 706 1386, - ,,,1 rating Rate it yourself - /Services/opticians/LeaveReview/DefaultView.aspx?id=OP_5MY_2664__000002_B276BH,,,
Boots-Birmingham - High Street,OP_5MX_2107__000003_B47TA,OPT,,67 - 69 High Street,Birmingham High Street,Birmingham,West Midlands,B4 7TA,Tel: 0121 2366027, - ,,,4 ratings Rate it yourself - /Services/opticians/LeaveReview/DefaultView.aspx?id=OP_5MX_2107__000003_B47TA,,,
Eurospex Opticians Ltd,OP_5MX_10352__000002_B100UF,OPT,386 Coventry Road,Small Heath,Birmingham,,,B10 0UF,Tel: 0121 773 7327, - ,,,No ratings yet Rate it yourself - /Services/opticians/LeaveReview/DefaultView.aspx?id=OP_5MX_10352__000002_B100UF,0,0,
Banks Opticians,5PG02__000005_B276RA,OPT,,1115A Warwick Road,Acocks Green,Birmingham,West Midlands,B27 6RA,Tel: 0121 706 6604, - ,,,No ratings yet Rate it yourself - /Services/opticians/LeaveReview/DefaultView.aspx?id=5PG02__000005_B276RA,0,0,
Mahendra Mohanlal Davda,OP_5MX_8213__000001_B100UN,OPT,,554a Coventry Road,Small Heath,Birmingham,,B10 0UN,Tel: 0121 772 2902, - ,,,No ratings yet Rate it yourself - /Services/opticians/LeaveReview/DefaultView.aspx?id=OP_5MX_8213__000001_B100UN,0,0,
Eyespec,OPT_B100XE_1,OPT,,340 Coventry Road,Small Heath,Birmingham,,B10 0XE,Tel: 0121 772 1526, - ,,,1 rating Rate it yourself - /Services/opticians/LeaveReview/DefaultView.aspx?id=OPT_B100XE_1,,,
Supa Spex Opticians,5MX122,OPT,,14 Muntz Street,,Birmingham,,B10 9SN,Tel: 0121 448 7176, - ,,,No ratings yet Rate it yourself - /Services/opticians/LeaveReview/DefaultView.aspx?id=5MX122,0,0,
Scrivens Ltd,OP_5MX_7381__000001_B24UG,OPT,93 Corporation Street,,,Birmingham,West Midlands,B2 4UG,Tel: 0121 236 7583, - ,,,No ratings yet Rate it yourself - /Services/opticians/LeaveReview/DefaultView.aspx?id=OP_5MX_7381__000001_B24UG,0,0,
New Image Opticians,5PG152,OPT,,1120 Warwick Road,Acocks Green,Birmingham,,B27 6BL,Tel: 0121 707 9733, - ,,,1 rating Rate it yourself - /Services/opticians/LeaveReview/DefaultView.aspx?id=5PG152,,,