Organisation Name,NACS Code,Organisation Type,Address1,Address2,Address3,Address4,Address5,PostCode,Telephone Number,Opening time,Value  (Opening time),Banding Classification  (Opening time),NHS.UK users rating,Value  (NHS.UK users rating),Banding Classification  (NHS.UK users rating),Car parking (Is there car parking at this organisation?)
D Winslow Opticians,OP_5KJ_1337__000001_BD208TU,OPT,1 Holme Lane,Crosshills,Keighley,,,BD20 8TU,Tel: 01535 635085, - ,,,No ratings yet Rate it yourself - /Services/opticians/LeaveReview/DefaultView.aspx?id=OP_5KJ_1337__000001_BD208TU,0,0,
Silsden Optics Limited,OPT_BD209JS_1,OPT,,17 Briggate,,Silsden,,BD20 9JS,, - ,,,No ratings yet Rate it yourself - /Services/opticians/LeaveReview/DefaultView.aspx?id=OPT_BD209JS_1,0,0,
A&S Ghazi Opticians,,OPT,,9 Newmarket Street,,Skipton,,BD23 2HX,, - ,,,N/A - Data not available,,,
Clifford Benjamin Optometrists,OP_5KJ_13254__000002_BD232JE,OPT,23 Newmarket Street,Skipton,,,,BD23 2JE,Tel: 01756 792933, - ,,,No ratings yet Rate it yourself - /Services/opticians/LeaveReview/DefaultView.aspx?id=OP_5KJ_13254__000002_BD232JE,0,0,
J Exley & Co,OP_5KJ_4842__000001_BD231DY,OPT,7 Otley Street,,Skipton,,,BD23 1DY,Tel: 01756 792416, - ,,,No ratings yet Rate it yourself - /Services/opticians/LeaveReview/DefaultView.aspx?id=OP_5KJ_4842__000001_BD231DY,0,0,
Boots-Skipton - High St,OP_5KJ_12608__000001_BD231JP,OPT,52 High Street,,,Skipton,North Yorkshire,BD23 1JP,Tel: 01756 790988, - ,,,No ratings yet Rate it yourself - /Services/opticians/LeaveReview/DefaultView.aspx?id=OP_5KJ_12608__000001_BD231JP,0,0,
Eyecare Opticians,OP_5AW_14976__000001_BD212DF,OPT,24-26 Belgrave Road,,Keighley,bradford,,BD21 2DF,Tel: 01535 602200, - ,,,No ratings yet Rate it yourself - /Services/opticians/LeaveReview/DefaultView.aspx?id=OP_5AW_14976__000001_BD212DF,0,0,
Knowle Park Opticians,QDD00173__000001_BD211HD,OPT,,42 Devonshire Street ,Keighley,West Yorkshire,,BD21 2AU,Tel: 01535 681100, - ,,,No ratings yet Rate it yourself - /Services/opticians/LeaveReview/DefaultView.aspx?id=QDD00173__000001_BD211HD,0,0,
Michael J Leaver,OP_5AW_14055__000001_BD212AU,OPT,40 Devonshire Street,Keighley,West Yorkshire,,,BD21 2AU,Tel: 01535 602935, - ,,,No ratings yet Rate it yourself - /Services/opticians/LeaveReview/DefaultView.aspx?id=OP_5AW_14055__000001_BD212AU,0,0,
Airedale Eyecare Ltd,OP_5AW_14317__000001_BD213QE,OPT,50 Towngate,,Keighley,,,BD21 3QE,Tel: 01535 690077, - ,,,No ratings yet Rate it yourself - /Services/opticians/LeaveReview/DefaultView.aspx?id=OP_5AW_14317__000001_BD213QE,0,0,
Clarus Opticians,OPT_BD213RL_1,OPT,,46 Cavendish Street,,Keighley,,BD21 3RL,Tel: 01535 930116, - ,,,No ratings yet Rate it yourself - /Services/opticians/LeaveReview/DefaultView.aspx?id=OPT_BD213RL_1,0,0,
Vision Express (UK) Ltd,OP_5AW_580__000001_BD213NN,OPT,,25 College Walk,Airedale Centre,Keighley,West Yorkshire,BD21 3QA,Tel: 01535 603098, - ,,,No ratings yet Rate it yourself - /Services/opticians/LeaveReview/DefaultView.aspx?id=OP_5AW_580__000001_BD213NN,0,0,
Keighley Specsavers Ltd,OP_5AW_5725__000002_BD213PY,OPT,36 Queensway,Airedale Centre,Keighley,,,BD21 3PY,Tel: 01535 669997, - ,,,1 rating Rate it yourself - /Services/opticians/LeaveReview/DefaultView.aspx?id=OP_5AW_5725__000002_BD213PY,,,
Boots-Keighley - Bow St,OP_5AW_3281__000001_BD213QD,OPT,30 Bow Street,,,Keighley,West Yorkshire,BD21 3QD,Tel: 01535 610019, - ,,,No ratings yet Rate it yourself - /Services/opticians/LeaveReview/DefaultView.aspx?id=OP_5AW_3281__000001_BD213QD,0,0,
Crossroads Optical Centre,OP_5AW_2673__000001_BD229BA,OPT,Sunderland House,Halifax Road,Keighley,,,BD22 9BA,Tel: 01535 645863, - ,,,No ratings yet Rate it yourself - /Services/opticians/LeaveReview/DefaultView.aspx?id=OP_5AW_2673__000001_BD229BA,0,0,
Brosgill Opticians,OP_LS299NQ_46855,OPT,Brosgill Opticians,27 The Grove,,Ilkley,West Yorkshire,LS29 9NQ,Tel: 01943 816033, - ,,,No ratings yet Rate it yourself - /Services/opticians/LeaveReview/DefaultView.aspx?id=OP_LS299NQ_46855,0,0,
Paul Verity Opticians,OP_5AW_2354__000001_LS299EE,OPT,50 The Grove,,Ilkley,West Yorkshire,,LS29 9EE,Tel: 01943 608533, - ,,,No ratings yet Rate it yourself - /Services/opticians/LeaveReview/DefaultView.aspx?id=OP_5AW_2354__000001_LS299EE,0,0,
Optimeyes Opticians,OP_5KJ_12137__000001_BD231DG,OPT,15b The Moors Shopping Centre,South Hawksworth Street,Ilkley,West Yorkshire,,LS29 9LB,Tel: 01943 604600, - ,,,No ratings yet Rate it yourself - /Services/opticians/LeaveReview/DefaultView.aspx?id=OP_5KJ_12137__000001_BD231DG,0,0,
Specsavers Opticians,BRA165/5NY__000002_LS299LB,OPT,"5, 6 and 7 The Moors Shopping Centre",,Ilkley,West Yorkshire,,LS29 9LB,Tel: 01943 811330, - ,,,No ratings yet Rate it yourself - /Services/opticians/LeaveReview/DefaultView.aspx?id=BRA165/5NY__000002_LS299LB,0,0,
Boots Opticians,OPT_LS299LA_1,OPT,,"Unit 1, Dalesway House",South Hawksworth Street,Ilkley,West Yorkshire,LS29 9LA,Tel: 01943 605557 (ext. 1303), - ,,,No ratings yet Rate it yourself - /Services/opticians/LeaveReview/DefaultView.aspx?id=OPT_LS299LA_1,0,0,
Dr T J Buckingham,OP_5AW_7766__000001_LS299DR,OPT,5 Church Street,,Ilkley,,,LS29 9DR,Tel: 01943 608191, - ,,,2 ratings Rate it yourself - /Services/opticians/LeaveReview/DefaultView.aspx?id=OP_5AW_7766__000001_LS299DR,,,
Vision Express (UK) Ltd,OP_5AW_10959__000001_LS298DE,OPT,18 Brook Street,,,Ilkley,West Yorkshire,LS29 8DE,Tel: 01943 608551, - ,,,No ratings yet Rate it yourself - /Services/opticians/LeaveReview/DefaultView.aspx?id=OP_5AW_10959__000001_LS298DE,0,0,
David Howarth ,OP_5AW_8980__000001_BD162HR,OPT,158 Main Street,,Bingley,,,BD16 2HR,Tel: 01274 563048, - ,,,No ratings yet Rate it yourself - /Services/opticians/LeaveReview/DefaultView.aspx?id=OP_5AW_8980__000001_BD162HR,0,0,
David C Kenyon,OP_5AW_14052__000002_BD161AJ,OPT,139 Main Street,Bingley,Bradford,,,BD16 1AJ,Tel: 01274 568622, - ,,,No ratings yet Rate it yourself - /Services/opticians/LeaveReview/DefaultView.aspx?id=OP_5AW_14052__000002_BD161AJ,0,0,
Specsavers Opticians,D8V4P,OPT,,155 Main Street,,Bingley,West Yorkshire,BD16 1AJ,Tel: 01274 028001, - ,,,No ratings yet Rate it yourself - /Services/opticians/LeaveReview/DefaultView.aspx?id=D8V4P,0,0,
Sarah Farrar Opticians Ltd,OPT_BD150HX_1,OPT,,160 Main Street,,Wilsden,Yorkshire,BD15 0HX,Tel: 01535 274963, - ,,,2 ratings Rate it yourself - /Services/opticians/LeaveReview/DefaultView.aspx?id=OPT_BD150HX_1,,,no
Optical Outlook Ltd,OP_5CH_5076__000001_BD184SB,OPT,T/A Opula Vision Centre,71 Bingley Road,Saltaire,,,BD18 4SB,Tel: 01274 533898, - ,,,1 rating Rate it yourself - /Services/opticians/LeaveReview/DefaultView.aspx?id=OP_5CH_5076__000001_BD184SB,,,
Vision Express (UK) Ltd,OP_5CH_14053__000001_BD176JX,OPT,,14 Northgate,,Baildon,West Yorkshire,BD17 6JX,Tel: 01274 598787, - ,,,No ratings yet Rate it yourself - /Services/opticians/LeaveReview/DefaultView.aspx?id=OP_5CH_14053__000001_BD176JX,0,0,
The Oracle Opticians,OP_5CH_9795__000001_BD183QX,OPT,9 Westgate,9 Westgate,Shipley,Bradford,,BD18 3QX,Tel: 01274 581757, - ,,,No ratings yet Rate it yourself - /Services/opticians/LeaveReview/DefaultView.aspx?id=OP_5CH_9795__000001_BD183QX,0,0,
Shipley Eyewear ,OP_5CH_14054__000001_BD183QW,OPT,7 Kirkgate,7 Kirkgate,West Yorkshire,Shipley,,BD18 3QW,Tel: 01274 596234, - ,,,No ratings yet Rate it yourself - /Services/opticians/LeaveReview/DefaultView.aspx?id=OP_5CH_14054__000001_BD183QW,0,0,
Shipley Eyewear,OPT_BD183QW_1,OPT,,7 Kirkgate,,Shipley,,BD18 3QW,Tel: 01274 596234, - ,,,No ratings yet Rate it yourself - /Services/opticians/LeaveReview/DefaultView.aspx?id=OPT_BD183QW_1,0,0,
Asda Stores Ltd,OPT_BD18 3RY,OPT,,Manor Lane,,Shipley,,BD18 3RY,Tel: 01274 589399, - ,,,No ratings yet Rate it yourself - /Services/opticians/LeaveReview/DefaultView.aspx?id=OPT_BD18 3RY,0,0,
Specsavers Opticians,BD18 3QJ__000002_BD183QJ,OPT,29 Market Square,,Shipley,North Bradford,,BD18 3QJ,Tel: 01274 535390, - ,,,No ratings yet Rate it yourself - /Services/opticians/LeaveReview/DefaultView.aspx?id=BD18 3QJ__000002_BD183QJ,0,0,
N S Naru,OP_5CH_11186__000001_BD183TJ,OPT,153 Bradford Road,,Shipley,,,BD18 3TJ,Tel: 01274 530339, - ,,,No ratings yet Rate it yourself - /Services/opticians/LeaveReview/DefaultView.aspx?id=OP_5CH_11186__000001_BD183TJ,0,0,
Crossroads Optical Centre,OP_5CF_14050__000002_BD95HB,OPT,54 Duckworth Lane,Bradford,West Yorkshire,,,BD9 5HB,Tel: 01274 544520, - ,,,No ratings yet Rate it yourself - /Services/opticians/LeaveReview/DefaultView.aspx?id=OP_5CF_14050__000002_BD95HB,0,0,
Eyedeal Optical (Yorkshire) Ltd,OP_5CF_4568__000001_BD95ER,OPT,45-47 Duckworth Lane,45 Duckworth Lane,Bradford,Bradford,,BD9 5ET,Tel: 01274 488825, - ,,,No ratings yet Rate it yourself - /Services/opticians/LeaveReview/DefaultView.aspx?id=OP_5CF_4568__000001_BD95ER,0,0,
Spectacular Optics,BRA171__000001_BD94QX,OPT,Oaklane Opticians,68 Oak Lane,Bradford,West Yorkshire,,BD9 4QX,Tel: 01274 491130, - ,,,No ratings yet Rate it yourself - /Services/opticians/LeaveReview/DefaultView.aspx?id=BRA171__000001_BD94QX,0,0,yes
Specsavers Opticians,OP_5CF_14049__000002_BD89BN,OPT,"Unit 12, Victoria Shopping Centre",Thornton Road,Bradford,,,BD8 9BN,Tel: 01274 480030, - ,,,No ratings yet Rate it yourself - /Services/opticians/LeaveReview/DefaultView.aspx?id=OP_5CF_14049__000002_BD89BN,0,0,
Premier Vision,TP90X,OPT,Unit 4,Victoria Centre,Thornton Road,Bradford,West Yorkshire,BD8 9BN,Tel: 01274 499550, - ,,,No ratings yet Rate it yourself - /Services/opticians/LeaveReview/DefaultView.aspx?id=TP90X,0,0,
Eyecare Outlet,181120160853,OPT,Eyecare Outlet,19 Oak Lane,,Bradford,,BD9 4PU,Tel: 01274 921129, - ,,,1 rating Rate it yourself - /Services/opticians/LeaveReview/DefaultView.aspx?id=181120160853,,,
Victoria Gore Optometrist,OP_5CG_5030__000002_BD132PA,OPT,72 - 74 High Street,Queensbury,Bradford,,,BD13 2PA,Tel: 01274 815861, - ,,,No ratings yet Rate it yourself - /Services/opticians/LeaveReview/DefaultView.aspx?id=OP_5CG_5030__000002_BD132PA,0,0,
Specsavers,OP_5HM_14162__000001_LS208PS,OPT,Morrisons Supermarket,89a Otley Road,Guiseley,LEEDS,,LS20 8PS,Tel: 01943 879977, - ,,,No ratings yet Rate it yourself - /Services/opticians/LeaveReview/DefaultView.aspx?id=OP_5HM_14162__000001_LS208PS,0,0,
Optikal Eye Care Ltd,OP_5CH_14051__000001_BD108NN,OPT,54 High Street,Idle,Bradford,,,BD10 8NN,Tel: 01274 615030, - ,,,No ratings yet Rate it yourself - /Services/opticians/LeaveReview/DefaultView.aspx?id=OP_5CH_14051__000001_BD108NN,0,0,
Valli Opticians,QDT-00:133__000001_HX75LL,OPT,,1 Bridgegate,,Hebden Bridge,West Yorkshire,HX7 8EX,Tel: 01422 842084, - ,,,No ratings yet Rate it yourself - /Services/opticians/LeaveReview/DefaultView.aspx?id=QDT-00:133__000001_HX75LL,0,0,
Valli Opticians,OP_5J6_4094__000001_HX78AH,OPT,14 Albert Street,,Hebden Bridge,Hebden Bridge,,HX7 8AH,Tel: 01422 842084, - ,,,No ratings yet Rate it yourself - /Services/opticians/LeaveReview/DefaultView.aspx?id=OP_5J6_4094__000001_HX78AH,0,0,
Mark Hurst Opticians,HX7 8UQ__000001_HX78UQ,OPT,37 West End,Hebden Bridge,Halifax,West Yorkshire,,HX7 8UQ,Tel: 01422 843456, - ,,,1 rating Rate it yourself - /Services/opticians/LeaveReview/DefaultView.aspx?id=HX7 8UQ__000001_HX78UQ,,,
K S Opticians,OP_5CG_2359__000001_BD72JL,OPT,35 Beckside Road,Lidget Green,Bradford,,,BD7 2JL,Tel: 01274 522764, - ,,,1 rating Rate it yourself - /Services/opticians/LeaveReview/DefaultView.aspx?id=OP_5CG_2359__000001_BD72JL,,,
Specsavers,LS21 3HN__000002_LS213HN,OPT,7-9 Kirkgate,Otley,Leeds,West Yorkshire,,LS21 3HN,Tel: 01943 858440, - ,,,No ratings yet Rate it yourself - /Services/opticians/LeaveReview/DefaultView.aspx?id=LS21 3HN__000002_LS213HN,0,0,
Nicole Bowden Optics Ltd,OP_5HM_14026__000001_LS213AQ,OPT,26 Market Place,Otley,,Leeds,West Yorkshire,LS21 3AQ,Tel: 01943 462114, - ,,,No ratings yet Rate it yourself - /Services/opticians/LeaveReview/DefaultView.aspx?id=OP_5HM_14026__000001_LS213AQ,0,0,
Fink Eyewear ,D-8561,OPT,,8 Market Street,,Leeds,,LS21 3AF,, - ,,,No ratings yet Rate it yourself - /Services/opticians/LeaveReview/DefaultView.aspx?id=D-8561,0,0,
iVision Opticians,OP_5HM_418__000001_LS213AL,OPT,,2A Boroughgate,Otley,Leeds,,LS21 3AL,Tel: 01943 462423, - ,,,No ratings yet Rate it yourself - /Services/opticians/LeaveReview/DefaultView.aspx?id=OP_5HM_418__000001_LS213AL,0,0,
Specsavers Optical Superstore,OP_5CH_1691__000002_BD108EW,OPT,Enterprise 5,Five Lane Ends,Idle,,,BD10 8EW,Tel: 01274 618847, - ,,,No ratings yet Rate it yourself - /Services/opticians/LeaveReview/DefaultView.aspx?id=OP_5CH_1691__000002_BD108EW,0,0,
Truesmiths,R8Z3O,OPT,,MORRISONS ENTERPRISE 5,275 Bradford Road,BRADFORD,Yorkshire(West Riding),BD10 8EG,Tel: 01274 621992, - ,,,No ratings yet Rate it yourself - /Services/opticians/LeaveReview/DefaultView.aspx?id=R8Z3O,0,0,
University of Bradford,OP_5CF_1417__000001_BD71DP,OPT,Unit 36 - 38 Science Park,"Forster Building, Listerhills Science Park",Bradford,,,BD7 1HR,Tel: 01274 234649, - ,,,No ratings yet Rate it yourself - /Services/opticians/LeaveReview/DefaultView.aspx?id=OP_5CF_1417__000001_BD71DP,0,0,
Eye Clinic Opticians Ltd,OPT_BD74EE_1,OPT,,738 Great Horton Road,,Bradford,Yorkshire(West Riding),BD7 4EE,Tel: 01274 772787, - ,,,No ratings yet Rate it yourself - /Services/opticians/LeaveReview/DefaultView.aspx?id=OPT_BD74EE_1,0,0,
Optivu Eyecare Bradford,T8E3K,OPT,469 Great Horton Road,469 Great Horton Road,Bradford,Bradford,,BD7 3DL,Tel: 01274 574297, - ,,,No ratings yet Rate it yourself - /Services/opticians/LeaveReview/DefaultView.aspx?id=T8E3K,0,0,
Dental & Optical Services,OP_5CF_14041__000001_BD13SH,OPT,5 Rawson Road,Bradford,,West Yorkshire,,BD1 3SH,Tel: 01274 723311, - ,,,No ratings yet Rate it yourself - /Services/opticians/LeaveReview/DefaultView.aspx?id=OP_5CF_14041__000001_BD13SH,0,0,
Optivu Eyecare Bradford,W8P3B,OPT,,15 John Street,,Bradford,,BD1 3JS,Tel: 01274 727232, - ,,,No ratings yet Rate it yourself - /Services/opticians/LeaveReview/DefaultView.aspx?id=W8P3B,0,0,
Maxivision,OP_5CF_10291__000001_BD12QR,OPT,40 Westgate,,Bradford,,,BD1 2QR,Tel: 01274 742724, - ,,,No ratings yet Rate it yourself - /Services/opticians/LeaveReview/DefaultView.aspx?id=OP_5CF_10291__000001_BD12QR,0,0,
Lloyd & Robinson Opticians,OP_5CF_5101__000002_BD12QR,OPT,,64 Westgate,,Bradford,,BD1 2QR,Tel: 01274 720631, - ,,,1 rating Rate it yourself - /Services/opticians/LeaveReview/DefaultView.aspx?id=OP_5CF_5101__000002_BD12QR,,,
Mark Andrew Hurst,HX2 8AL__000003_HX28AL,OPT,52 Keighley Road,Ovenden,Halifax,,,HX2 8AL,Tel: 01422 367348, - ,,,No ratings yet Rate it yourself - /Services/opticians/LeaveReview/DefaultView.aspx?id=HX2 8AL__000003_HX28AL,0,0,
Dr Stewart Mitchell (Eyecare) LLP ,OP_5CF_14042__000001_BD12SH,OPT,Sidney Fraser,81 Godwin Street,West Yorkshire,Bradford,West Yorkshire,BD1 2SH,Tel: 01274 723362, - ,,,1 rating Rate it yourself - /Services/opticians/LeaveReview/DefaultView.aspx?id=OP_5CF_14042__000001_BD12SH,,,
Robertsons Opticians,OPT_BD30JF_1,OPT,,195-197 Otley Road,,Bradford,,BD3 0JF,Tel: 01274 639245, - ,,,No ratings yet Rate it yourself - /Services/opticians/LeaveReview/DefaultView.aspx?id=OPT_BD30JF_1,0,0,
City Eyewear,OP_5CF_14040__000001_BD11SW,OPT,24 Ivegate,Bradford,West Yorkshire,,,BD1 1SW,Tel: 01274 729393, - ,,,No ratings yet Rate it yourself - /Services/opticians/LeaveReview/DefaultView.aspx?id=OP_5CF_14040__000001_BD11SW,0,0,
I Wear Opticians (North) Ltd,BD1 1PP__000001_BD11PP,OPT,133 Godwin Street,,Bradford,West Yorkshire,,BD1 1PP,Tel: 01274 391203, - ,,,No ratings yet Rate it yourself - /Services/opticians/LeaveReview/DefaultView.aspx?id=BD1 1PP__000001_BD11PP,0,0,
Premier Vision,OPT_BD11RU_1,OPT,,25 - 27 Tyrrel Street,,Bradford,,BD1 1RU,Tel: 01274 731313, - ,,,No ratings yet Rate it yourself - /Services/opticians/LeaveReview/DefaultView.aspx?id=OPT_BD11RU_1,0,0,
Specsavers Optical Superstore,OP_5CF_2796__000001_BD13HA,OPT,20 Broadway,,Bradford,Bradford,,BD1 1EY,Tel: 01274 730052, - ,,,No ratings yet Rate it yourself - /Services/opticians/LeaveReview/DefaultView.aspx?id=OP_5CF_2796__000001_BD13HA,0,0,
Boots Opticians Broadway Centre,OP_5CF_2938__000001_BD13LE,OPT,Broadway Centre,25 Charles Street,,Bradford,West Yorkshire,BD1 1US,Tel: 01274 305876, - ,,,No ratings yet Rate it yourself - /Services/opticians/LeaveReview/DefaultView.aspx?id=OP_5CF_2938__000001_BD13LE,0,0,
Vision Express (UK) Ltd,BD11US2811,OPT,,43 Charles Street Mall,Broadway Centre,Bradford,West Yorkshire,BD1 1US,Tel: 01274 521299, - ,,,1 rating Rate it yourself - /Services/opticians/LeaveReview/DefaultView.aspx?id=BD11US2811,,,
Style and Vision Ltd,BRA174__000002_BD23DU,OPT,12 Harrogate Road,Undercliffe,Bradford,West Yorkshire,,BD2 3DU,, - ,,,No ratings yet Rate it yourself - /Services/opticians/LeaveReview/DefaultView.aspx?id=BRA174__000002_BD23DU,0,0,
Vision Express (UK) Ltd,OP_5HM_8909__000004_LS197SP,OPT,,63a High Street,,Yeadon,West Yorkshire,LS19 7SP,Tel: 0113 250 5547, - ,,,No ratings yet Rate it yourself - /Services/opticians/LeaveReview/DefaultView.aspx?id=OP_5HM_8909__000004_LS197SP,0,0,
Bayfields Opticians,OP_5HM_6998__000001_LS197TA,OPT,,93 High Street,Yeadon,Leeds,West Yorkshire,LS19 7TA,Tel: 0113 250 5894, - ,,,1 rating Rate it yourself - /Services/opticians/LeaveReview/DefaultView.aspx?id=OP_5HM_6998__000001_LS197TA,,,
Hirst Opticians,OP_5J6_10501__000001_HX26AL,OPT,52 Keighley Road,Ovenden,Halifax,,,HX2 6AL,Tel: 01422 367348, - ,,,No ratings yet Rate it yourself - /Services/opticians/LeaveReview/DefaultView.aspx?id=OP_5J6_10501__000001_HX26AL,0,0,
Optikal,OP_BD57QH_29545,OPT,,718 Manchester Road,,Bradford,West Yorkshire,BD5 7QH,Tel: 01274 615030, - ,,,No ratings yet Rate it yourself - /Services/opticians/LeaveReview/DefaultView.aspx?id=OP_BD57QH_29545,0,0,
Vision Centre (BFD) LTD,OPT_BD39ER_1,OPT,,1 Silkstone Road,,Bradford,,BD3 9ER,Tel: 01274 981917, - ,,,No ratings yet Rate it yourself - /Services/opticians/LeaveReview/DefaultView.aspx?id=OPT_BD39ER_1,0,0,
Michael R Foster,OP_5CG_14045__000001_BD61QN,OPT,22 Fair Road,Wibsey,Bradford,,,BD6 1QN,Tel: 01274 604639, - ,,,No ratings yet Rate it yourself - /Services/opticians/LeaveReview/DefaultView.aspx?id=OP_5CG_14045__000001_BD61QN,0,0,
Specsales Eyecare,OPT_BD58DJ_1,OPT,,846 Manchester Road,,Bradford,,BD5 8DJ,, - ,,,No ratings yet Rate it yourself - /Services/opticians/LeaveReview/DefaultView.aspx?id=OPT_BD58DJ_1,0,0,
Christopher R Limbert,OP_5CG_9133__000001_BD58AB,OPT,T/A J R Morton (Bradford Ltd),24-26 New Cross Street,Bradford,,,BD5 8AB,Tel: 01274 394497, - ,,,No ratings yet Rate it yourself - /Services/opticians/LeaveReview/DefaultView.aspx?id=OP_5CG_9133__000001_BD58AB,0,0,
Insight Optical,OP_5CF_9165__000002_BD38QJ,OPT,883 Barkerend Road,883 Barkerend Road,,Bradford,,BD3 8QJ,Tel: 01274 663218, - ,,,No ratings yet Rate it yourself - /Services/opticians/LeaveReview/DefaultView.aspx?id=OP_5CF_9165__000002_BD38QJ,0,0,
Mr K M Latif,OP_5CF_2423__000001_BD39TY,OPT,810 Leeds Road,,Bradford,,,BD3 9TY,Tel: 01274 664162, - ,,,No ratings yet Rate it yourself - /Services/opticians/LeaveReview/DefaultView.aspx?id=OP_5CF_2423__000001_BD39TY,0,0,
Premier Vision Opticians,BD5_8HP_29042019,OPT,Inside Morrisons Supermarket,110 Mayo Avenue,,Bradford,,BD5 8HP,Tel: 01274 733 232, - ,,,No ratings yet Rate it yourself - /Services/opticians/LeaveReview/DefaultView.aspx?id=BD5_8HP_29042019,0,0,
Premier Vision,OP_5CF_14940__000001_BD37HZ,OPT,Inside Morrisons Supermarket,Rushton Avenue,Thornbury,Bradford,West Yorkshire,BD3 7HZ,Tel: 01274 660099, - ,,,7 ratings Rate it yourself - /Services/opticians/LeaveReview/DefaultView.aspx?id=OP_5CF_14940__000001_BD37HZ,,,
opticare Eye Care Specialist Ltd,270516HX14NJ,OPT,,276 Queens Road,,Halifax,,HX1 4NJ,Tel: 01422 364453, - ,,,No ratings yet Rate it yourself - /Services/opticians/LeaveReview/DefaultView.aspx?id=270516HX14NJ,0,0,
Vision Express (UK) Ltd,OP_5J6_3092__000001_HX11RU,OPT,6 Woolshops,,Halifax,Halifax,,HX1 1RU,Tel: 01422 331018, - ,,,No ratings yet Rate it yourself - /Services/opticians/LeaveReview/DefaultView.aspx?id=OP_5J6_3092__000001_HX11RU,0,0,
I Care Opticians,OPT_HX11PB_1,OPT,i care opticians,36 Market Street,,Halifax,,HX1 1PB,Tel: 01422 385254, - ,,,No ratings yet Rate it yourself - /Services/opticians/LeaveReview/DefaultView.aspx?id=OPT_HX11PB_1,0,0,
Boots-Halifax - Market St,OP_5J6_1088__000002_HX11PB,OPT,7-11 Market Street,,,Halifax,West Yorkshire,HX1 1PB,Tel: 01422352009, - ,,,3 ratings Rate it yourself - /Services/opticians/LeaveReview/DefaultView.aspx?id=OP_5J6_1088__000002_HX11PB,,,
Specsavers Opticians,QDT00:280__000002_HX11TQ,OPT,3-5 The Square,Woolshops Shopping Centre,,Halifax,,HX1 1RJ,Tel: 01422 255055, - ,,,No ratings yet Rate it yourself - /Services/opticians/LeaveReview/DefaultView.aspx?id=QDT00:280__000002_HX11TQ,0,0,
Mackereth Opticians,OP_5J6_8393__000001_HX12SE,OPT,,6 Regent Street,,Halifax,West Yorkshire,HX1 2SE,Tel: 01422 352883, - ,,,No ratings yet Rate it yourself - /Services/opticians/LeaveReview/DefaultView.aspx?id=OP_5J6_8393__000001_HX12SE,0,0,no
HD Opticare,E9X0Z,OPT,,"Asda, Rooley Lane",,Bradford,,BD4 7SR,, - ,,,5 ratings Rate it yourself - /Services/opticians/LeaveReview/DefaultView.aspx?id=E9X0Z,,,
King Cross Opticians,OP_HX13JP_29903,OPT,,220 King Cross Road,,Halifax,West Yorkshire,HX1 3JP,Tel: 01422 353000, - ,,,No ratings yet Rate it yourself - /Services/opticians/LeaveReview/DefaultView.aspx?id=OP_HX13JP_29903,0,0,
Supervision Optics,270516HX13JP,OPT,,202 King Cross Road,,Halifax,West Yorkshire,HX1 3JP,Tel: 01422 323211, - ,,,1 rating Rate it yourself - /Services/opticians/LeaveReview/DefaultView.aspx?id=270516HX13JP,,,yes
Whitakers Opticians Ltd,OP_5J6_11442__000001_HX62AE,OPT,,34 - 36 Wharf Street,,Sowerby Bridge,West Yorkshire,HX6 2AE,Tel: 01422 831030, - ,,,No ratings yet Rate it yourself - /Services/opticians/LeaveReview/DefaultView.aspx?id=OP_5J6_11442__000001_HX62AE,0,0,yes
S W Allen Ltd,OP_5J6_6334__000001_OL145AB,OPT,19 Water Street,,Todmorden,,,OL14 5AB,Tel: 01706 815551, - ,,,No ratings yet Rate it yourself - /Services/opticians/LeaveReview/DefaultView.aspx?id=OP_5J6_6334__000001_OL145AB,0,0,
Tunnacliffe & Lambert Ltd,OP_5CG_12140__000001_BD46HD,OPT,100 Tong Street,,Bradford,,,BD4 6HD,Tel: 01274 682497, - ,,,No ratings yet Rate it yourself - /Services/opticians/LeaveReview/DefaultView.aspx?id=OP_5CG_12140__000001_BD46HD,0,0,
Tunnacliffe & Lambert,OP_5HH_11076__000001_LS285LF,OPT,64 Town Street,Farsley,Pudsey,,,LS28 5LF,Tel: 0113 257 7750, - ,,,No ratings yet Rate it yourself - /Services/opticians/LeaveReview/DefaultView.aspx?id=OP_5HH_11076__000001_LS285LF,0,0,
Optivu Eyecare Farsley,J3W6J,OPT,,64 Town Street,,Farsley,Yorkshire(West Riding),LS28 5LF,Tel: 0113 238 1161, - ,,,No ratings yet Rate it yourself - /Services/opticians/LeaveReview/DefaultView.aspx?id=J3W6J,0,0,
Thornton & Wright Opticians,OP_5J6_3319__000001_HX38LT,OPT,Co-Operative Shopping Parade,Denholme Gate Road - Hipperholme,,Halifax,,HX3 8LT,Tel: 01422 201519, - ,,,No ratings yet Rate it yourself - /Services/opticians/LeaveReview/DefaultView.aspx?id=OP_5J6_3319__000001_HX38LT,0,0,
Tong Optical Services,BD4 6LY__000001_BD46LY,OPT,TONG OPTICIANS,299 Tong Street,,Bradford,,BD4 9QS,Tel: 01274 687091, - ,,,No ratings yet Rate it yourself - /Services/opticians/LeaveReview/DefaultView.aspx?id=BD4 6LY__000001_BD46LY,0,0,
Wyke Opticians,OP_5CG_7482__000001_BD129JD,OPT,55 Towngate,Wyke,Bradford,Bradford ,,BD12 9JD,Tel: 01274 678701, - ,,,3 ratings Rate it yourself - /Services/opticians/LeaveReview/DefaultView.aspx?id=OP_5CG_7482__000001_BD129JD,,,
Asda Vision Centre,OP_5HH_14059__000002_LS286AR,OPT,Owlcotes Centre,Varley Street,,Stanningley,,LS28 6AR,Tel: 0113 2361222, - ,,,1 rating Rate it yourself - /Services/opticians/LeaveReview/DefaultView.aspx?id=OP_5HH_14059__000002_LS286AR,,,