Organisation Name,NACS Code,Organisation Type,Address1,Address2,Address3,Address4,Address5,PostCode,Telephone Number,Opening time,Value  (Opening time),Banding Classification  (Opening time),NHS.UK users rating,Value  (NHS.UK users rating),Banding Classification  (NHS.UK users rating),Car parking (Is there car parking at this organisation?)
Scotts Opticians,OP_5JW_8892__000001_CB88LX,OPT,1 High Street,,Newmarket,Suffolk,,CB8 8LX,Tel: 01638 662475, - ,,,No ratings yet Rate it yourself - /Services/opticians/LeaveReview/DefaultView.aspx?id=OP_5JW_8892__000001_CB88LX,0,0,
Scrivens Ltd,OP_5JW_13236__000002_IP287EF,OPT,25 Market Place,,,Mildenhall,Suffolk,IP28 7EF,Tel: 01638 716383, - ,,,No ratings yet Rate it yourself - /Services/opticians/LeaveReview/DefaultView.aspx?id=OP_5JW_13236__000002_IP287EF,0,0,
Boots-Mildenhall,OP_5JW_2465__000001_IP287LF,OPT,1 New Street,,,Mildenhall,Suffolk,IP28 7EN,Tel: 01638 713017, - ,,,No ratings yet Rate it yourself - /Services/opticians/LeaveReview/DefaultView.aspx?id=OP_5JW_2465__000001_IP287LF,0,0,
Boots Opticians (Newmarket),TP53M,OPT,,Unit 54 The Guinness Shopping Centre,,Suffolk,,CB8 8EQ,, - ,,,2 ratings Rate it yourself - /Services/opticians/LeaveReview/DefaultView.aspx?id=TP53M,,,
Specsavers,OP_5JW_14930__000003_CB88EQ,OPT,,1 The Guineas,,Newmarket,,CB8 8EQ,Tel: 01638 565270, - ,,,No ratings yet Rate it yourself - /Services/opticians/LeaveReview/DefaultView.aspx?id=OP_5JW_14930__000003_CB88EQ,0,0,
Peters Opticians,OP_5JW_3756__000002_CB88EQ,OPT,,14 The Rookery,,Newmarket,Suffolk,CB8 8EQ,Tel: 01638 660107, - ,,,1 rating Rate it yourself - /Services/opticians/LeaveReview/DefaultView.aspx?id=OP_5JW_3756__000002_CB88EQ,,,
Scrivens Ltd,OP_5JW_10132__000002_CB88HT,OPT,,78 High Street,,Newmarket,Suffolk,CB8 8JX,Tel: 01638 661620, - ,,,No ratings yet Rate it yourself - /Services/opticians/LeaveReview/DefaultView.aspx?id=OP_5JW_10132__000002_CB88HT,0,0,
Spectacular Opticians,OP_5JW_3419__000001_CB88JP,OPT,126 High Street,,Newmarket,Suffolk,,CB8 8JP,Tel: 01638 662774, - ,,,No ratings yet Rate it yourself - /Services/opticians/LeaveReview/DefaultView.aspx?id=OP_5JW_3419__000001_CB88JP,0,0,
Ryco Optics ,D13094,OPT,,"10a The Causeway, Burwell",,Cambridge,,CB25 0DU,, - ,,,No ratings yet Rate it yourself - /Services/opticians/LeaveReview/DefaultView.aspx?id=D13094,0,0,
Loach & Wade Opticians,OP_5JK_4424__000001_CB75DS,OPT,23a Churchgate Street Soham,,Ely,Cambridgeshire,,CB7 5DS,Tel: 01353 722667, - ,,,No ratings yet Rate it yourself - /Services/opticians/LeaveReview/DefaultView.aspx?id=OP_5JK_4424__000001_CB75DS,0,0,
Lakenheath Opticians,OP_5JW_3555__000001_IP279JS,OPT,36 High Street,Lakenheath,,Brandon,Suffolk,IP27 9JS,Tel: 01842 861999, - ,,,No ratings yet Rate it yourself - /Services/opticians/LeaveReview/DefaultView.aspx?id=OP_5JW_3555__000001_IP279JS,0,0,
Wigram and Ware (Bury) Ltd,OP_5JW_7581__000001_IP331BS,OPT,4 Central Walk,,Bury St. Edmunds,Suffolk,,IP33 1BS,Tel: 01284 753821, - ,,,No ratings yet Rate it yourself - /Services/opticians/LeaveReview/DefaultView.aspx?id=OP_5JW_7581__000001_IP331BS,0,0,
Boots-Bury St Edmunds - Cornhill,OP_5JW_1093__000002_IP331BT,OPT,11-13 Cornhill,,,Bury St Edmunds,Suffolk,IP33 1BX,Tel: 01284 703013, - ,,,1 rating Rate it yourself - /Services/opticians/LeaveReview/DefaultView.aspx?id=OP_5JW_1093__000002_IP331BT,,,
Specsavers Opticians,OP_5JW_11921__000002_IP331BE,OPT,,10 Buttermarket,Bury St. Edmunds,Suffolk,,IP33 1DB,Tel: 01284 702240, - ,,,No ratings yet Rate it yourself - /Services/opticians/LeaveReview/DefaultView.aspx?id=OP_5JW_11921__000002_IP331BE,0,0,
Vision Express,OP_5JW_14192__000001_IP331DD,OPT,12-13 Buttermarket,,Bury St Edmunds,Suffolk,,IP33 1DP,Tel: 01284 750776, - ,,,No ratings yet Rate it yourself - /Services/opticians/LeaveReview/DefaultView.aspx?id=OP_5JW_14192__000001_IP331DD,0,0,
Boots-Bury St Edmunds - Brentgovel St,OP_5JW_4595__000001_IP331EB,OPT,5 Brentgovel Street,,Bury St. Edmunds,Suffolk,,IP33 1EB,Tel: 01284 768328, - ,,,No ratings yet Rate it yourself - /Services/opticians/LeaveReview/DefaultView.aspx?id=OP_5JW_4595__000001_IP331EB,0,0,
Scotts Opticians,OP_5JW_1353__000001_IP331BJ,OPT,,58 Abbeygate Street,,Bury St. Edmunds,Suffolk,IP33 1LB,Tel: 01284 754616, - ,,,No ratings yet Rate it yourself - /Services/opticians/LeaveReview/DefaultView.aspx?id=OP_5JW_1353__000001_IP331BJ,0,0,
Scrivens Ltd,OP_5JW_13102__000001_IP331LW,OPT,43 Abbeygate Street,,,Bury St Edmunds,Suffolk,IP33 1LW,Tel: 01284 702061, - ,,,No ratings yet Rate it yourself - /Services/opticians/LeaveReview/DefaultView.aspx?id=OP_5JW_13102__000001_IP331LW,0,0,
Peel & Gudgin Opticians,OP_5JW_11956__000001_IP331LS,OPT,Abbey House,30 Angel Hill,Bury St. Edmunds,,,IP33 1LS,Tel: 01284 754541, - ,,,No ratings yet Rate it yourself - /Services/opticians/LeaveReview/DefaultView.aspx?id=OP_5JW_11956__000001_IP331LS,0,0,
Tesco Opticians Ely,CB7 4DJ,OPT,,Angel Drove,,Ely,,CB7 4DJ,, - ,,,No ratings yet Rate it yourself - /Services/opticians/LeaveReview/DefaultView.aspx?id=CB7 4DJ,0,0,
Specsavers Optical Group Ltd,5PP2000,OPT,,Ely Lisle Lane Sainsbury's,,Ely,,CB7 4AS,, - ,,,No ratings yet Rate it yourself - /Services/opticians/LeaveReview/DefaultView.aspx?id=5PP2000,0,0,
Scrivens Opticians,OP_5JK_12276__000002_CB74AF,OPT,6 Buttermarket,,,Ely,Cambridgeshire,CB7 4AF,Tel: 01353 665282, - ,,,No ratings yet Rate it yourself - /Services/opticians/LeaveReview/DefaultView.aspx?id=OP_5JK_12276__000002_CB74AF,0,0,
Specsavers Opticians,OP_5JK_12281__000002_CB74LF,OPT,45 High Street,,Ely,Cambridgeshire,,CB7 4LF,Tel: 01353 653120, - ,,,No ratings yet Rate it yourself - /Services/opticians/LeaveReview/DefaultView.aspx?id=OP_5JK_12281__000002_CB74LF,0,0,
Wades of Ely Ltd ,OP_5JK_2958__000001_CB74JU,OPT,2 High Street,,,Ely,Cambridgeshire,CB7 4JU,Tel: 01353 662674, - ,,,No ratings yet Rate it yourself - /Services/opticians/LeaveReview/DefaultView.aspx?id=OP_5JK_2958__000001_CB74JU,0,0,
Spectacular Opthalmic Opticians,OP_5JK_12277__000001_CB74LJ,OPT,7a High Street,,Ely,Cambridgeshire,,CB7 4LJ,Tel: 01353 659333, - ,,,No ratings yet Rate it yourself - /Services/opticians/LeaveReview/DefaultView.aspx?id=OP_5JK_12277__000001_CB74LJ,0,0,
Spectacular Opticians,TP98A,OPT,,13 High Street,,Waterbeach,,CB25 9JU,Tel: 01223 967479, - ,,,No ratings yet Rate it yourself - /Services/opticians/LeaveReview/DefaultView.aspx?id=TP98A,0,0,
Helen Ashby Opticians,OP_5JW_886__000001_IP270AA,OPT,9 Market Hill,,Brandon,Suffolk,,IP27 0AA,Tel: 01842 815055, - ,,,No ratings yet Rate it yourself - /Services/opticians/LeaveReview/DefaultView.aspx?id=OP_5JW_886__000001_IP270AA,0,0,
Billson Opticians,OP_5JW_13692__000001_CB99EG,OPT,10 Queens Square,,Haverhill,Suffolk,,CB9 9EG,Tel: 01440 714441, - ,,,No ratings yet Rate it yourself - /Services/opticians/LeaveReview/DefaultView.aspx?id=OP_5JW_13692__000001_CB99EG,0,0,
Observatory Opticians,OP_5JW_4154__000001_CB98HB,OPT,Observatory the Opticians,1 Camps Road,,Haverhill,Suffolk,CB9 8HB,Tel: 01440 761922, - ,,,No ratings yet Rate it yourself - /Services/opticians/LeaveReview/DefaultView.aspx?id=OP_5JW_4154__000001_CB98HB,0,0,
Loach & Wade,8 5PP__000002_CB61NE,OPT,7 Granby Street Littleport,,Ely,Cambridgeshire,,CB6 1NE,Tel: 01353 862333, - ,,,No ratings yet Rate it yourself - /Services/opticians/LeaveReview/DefaultView.aspx?id=8 5PP__000002_CB61NE,0,0,
Boots-Haverhill,OP_5JW_7789__000001_CB98AH,OPT,41 High Street,,Haverhill,Suffolk,,CB9 8AH,Tel: 01440 702789, - ,,,No ratings yet Rate it yourself - /Services/opticians/LeaveReview/DefaultView.aspx?id=OP_5JW_7789__000001_CB98AH,0,0,
Specsavers Opticians,OP_5JW_765060__000001_CB98AR,OPT,8 The Chauntry,High Street,Haverhill,Suffolk,,CB9 8AR,Tel: 01440 765060, - ,,,No ratings yet Rate it yourself - /Services/opticians/LeaveReview/DefaultView.aspx?id=OP_5JW_765060__000001_CB98AR,0,0,
Specsavers Opticians,PREMISES_IP242BG__000001_IP242BG,OPT,20 Riverside Walk,,Thetford,Norfolk,,IP24 2BG,Tel: 01842 826565, - ,,,No ratings yet Rate it yourself - /Services/opticians/LeaveReview/DefaultView.aspx?id=PREMISES_IP242BG__000001_IP242BG,0,0,
Boots-Thetford,OP_5G1_11564__000003_IP242AP,OPT,26-28 King Street,,,Thetford,Norfolk,IP24 2AP,Tel: 01842 753356, - ,,,No ratings yet Rate it yourself - /Services/opticians/LeaveReview/DefaultView.aspx?id=OP_5G1_11564__000003_IP242AP,0,0,
Scotts Opticians,OP_5G1_3800__000001_IP242DT,OPT,Red Cross Building,Guildhall Street,Thetford,Norfolk,,IP24 2DT,Tel: 01842 764831, - ,,,No ratings yet Rate it yourself - /Services/opticians/LeaveReview/DefaultView.aspx?id=OP_5G1_3800__000001_IP242DT,0,0,
Billson Opticians,515PP__000001_CB214HS,OPT,55 High Street Linton,,Cambridge,Cambridgeshire,,CB21 4HS,Tel: 01223 891333, - ,,,No ratings yet Rate it yourself - /Services/opticians/LeaveReview/DefaultView.aspx?id=515PP__000001_CB214HS,0,0,
D W Murphy Optician,OP_5JH_12818__000001_CB58DT,OPT,34 Newmarket Road,,Cambridge,Cambridgeshire,,CB5 8DT,Tel: 01223 351819, - ,,,11 ratings Rate it yourself - /Services/opticians/LeaveReview/DefaultView.aspx?id=OP_5JH_12818__000001_CB58DT,,,
Taank Optometrists,OP_5JH_12815__000001_CB12BD,OPT,92a Mill Road,,Cambridge,Cambridgeshire,,CB1 2BD,Tel: 01223 350071, - ,,,No ratings yet Rate it yourself - /Services/opticians/LeaveReview/DefaultView.aspx?id=OP_5JH_12815__000001_CB12BD,0,0,
Anglia Ruskin University,OP_5JH_12610__000001_CB11PT,OPT,University Eye Clinic,East Road,Cambridge,Cambridgeshire,,CB1 1PT,Tel: 01223 698070, - ,,,2 ratings Rate it yourself - /Services/opticians/LeaveReview/DefaultView.aspx?id=OP_5JH_12610__000001_CB11PT,,,Data not available
Specsavers Opticians,OP_5JH_2545__000002_CB11ER,OPT,13 Fitzroy Street,,Cambridge,Cambridgeshire,,CB1 1ER,Tel: 01223 305241, - ,,,No ratings yet Rate it yourself - /Services/opticians/LeaveReview/DefaultView.aspx?id=OP_5JH_2545__000002_CB11ER,0,0,
D H Thomas & Associates,OP_5JH_1242__000002_CB23JU,OPT,162 Hills Road,,Cambridge,Cambridgeshire,,CB2 8PB,Tel: 01223 245222, - ,,,No ratings yet Rate it yourself - /Services/opticians/LeaveReview/DefaultView.aspx?id=OP_5JH_1242__000002_CB23JU,0,0,
Eyelink,OP_5JH_7053__000001_CB21NW,OPT,23 Hills Road,,Cambridge,Cambridgeshire,,CB2 1NW,Tel: 01223 315226, - ,,,No ratings yet Rate it yourself - /Services/opticians/LeaveReview/DefaultView.aspx?id=OP_5JH_7053__000001_CB21NW,0,0,
Histon Opthalmic Opticians,OP_5JJ_9517__000001_CB44JD,OPT,Histon Opticians,8 School Hill,Histon,Cambridge,Cambridgeshire,CB24 9JE,Tel: 01223 237438, - ,,,No ratings yet Rate it yourself - /Services/opticians/LeaveReview/DefaultView.aspx?id=OP_5JJ_9517__000001_CB44JD,0,0,
Specsavers Opticians,OP_5JH_4951__000001_CB11NH,OPT,30 Lion Yard,,Cambridge,Cambridgeshire,,CB1 1NH,Tel: 01223 366805, - ,,,1 rating Rate it yourself - /Services/opticians/LeaveReview/DefaultView.aspx?id=OP_5JH_4951__000001_CB11NH,,,
Clamp Optometrists,OP_5JH_9838__000001_CB23AX,OPT,7 St Andrews Street,,,Cambridge,Cambridgeshire,CB2 3AX,Tel: 01223 350043, - ,,,5 ratings Rate it yourself - /Services/opticians/LeaveReview/DefaultView.aspx?id=OP_5JH_9838__000001_CB23AX,,,
Vision Express (UK) Ltd,OP_5JH_6475__000002_CB11PS,OPT,Lion Yard Shopping Centre,St Tibbs Row,,Cambridge,Cambridgeshire,CB2 3ET,Tel: 01223 300555, - ,,,No ratings yet Rate it yourself - /Services/opticians/LeaveReview/DefaultView.aspx?id=OP_5JH_6475__000002_CB11PS,0,0,
David Clulow Opticians,OP_5JH_6632__000002_CB23HX,OPT,59 Sidney Street,,Cambridge,Cambridgeshire,,CB2 3HX,Tel: 01223 362267, - ,,,No ratings yet Rate it yourself - /Services/opticians/LeaveReview/DefaultView.aspx?id=OP_5JH_6632__000002_CB23HX,0,0,
Boots-Cambridge - Petty Cury,OP_5JH_288__000002_CB23ND,OPT,28 Petty Cury,,Cambridge,Cambridgeshire,,CB2 3ND,Tel: 01223 366104, - ,,,3 ratings Rate it yourself - /Services/opticians/LeaveReview/DefaultView.aspx?id=OP_5JH_288__000002_CB23ND,,,
Vision Express,CO-1881__000001_CB23BZ,OPT,,Unit Su20 Grand Arcade,,Cambridge,Cambridgeshire,CB2 3BJ,Tel: 01223 304826, - ,,,No ratings yet Rate it yourself - /Services/opticians/LeaveReview/DefaultView.aspx?id=CO-1881__000001_CB23BZ,0,0,
Boots-Cambridge - Lion Yard,OP_5JH_12355__000001_CB23NA,OPT,20/21 Lion Yard,,Cambridge,Cambridgeshire,,CB2 3NA,Tel: 01223 324120, - ,,,1 rating Rate it yourself - /Services/opticians/LeaveReview/DefaultView.aspx?id=OP_5JH_12355__000001_CB23NA,,,
Optical Express,145PP__000001_CB23NB,OPT,39-41 Petty Cury,,,Cambridge,Cambridgeshire,CB2 3NB,Tel: 0800 023 2020, - ,,,No ratings yet Rate it yourself - /Services/opticians/LeaveReview/DefaultView.aspx?id=145PP__000001_CB23NB,0,0,
Medical Eye Centre,OP_5JW_2729__000001_CO109HZ,OPT,"Lotus Cottage, Hall Street",Long Melford,Sudbury,,,CO10 9HZ,Tel: 01787 377741, - ,,,No ratings yet Rate it yourself - /Services/opticians/LeaveReview/DefaultView.aspx?id=OP_5JW_2729__000001_CO109HZ,0,0,
Billson Opticians,5PP CB22 3BG,OPT,,66 High Street Sawston,,Cambridge,Cambridgeshire,CB22 3BG,Tel: 01223 836656, - ,,,No ratings yet Rate it yourself - /Services/opticians/LeaveReview/DefaultView.aspx?id=5PP CB22 3BG,0,0,
Boots-Sudbury - North St,OP_5JW_863__000002_CO106RB,OPT,9 North Street,,,Sudbury,Suffolk,CO10 1RB,Tel: 01787 372590, - ,,,No ratings yet Rate it yourself - /Services/opticians/LeaveReview/DefaultView.aspx?id=OP_5JW_863__000002_CO106RB,0,0,
Specsavers Opticians,OP_5JW_468730__000002_CO102EA,OPT,6a Market Hill,,Sudbury,Suffolk,,CO10 2EA,Tel: 01787 468730, - ,,,No ratings yet Rate it yourself - /Services/opticians/LeaveReview/DefaultView.aspx?id=OP_5JW_468730__000002_CO102EA,0,0,
Sage Opticians,A8L6S,OPT,,20 Market Hill,,"Sudbury, Suffolk",,CO10 2EA,Tel: 01787 323775, - ,,,No ratings yet Rate it yourself - /Services/opticians/LeaveReview/DefaultView.aspx?id=A8L6S,0,0,
"Wardale, Williams Opticians",OP_5JW_4463__000001_CO106ET,OPT,Wardale Williams,50 Gainsborough Street,,Sudbury,Suffolk,CO10 2ET,Tel: 01787 372492, - ,,,No ratings yet Rate it yourself - /Services/opticians/LeaveReview/DefaultView.aspx?id=OP_5JW_4463__000001_CO106ET,0,0,yes
Tesco Opticians,OP_5JJ_727__000002_CB38EL,OPT,15-18 Viking Way Bar Hill,,,Cambridge,Cambridgeshire,CB3 8EL,Tel: 01954 240138, - ,,,1 rating Rate it yourself - /Services/opticians/LeaveReview/DefaultView.aspx?id=OP_5JJ_727__000002_CB38EL,,,
Eyes of Swavesey,OP_5JJ_7821__000001_CB45QJ,OPT,,2 Station Road,Swavesey,Cambridge,Cambridgeshire,CB24 4QJ,Tel: 01954 231158, - ,,,3 ratings Rate it yourself - /Services/opticians/LeaveReview/DefaultView.aspx?id=OP_5JJ_7821__000001_CB45QJ,,,
S J Williams,OP_5GN_13383__000001_CB101EU,OPT,21 King Street,,Saffron Walden,Essex,,CB10 1EU,Tel: 01799 523302, - ,,,1 rating Rate it yourself - /Services/opticians/LeaveReview/DefaultView.aspx?id=OP_5GN_13383__000001_CB101EU,,,
D H Thomas,OP_5GN_10846__000001_CB101EJ,OPT,"Suite 2, Goldhill House",Gold Street,Saffron Walden,Essex,,CB10 1EJ,Tel: 01799 525957, - ,,,No ratings yet Rate it yourself - /Services/opticians/LeaveReview/DefaultView.aspx?id=OP_5GN_10846__000001_CB101EJ,0,0,
Boots-Saffron Walden,OP_5GN_10289__000001_CB101EE,OPT,44 High Street,,,Saffron Walden,Essex,CB10 1EE,Tel: 01799 522 175, - ,,,1 rating Rate it yourself - /Services/opticians/LeaveReview/DefaultView.aspx?id=OP_5GN_10289__000001_CB101EE,,,
Spectacular Opticians,OP_5JK_1682__000002_PE166EX,OPT,Spectacular Ophthalmic Opticians Contact Lens Practitioners,16 High Street,Chatteris,Cambridgeshire,,PE16 6BG,Tel: 01354 694666, - ,,,No ratings yet Rate it yourself - /Services/opticians/LeaveReview/DefaultView.aspx?id=OP_5JK_1682__000002_PE166EX,0,0,
Selby and Taylor Opticians,OPT_PE166BH_1,OPT,,42 High Street,,Chatteris,,PE16 6BH,, - ,,,1 rating Rate it yourself - /Services/opticians/LeaveReview/DefaultView.aspx?id=OPT_PE166BH_1,,,
Parker Optometrists,OP_5CY_3006__000003_PE389JZ,OPT,5 Wales Court,,Downham Market,,,PE38 9JZ,Tel: 01366 382118, - ,,,1 rating Rate it yourself - /Services/opticians/LeaveReview/DefaultView.aspx?id=OP_5CY_3006__000003_PE389JZ,,,
Spectacular Opticians,OP_5CY_8392__000001_PE389DH,OPT,2 Maltings Mall,Bridge Street,Downham Market,,,PE38 9DH,Tel: 01366 385241, - ,,,No ratings yet Rate it yourself - /Services/opticians/LeaveReview/DefaultView.aspx?id=OP_5CY_8392__000001_PE389DH,0,0,
Vision Call (DOM),-559 5LC__000006_CB114LB,OPT,Suite 1 Neville House,Wendens Ambo Saffron Walden,Essex,London,,CB11 4LB,Tel: 01799 543 561, - ,,,No ratings yet Rate it yourself - /Services/opticians/LeaveReview/DefaultView.aspx?id=-559 5LC__000006_CB114LB,0,0,
Asda Opticians,OPT_IP14 1DE,OPT,,MEADOW CENTRE,WILKS WAY,STOWMARKET,,IP14 1DE,Tel: 01449 763083, - ,,,2 ratings Rate it yourself - /Services/opticians/LeaveReview/DefaultView.aspx?id=OPT_IP14 1DE,,,
F G Brown & Associates Ltd,OP_5JT_9924__000001_IP141BB,OPT,Denmark House,41 Bury Street,,Stowmarket,Suffolk,IP14 1HA,Tel: 01449 612812, - ,,,No ratings yet Rate it yourself - /Services/opticians/LeaveReview/DefaultView.aspx?id=OP_5JT_9924__000001_IP141BB,0,0,yes
Peel & Gudgin Opticians,OP_5JT_7588__000001_IP141EF,OPT,11 Station Road West,,Stowmarket,Suffolk,,IP14 1EF,Tel: 01449 612984, - ,,,No ratings yet Rate it yourself - /Services/opticians/LeaveReview/DefaultView.aspx?id=OP_5JT_7588__000001_IP141EF,0,0,
Specsavers,OP_5JT_14932__000002_IP141AH,OPT,11 Ipswich Street,,Stowmarket,Suffolk,,IP14 1AH,Tel: 01449 618280, - ,,,No ratings yet Rate it yourself - /Services/opticians/LeaveReview/DefaultView.aspx?id=OP_5JT_14932__000002_IP141AH,0,0,
Specsavers St Ives,,OPT,,23 Crown Way,,St Ives,Cambridgeshire,PE27 5AB,Tel: 01480409800, - ,,,N/A - Data not available,,,
Scrivens Ltd,OP_5GF_10150__000001_PE275PA,OPT,1 Crown Place,,St. Ives,St Ives,Cambridgeshire,PE27 5PA,Tel: 01480 301337, - ,,,No ratings yet Rate it yourself - /Services/opticians/LeaveReview/DefaultView.aspx?id=OP_5GF_10150__000001_PE275PA,0,0,
S H Harrold (1937) Ltd,OP_5GF_3899__000001_PE275EG,OPT,8 Bridge Street,,,St. Ives,Cambridgeshire,PE27 5EG,Tel: 01480 463655, - ,,,No ratings yet Rate it yourself - /Services/opticians/LeaveReview/DefaultView.aspx?id=OP_5GF_3899__000001_PE275EG,0,0,
Umesh Solanki Optometrist,OP_5GF_12759__000001_PE275PD,OPT,,Umesh K. Solanki Optometrist,Currently trading from Huntingdon branch,St Ives,Cambridgeshire,PE27 5EG,Tel: 01480412746, - ,,,No ratings yet Rate it yourself - /Services/opticians/LeaveReview/DefaultView.aspx?id=OP_5GF_12759__000001_PE275PD,0,0,
Gathercole & Ward,OP_5GF_9508__000001_PE174BX,OPT,13 The Broadway,,St Ives,Cambridgeshire,,PE27 5BX,Tel: 01480 462433, - ,,,No ratings yet Rate it yourself - /Services/opticians/LeaveReview/DefaultView.aspx?id=OP_5GF_9508__000001_PE174BX,0,0,
Community Primary Opth Clinic,OP_TAG_U/K__000001_CO92DL,OPT,78 Hedingham Road,,Halstead,Essex,,CO9 2DL,Tel: 01787 291010, - ,,,No ratings yet Rate it yourself - /Services/opticians/LeaveReview/DefaultView.aspx?id=OP_TAG_U/K__000001_CO92DL,0,0,
Wardale Williams Opticians,OP_TAG_9147__000001_CO92AP,OPT,Wardale Williams,28 High Street,,Halstead,Essex,CO9 2AP,Tel: 01787 472209, - ,,,2 ratings Rate it yourself - /Services/opticians/LeaveReview/DefaultView.aspx?id=OP_TAG_9147__000001_CO92AP,,,
Billson Opticians,OP_TAG_10093__000001_CO92JG,OPT,82 High Street,,Halstead,Essex,,CO9 2JG,Tel: 01787 472847, - ,,,No ratings yet Rate it yourself - /Services/opticians/LeaveReview/DefaultView.aspx?id=OP_TAG_10093__000001_CO92JG,0,0,
Cecil C Amey Ltd,OP_5G1_10131__000001_IP256AB,OPT,,13 High Street,,Watton,Norfolk,IP25 6AB,Tel: 01953 881535, - ,,,No ratings yet Rate it yourself - /Services/opticians/LeaveReview/DefaultView.aspx?id=OP_5G1_10131__000001_IP256AB,0,0,
Harrison Eyeclinic,OP_5JK_12283__000001_PE159BS,OPT,10a Elwyn Road,,,March,Cambridgeshire,PE15 9BS,Tel: 01354 652418, - ,,,No ratings yet Rate it yourself - /Services/opticians/LeaveReview/DefaultView.aspx?id=OP_5JK_12283__000001_PE159BS,0,0,
Spectacular Opticians,OP_5JK_10815__000001_PE158LB,OPT,10 Broad Street,,,March,Cambridgeshire,PE15 8TG,Tel: 01354 650115, - ,,,No ratings yet Rate it yourself - /Services/opticians/LeaveReview/DefaultView.aspx?id=OP_5JK_10815__000001_PE158LB,0,0,
N P Coley,OP_5JK_7814__000001_PE158TG,OPT,30 Broad Street,,March,Cambridgeshire,,PE15 8TG,Tel: 01354 653393, - ,,,No ratings yet Rate it yourself - /Services/opticians/LeaveReview/DefaultView.aspx?id=OP_5JK_7814__000001_PE158TG,0,0,
Driver Opticians,3014/5PP__000001_PE158TX,OPT,The Wheel Centre,March,March,Cambridgeshire,,PE15 8TX,Tel: 01354 658833, - ,,,No ratings yet Rate it yourself - /Services/opticians/LeaveReview/DefaultView.aspx?id=3014/5PP__000001_PE158TX,0,0,
ZMP; Lee Walker (Domiciliary),5PC^20850__000001_PE282TD,OPT,2 Station Road,Warboys,Cambs,,,PE28 2TD,, - ,,,No ratings yet Rate it yourself - /Services/opticians/LeaveReview/DefaultView.aspx?id=5PC^20850__000001_PE282TD,0,0,
Selby and Taylor Opticians,CO/3820,OPT,,44a Dartford Road,,Cambs,,PE15 8BQ,, - ,,,No ratings yet Rate it yourself - /Services/opticians/LeaveReview/DefaultView.aspx?id=CO/3820,0,0,
Needham Market Opticians,OP-01-9208-5PT__000001_IP68DG,OPT,102 High Street,,Needham Market,Suffolk,,IP6 8DG,Tel: 01449 723180, - ,,,No ratings yet Rate it yourself - /Services/opticians/LeaveReview/DefaultView.aspx?id=OP-01-9208-5PT__000001_IP68DG,0,0,
Dunstone Optometry,OP_5JT_6400__000001_IP75DZ,OPT,3 Queen Street,Hadleigh,,Ipswich,,IP7 5DZ,Tel: 01473 823755, - ,,,No ratings yet Rate it yourself - /Services/opticians/LeaveReview/DefaultView.aspx?id=OP_5JT_6400__000001_IP75DZ,0,0,
Hadleigh Eye & Hearing Centre,B9O9L,OPT,43 High Street,43B High Street,Ipswich,Ipswich,,IP7 5AB,Tel: 01473 828801, - ,,,2 ratings Rate it yourself - /Services/opticians/LeaveReview/DefaultView.aspx?id=B9O9L,,,
Simon Kleyn Opticians,OP_TAG_13386__000001_CO62QX,OPT,,106,High Street,Earls Colne,Essex,CO6 2QX,Tel: 01787223213, - ,,,1 rating Rate it yourself - /Services/opticians/LeaveReview/DefaultView.aspx?id=OP_TAG_13386__000001_CO62QX,,,
E.H. Howes Opticians,OP_5GK_10929__000001_SG89AA,OPT,33/35 High Street,,Royston,,,SG8 9AA,Tel: 01763 243132, - ,,,No ratings yet Rate it yourself - /Services/opticians/LeaveReview/DefaultView.aspx?id=OP_5GK_10929__000001_SG89AA,0,0,
Scrivens Optical & Hearing Care,OP_5GK_5479__000001_SG89AW,OPT,,42A High Street,,Royston,Hertfordshire,SG8 9AW,Tel: 01763 243050, - ,,,1 rating Rate it yourself - /Services/opticians/LeaveReview/DefaultView.aspx?id=OP_5GK_5479__000001_SG89AW,,,
Gathercole & Ward,OP_5GF_3400__000001_PE171BS,OPT,102 High Street Ramsey,Huntingdon,Cambridgeshire,,,PE26 1BS,Tel: 01487 812358, - ,,,No ratings yet Rate it yourself - /Services/opticians/LeaveReview/DefaultView.aspx?id=OP_5GF_3400__000001_PE171BS,0,0,
Martin Christopher Opticians,OP_5G1_9850__000002_NR172AH,OPT,Church Street,,Attleborough,Norfolk,,NR17 2AH,Tel: 01953 452564, - ,,,No ratings yet Rate it yourself - /Services/opticians/LeaveReview/DefaultView.aspx?id=OP_5G1_9850__000002_NR172AH,0,0,
Cecil C Amey Ltd,OP_5G1_473__000003_NR172AH,OPT,11 Church Street,,Attleborough,,,NR17 2AH,Tel: 01953 453109, - ,,,No ratings yet Rate it yourself - /Services/opticians/LeaveReview/DefaultView.aspx?id=OP_5G1_473__000003_NR172AH,0,0,
J.Oliver Radley Opticians Ltd,OP_5P3_11322__000001_SG99AQ,OPT,36 High Street,Buntingford,Hertfordshire,,,SG9 9AQ,Tel: 01763 273300, - ,,,11 ratings Rate it yourself - /Services/opticians/LeaveReview/DefaultView.aspx?id=OP_5P3_11322__000001_SG99AQ,,,
Premiere Specs Centre,OP_5AH_1101__000001_CO111AH,OPT,29 High Street,,Manningtree,Essex,,CO11 1AH,Tel: 01206 396396, - ,,,No ratings yet Rate it yourself - /Services/opticians/LeaveReview/DefaultView.aspx?id=OP_5AH_1101__000001_CO111AH,0,0,
Piper & Priem Optometrists,OP_5AH_13299__000001_CO111AJ,OPT,30 High Street,,Manningtree,Essex,,CO11 1AJ,Tel: 01206 392529, - ,,,4 ratings Rate it yourself - /Services/opticians/LeaveReview/DefaultView.aspx?id=OP_5AH_13299__000001_CO111AJ,,,
