Organisation Name,NACS Code,Organisation Type,Address1,Address2,Address3,Address4,Address5,PostCode,Telephone Number,Opening time,Value  (Opening time),Banding Classification  (Opening time),NHS.UK users rating,Value  (NHS.UK users rating),Banding Classification  (NHS.UK users rating),Car parking (Is there car parking at this organisation?)
Holiday - Adam,MOB/01-17484/5N8__000001_NG123FB,OPT,5 The Mews,Hall Lane,Colston Basset,Nottinghamshire,,NG12 3FB,, - ,,,No ratings yet Rate it yourself - /Services/opticians/LeaveReview/DefaultView.aspx?id=MOB/01-17484/5N8__000001_NG123FB,0,0,
Twynings Opticians,CO-0076/2/5N8__000002_NG138AD,OPT,17 Union Street,,Bingham,Nottinghamshire,,NG13 8AD,, - ,,,No ratings yet Rate it yourself - /Services/opticians/LeaveReview/DefaultView.aspx?id=CO-0076/2/5N8__000002_NG138AD,0,0,
Thomas Bond & Partners,OP_5FC_3209__000003_NG138BD,OPT,17 Eaton Place,,,Bingham,Nottinghamshire,NG13 8BD,Tel: 01949 838242, - ,,,No ratings yet Rate it yourself - /Services/opticians/LeaveReview/DefaultView.aspx?id=OP_5FC_3209__000003_NG138BD,0,0,
Cotgrave Eyecare,01-14171,OPT,,"14, The Shopping Centre",off Candleby Lane,"Cotgrave,",Nottinghamshire,NG12 3JQ,Tel: 0115 9890018, - ,,,1 rating Rate it yourself - /Services/opticians/LeaveReview/DefaultView.aspx?id=01-14171,,,yes
Specsavers,OP_5EH_5897__000004_LE131XH,OPT,22-24 Sherrard Street,,Melton Mowbray,Leicestershire,,LE13 1UT,Tel: 01664 503555, - ,,,No ratings yet Rate it yourself - /Services/opticians/LeaveReview/DefaultView.aspx?id=OP_5EH_5897__000004_LE131XH,0,0,
Vision Express,OPL-01-22086-5PA__000002_LE130TR,OPT,3 High Street,,Melton Mowbray,Leicestershire,,LE13 0TR,Tel: 01664 566 645, - ,,,No ratings yet Rate it yourself - /Services/opticians/LeaveReview/DefaultView.aspx?id=OPL-01-22086-5PA__000002_LE130TR,0,0,
Boots-Melton Mowbray,OP_5EH_823__000002_LE130TP,OPT,6 Cheapside,,Leicester,Melton Mowbray,,LE13 0TP,Tel: 01664 562195, - ,,,No ratings yet Rate it yourself - /Services/opticians/LeaveReview/DefaultView.aspx?id=OP_5EH_823__000002_LE130TP,0,0,
Graham Coe Opticians,OP_5PA_12201__000001_LE131AE,OPT,11 Burton Street,,,Melton Mowbray,,LE13 1AE,Tel: 01664 569722, - ,,,No ratings yet Rate it yourself - /Services/opticians/LeaveReview/DefaultView.aspx?id=OP_5PA_12201__000001_LE131AE,0,0,
Keyworth Optical Ltd,CO-0066/5N8__000001_NG125FT,OPT,"75 The Parade, Wolds Drive",Keyworth,Nottingham,,,NG12 5FT,Tel: 0115 937 3635, - ,,,No ratings yet Rate it yourself - /Services/opticians/LeaveReview/DefaultView.aspx?id=CO-0066/5N8__000001_NG125FT,0,0,
Keyworth Optical,GOC01-15045__000002_NG125FT,OPT,75 The Parade,Wolds Drive,Keyworth,Nottinghamshire,,NG12 5FT,Tel: 0115 937 3635, - ,,,No ratings yet Rate it yourself - /Services/opticians/LeaveReview/DefaultView.aspx?id=GOC01-15045__000002_NG125FT,0,0,
Lesley Cree Opticians Limited,NG12 2FD,OPT,,9b Main Road,,Radcliffe on Trent,Nottinghamshire,NG12 2FD,Tel: 0115 9332999, - ,,,10 ratings Rate it yourself - /Services/opticians/LeaveReview/DefaultView.aspx?id=NG12 2FD,,,yes
Bowler & Charsley,OP_5FC_1226__000001_NG122AG,OPT,22 Shelford Road,Radcliffe-on-Trent,,Nottingham,,NG12 2AG,Tel: 0115 933 3930, - ,,,No ratings yet Rate it yourself - /Services/opticians/LeaveReview/DefaultView.aspx?id=OP_5FC_1226__000001_NG122AG,0,0,
Winson Opticians,OP_5FC_1857__000001_NG125JW,OPT,9 Bunny Lane,Keyworth,Nottingham,,,NG12 5JU,Tel: 0115 937 5521, - ,,,No ratings yet Rate it yourself - /Services/opticians/LeaveReview/DefaultView.aspx?id=OP_5FC_1857__000001_NG125JW,0,0,
Specsavers Colwick,,OPT,,Sainsbury's Road No 3,,Nottingham,,NG4 2JN,Tel: 0115 6975899, - ,,,N/A - Data not available,,,
Thomas Bond & Partners,OP_5EC_2342__000002_NG42LA,OPT,37 Victoria Road,,,Netherfield,Nottinghamshire,NG4 2LA,Tel: 0115 961 6193, - ,,,No ratings yet Rate it yourself - /Services/opticians/LeaveReview/DefaultView.aspx?id=OP_5EC_2342__000002_NG42LA,0,0,
Winson Opticians,OP_5FC_803__000001_NG25HU,OPT,2 Priory Road,West Bridgford,,Nottingham,Nottinghamshire,NG2 5HU,Tel: 0115 981 6932, - ,,,No ratings yet Rate it yourself - /Services/opticians/LeaveReview/DefaultView.aspx?id=OP_5FC_803__000001_NG25HU,0,0,yes
Thomas Bond & Partners,OP_5FC_3207__000001_NG26ER,OPT,130 Melton Road,,,West Bridgford,Nottinghamshire,NG2 6ER,Tel: 0115 981 2844, - ,,,No ratings yet Rate it yourself - /Services/opticians/LeaveReview/DefaultView.aspx?id=OP_5FC_3207__000001_NG26ER,0,0,
Johns Opticians,OP_5FC_4561__000001_NG22NL,OPT,34 Gordon Road,West Bridgford,Nottingham,,,NG2 5LN,Tel: 01159 814788, - ,,,No ratings yet Rate it yourself - /Services/opticians/LeaveReview/DefaultView.aspx?id=OP_5FC_4561__000001_NG22NL,0,0,
Specsavers Opticians,NCTPCT79__000001_NG25GQ,OPT,25-27 Central Avenue,West Bridgeford,Nottingham,Nottinghamshire,,NG2 5GQ,, - ,,,No ratings yet Rate it yourself - /Services/opticians/LeaveReview/DefaultView.aspx?id=NCTPCT79__000001_NG25GQ,0,0,
Vision Express,OP_5EV_3794__000001_NG96EH,OPT,32 Central Avenue,West Bridgeford,Nottingham,,,NG2 5GR,Tel: 0115 945 5877, - ,,,No ratings yet Rate it yourself - /Services/opticians/LeaveReview/DefaultView.aspx?id=OP_5EV_3794__000001_NG96EH,0,0,
Winson Opticians,OP_5FC_804__000001_NG116EF,OPT,"The Coach House, Charles Street",Ruddington,Nottingham,,,NG11 6EF,Tel: 0115 921 2992, - ,,,No ratings yet Rate it yourself - /Services/opticians/LeaveReview/DefaultView.aspx?id=OP_5FC_804__000001_NG116EF,0,0,
Asda Opticians,TP7AK,OPT,,Asda Grantham Superstore,,Grantham,,NG31 6NZ,Tel: 01476 581512, - ,,,No ratings yet Rate it yourself - /Services/opticians/LeaveReview/DefaultView.aspx?id=TP7AK,0,0,
Asda Opticians,CO-0001/1/5N8__000002_NG27JA,OPT,184 Loughborough Road,West Bridgeford,Nottingham,Nottinghamshire,,NG2 7JA,Tel: 0115 969 4200, - ,,,No ratings yet Rate it yourself - /Services/opticians/LeaveReview/DefaultView.aspx?id=CO-0001/1/5N8__000002_NG27JA,0,0,
Specsavers Opticians,OP_5D3_1423__000001_NG316EE,OPT,Isaac Newton Centre,,Grantham,,,NG31 6EE,Tel: 01476 572111, - ,,,No ratings yet Rate it yourself - /Services/opticians/LeaveReview/DefaultView.aspx?id=OP_5D3_1423__000001_NG316EE,0,0,
Lunettes Opticians,OP_5D3_459__000001_NG316LH,OPT,,25 The George Shopping Centre,,Grantham,,NG31 6LH,Tel: 01476 591793, - ,,,No ratings yet Rate it yourself - /Services/opticians/LeaveReview/DefaultView.aspx?id=OP_5D3_459__000001_NG316LH,0,0,no
Scrivens Ltd,OP_NG316PH_34927,OPT,,35a High Street,,Grantham,Lincolnshire,NG31 6PH,Tel: 01476 573931, - ,,,No ratings yet Rate it yourself - /Services/opticians/LeaveReview/DefaultView.aspx?id=OP_NG316PH_34927,0,0,
Boots-Grantham - High St,NG31 6PH_19273,OPT,,32 High Street,,Grantham,Lincolnshire,NG31 6PH,Tel: 01476 594474, - ,,,No ratings yet Rate it yourself - /Services/opticians/LeaveReview/DefaultView.aspx?id=NG31 6PH_19273,0,0,
Neville Clarke Optometrist,OP_5PA_281010_1__000002_NG319ZQ,OPT,Home Eyecare,PO Box 2826,,Grantham,Lincolnshire,NG31 9ZQ,Tel: 01476 590353, - ,,,No ratings yet Rate it yourself - /Services/opticians/LeaveReview/DefaultView.aspx?id=OP_5PA_281010_1__000002_NG319ZQ,0,0,
Neville Clark,OP_5GD_12412__000001_NG319PL,OPT,Home Eyecare,PO Box 2826,,Grantham,Lincolnshire,NG31 9ZQ,Tel: 01476 590353, - ,,,No ratings yet Rate it yourself - /Services/opticians/LeaveReview/DefaultView.aspx?id=OP_5GD_12412__000001_NG319PL,0,0,
Neville Clark,OP_NG319ZQ_46952,OPT,Home Eyecare,PO Box 2826,,Grantham,Lincolnshire,NG31 9ZQ,Tel: 01476 590353, - ,,,No ratings yet Rate it yourself - /Services/opticians/LeaveReview/DefaultView.aspx?id=OP_NG319ZQ_46952,0,0,
Clark - Neville,MOB/01-12412/5N8__000001_NG319ZQ,OPT,Home Eyecare,PO Box 2826,,Grantham,Lincolnshire,NG31 9ZQ,Tel: 01476 590353, - ,,,No ratings yet Rate it yourself - /Services/opticians/LeaveReview/DefaultView.aspx?id=MOB/01-12412/5N8__000001_NG319ZQ,0,0,
Morris & Kon,OP_5D3_6913__000001_NG316TS,OPT,8 St. Catherines Road,,Grantham,,,NG31 6TS,Tel: 01476 564766, - ,,,No ratings yet Rate it yourself - /Services/opticians/LeaveReview/DefaultView.aspx?id=OP_5D3_6913__000001_NG316TS,0,0,
J A Higson Opticians,56789__000004_NG41GD,OPT,318 Carlton Hill,Carlton,Nottingham,,,NG4 1GD,, - ,,,No ratings yet Rate it yourself - /Services/opticians/LeaveReview/DefaultView.aspx?id=56789__000004_NG41GD,0,0,
Carlton Opticians,OP_5AP_14063__000001_NG241JR,OPT,318 Carlton Hill,Carlton,Nottingham,,,NG4 1GD,Tel: 0115 9873125, - ,,,No ratings yet Rate it yourself - /Services/opticians/LeaveReview/DefaultView.aspx?id=OP_5AP_14063__000001_NG241JR,0,0,
Eye 2 Eye Opticians,C-0084/5N8__000001_NG41JD,OPT,346 Carlton Hill,Carlton,Nottingham,Nottinghamshire,,NG4 1JD,Tel: 01159 877378, - ,,,No ratings yet Rate it yourself - /Services/opticians/LeaveReview/DefaultView.aspx?id=C-0084/5N8__000001_NG41JD,0,0,
Dale Opticians,OP_5EM_14882__000001_NG24LW,OPT,133 Sneinton Dale,Sneinton,Nottingham,,,NG2 4LW,Tel: 0115 9580023, - ,,,No ratings yet Rate it yourself - /Services/opticians/LeaveReview/DefaultView.aspx?id=OP_5EM_14882__000001_NG24LW,0,0,
Dale Opticians,MOB/0091/5N8__000003_NG24LW,OPT,133 Sneiton Dale,,Nottingham,Nottinghamshire,,NG2 4LW,, - ,,,No ratings yet Rate it yourself - /Services/opticians/LeaveReview/DefaultView.aspx?id=MOB/0091/5N8__000003_NG24LW,0,0,
Compton Acres Optician,OP_5FC_14910__000003_NG27RS,OPT,"Unit 6, Compton Acres",West Bridgford,Nottingham,,,NG2 7RS,Tel: 0115 9455726, - ,,,1 rating Rate it yourself - /Services/opticians/LeaveReview/DefaultView.aspx?id=OP_5FC_14910__000003_NG27RS,,,
K D Mistry,OP_5EM_3645__000001_NG23JD,OPT,17 Bridgeway Centre,The Meadows,Nottingham,,,NG2 3JD,Tel: 0115 986 4010, - ,,,No ratings yet Rate it yourself - /Services/opticians/LeaveReview/DefaultView.aspx?id=OP_5EM_3645__000001_NG23JD,0,0,
J Yeomans & Partners,OP_5EM_8797__000001_NG24PB,OPT,19 Manvers Street,,Nottingham,,,NG2 4PB,Tel: 0115 9505477, - ,,,No ratings yet Rate it yourself - /Services/opticians/LeaveReview/DefaultView.aspx?id=OP_5EM_8797__000001_NG24PB,0,0,
Boots Opticians (Adams Eyecare Ltd),OP_5D3_5457__000001_NG319PH,OPT,,32 High Street,,Grantham,,NG31 9PH,Tel: 01476 594474, - ,,,No ratings yet Rate it yourself - /Services/opticians/LeaveReview/DefaultView.aspx?id=OP_5D3_5457__000001_NG319PH,0,0,Data not available
Eyecatchers Opticians,MOB/01-21809/5N8__000005_NG17FF,OPT,20 Carrington Street,,Nottingham,Nottinghamshire,,NG1 7FF,, - ,,,No ratings yet Rate it yourself - /Services/opticians/LeaveReview/DefaultView.aspx?id=MOB/01-21809/5N8__000005_NG17FF,0,0,
Eyecatchers Opticians,OP_5EM 21809__000004_NG17FF,OPT,20 Carrington Street,,,Nottingham,,NG1 7FF,, - ,,,No ratings yet Rate it yourself - /Services/opticians/LeaveReview/DefaultView.aspx?id=OP_5EM 21809__000004_NG17FF,0,0,
Eyecatchers Opticians,OP_5EA_14790__000003_NG17FF,OPT,20 Carrington Street,,Nottingham,,,NG1 7FF,Tel: 0115 9584313, - ,,,No ratings yet Rate it yourself - /Services/opticians/LeaveReview/DefaultView.aspx?id=OP_5EA_14790__000003_NG17FF,0,0,
Specdeals,OP_5EM_9019__000001_NG17LE,OPT,Unit 18 Broad Walk,Broad Marsh Centre,Nottingham,,,NG1 7LE,Tel: 0115 9473734, - ,,,No ratings yet Rate it yourself - /Services/opticians/LeaveReview/DefaultView.aspx?id=OP_5EM_9019__000001_NG17LE,0,0,
Johns Opticians,MOB/0011/5N8__000002_NG11NL,OPT,7 Carlton Street,Hockley,Nottingham,Nottinghamshire,,NG1 1NL,, - ,,,1 rating Rate it yourself - /Services/opticians/LeaveReview/DefaultView.aspx?id=MOB/0011/5N8__000002_NG11NL,,,
Johns Opticians,OP_5EM_4560__000001_NG11NL,OPT,7 Carlton Street,Hockley,Nottingham,,,NG1 1NL,Tel: 0115 9475858, - ,,,No ratings yet Rate it yourself - /Services/opticians/LeaveReview/DefaultView.aspx?id=OP_5EM_4560__000001_NG11NL,0,0,
Optical Express,CO-2069__000001_NG17DD,OPT,36 Lister Gate,,,Nottingham,Nottinghamshire,NG1 7DD,Tel: 0800 023 2020, - ,,,No ratings yet Rate it yourself - /Services/opticians/LeaveReview/DefaultView.aspx?id=CO-2069__000001_NG17DD,0,0,
Winson Opticians,OP_5EM_14896__000001_NG118AD,OPT,118 Southchurch Drive,Clifton,Nottingham,,,NG11 8AD,Tel: 0115 9211623, - ,,,No ratings yet Rate it yourself - /Services/opticians/LeaveReview/DefaultView.aspx?id=OP_5EM_14896__000001_NG118AD,0,0,
Gray & Bull,OP_5EM_7898__000001_NG12EH,OPT,,5 Pelham Street,,Nottingham,Nottinghamshire,NG1 2EH,Tel: 01159418121, - ,,,2 ratings Rate it yourself - /Services/opticians/LeaveReview/DefaultView.aspx?id=OP_5EM_7898__000001_NG12EH,,,
Optique Vision,MOB/0085/5N8__000002_NG12ET,OPT,6 High Street,The Exchange,Nottingham,Nottinghamshire,Nottinghamshire,NG1 2ET,Tel: 01159 501499, - ,,,No ratings yet Rate it yourself - /Services/opticians/LeaveReview/DefaultView.aspx?id=MOB/0085/5N8__000002_NG12ET,0,0,yes
Optique,OO/S1349__000001_NG12ET,OPT,6 High Street,Exchange Arcade,Nottingham,Notts,,NG1 2ET,Tel: 0115 950 1499, - ,,,No ratings yet Rate it yourself - /Services/opticians/LeaveReview/DefaultView.aspx?id=OO/S1349__000001_NG12ET,0,0,
Boots-Nottingham -  Victoria Centre (in Boots UK),OP_5EM_427__000002_NG13QS,OPT,11-19 Lower Parliament Street,,,Nottingham,Nottinghamshire,NG1 3QS,Tel: 0845 123 1000, - ,,,2 ratings Rate it yourself - /Services/opticians/LeaveReview/DefaultView.aspx?id=OP_5EM_427__000002_NG13QS,,,
Specsavers,OP_5EM_14892__000001_NG12NP,OPT,20-24 Wheeler Gate,,Nottingham,,,NG1 2ND,Tel: 0115 9588361, - ,,,No ratings yet Rate it yourself - /Services/opticians/LeaveReview/DefaultView.aspx?id=OP_5EM_14892__000001_NG12NP,0,0,
Boots-Nottingham - Victoria Centre,OP_5EM_2831__000001_NG13QG,OPT,165 Victoria Centre,Nottingham,,Nottinghamshire,,NG1 3QG,Tel: 0115 947 4807, - ,,,1 rating Rate it yourself - /Services/opticians/LeaveReview/DefaultView.aspx?id=OP_5EM_2831__000001_NG13QG,,,
Tony & Guy Opticians,23456__000001_NG12DR,OPT,27 Long Row,,Nottingham,,,NG1 2DR,, - ,,,No ratings yet Rate it yourself - /Services/opticians/LeaveReview/DefaultView.aspx?id=23456__000001_NG12DR,0,0,
Specs Makers of Nottingham,OPT_NG21LW_1,OPT,1st Floor G W Butler Building,Crossgate Drive,,Nottingham,Nottinghamshire,NG2 1LW,Tel: 0115 906 3010, - ,,,No ratings yet Rate it yourself - /Services/opticians/LeaveReview/DefaultView.aspx?id=OPT_NG21LW_1,0,0,
Boots-Nottingham - Friar Lane,OP_5EM_14881__000001_NG16DD,OPT,City House,39 Friar Lane,,Nottingham,Nottinghamshire,NG1 6DD,Tel: 01159 472 838, - ,,,No ratings yet Rate it yourself - /Services/opticians/LeaveReview/DefaultView.aspx?id=OP_5EM_14881__000001_NG16DD,0,0,
Lancaster & Thorpe Opticians,MOB/0009/5N8__000002_NG14AF,OPT,7 Trinity Square,,,Nottingham,Nottinghamshire,NG1 4AF,Tel: 0115 9475463, - ,,,No ratings yet Rate it yourself - /Services/opticians/LeaveReview/DefaultView.aspx?id=MOB/0009/5N8__000002_NG14AF,0,0,no
Lancaster & Thorpe Ltd,OP_5EM_3713__000001_NG14AF,OPT,7-9 Trinity Square,,Nottingham,,,NG1 4AF,Tel: 0115 947 5463, - ,,,No ratings yet Rate it yourself - /Services/opticians/LeaveReview/DefaultView.aspx?id=OP_5EM_3713__000001_NG14AF,0,0,
Loxley Opticians & Eyewear Experts,01-26796,OPT,,32 Friar Lane,,Nottingham,,NG1 6DQ,Tel: 0115 8375960, - ,,,2 ratings Rate it yourself - /Services/opticians/LeaveReview/DefaultView.aspx?id=01-26796,,,
Kings Walk Contact Lenses,OP_5EM_8029__000001_NG12AE,OPT,3 Kings Walk,,Nottingham,,,NG1 2AE,Tel: 0115 9474387, - ,,,No ratings yet Rate it yourself - /Services/opticians/LeaveReview/DefaultView.aspx?id=OP_5EM_8029__000001_NG12AE,0,0,
Mimi Yip Ltd,CO-0067/5N8__000001_LE128IK,OPT,1 gotham Road,East Leake,,Loughborough,,LE12 8JG,Tel: 01509 852674, - ,,,No ratings yet Rate it yourself - /Services/opticians/LeaveReview/DefaultView.aspx?id=CO-0067/5N8__000001_LE128IK,0,0,
W E Phillips,OP_5EM_14894__000001_NG16EB,OPT,86 Friar Lane,,Nottingham,,,NG1 6EB,Tel: 0115 9475265, - ,,,1 rating Rate it yourself - /Services/opticians/LeaveReview/DefaultView.aspx?id=OP_5EM_14894__000001_NG16EB,,,
Specsavers Eye Care at Home,OL/CO-2008/5FT__000004_LU48EF,OPT,Cirrus House,10 Experian Way,Luton,Nottingham,,NG2 1EP,Tel: 01582 390812, - ,,,80 ratings Rate it yourself - /Services/opticians/LeaveReview/DefaultView.aspx?id=OL/CO-2008/5FT__000004_LU48EF,,,
C E Lea,OP_5EC_14900__000002_NG35JU,OPT,33 Plains Road,Mapperley,Nottingham,,,NG3 5JU,Tel: 01159 606526, - ,,,No ratings yet Rate it yourself - /Services/opticians/LeaveReview/DefaultView.aspx?id=OP_5EC_14900__000002_NG35JU,0,0,
Wozencroft & Company,OP_5EM_14897__000001_NG15BH,OPT,4 Oxford Street,,Nottingham,,,NG1 5BH,Tel: 0115 9475317, - ,,,No ratings yet Rate it yourself - /Services/opticians/LeaveReview/DefaultView.aspx?id=OP_5EM_14897__000001_NG15BH,0,0,
Park Vision,67890__000004_NG15BQ,OPT,Nottingham Park Clinic,36 Regent Street,,Nottingham,Nottinghamshire,NG1 5BT,Tel: 01159500051, - ,,,2 ratings Rate it yourself - /Services/opticians/LeaveReview/DefaultView.aspx?id=67890__000004_NG15BQ,,,
Brooks and Wardman Optometrists,OP_5EM_14879__000001_NG15DW,OPT,The Courtyard,28 The Ropewalk,Nottingham,Nottingham,Nottinghamshire,NG1 5DW,Tel: 0115 9476309, - ,,,No ratings yet Rate it yourself - /Services/opticians/LeaveReview/DefaultView.aspx?id=OP_5EM_14879__000001_NG15DW,0,0,
Boots-Nottingham - Castle Boulevard,OP_5EM_3334__000001_NG71GY,OPT,171-177 Castle Boulevard,,,Nottingham,Nottinghamshire,NG7 1GY,Tel: 01159 506 665, - ,,,4 ratings Rate it yourself - /Services/opticians/LeaveReview/DefaultView.aspx?id=OP_5EM_3334__000001_NG71GY,,,
Boots-Nottingham - D90 Opticians Support Office,NG90 1BS_12772,OPT,,"D90 East F06, Thane Road",,Beeston,Nottinghamshire,NG90 1BS,Tel: 0115 949 5763, - ,,,2 ratings Rate it yourself - /Services/opticians/LeaveReview/DefaultView.aspx?id=NG90 1BS_12772,,,
Kopacz and Barlow,OP_5EA_14809__000001_NG54GB,OPT,30a Marlborough Road,Woodthorpe,Nottingham,,,NG5 4GB,Tel: 0115 926 1694, - ,,,No ratings yet Rate it yourself - /Services/opticians/LeaveReview/DefaultView.aspx?id=OP_5EA_14809__000001_NG54GB,0,0,
C & D Barlow,OP_5EC_14901__000002_NG54GB,OPT,Foxhall Business Centre,Foxhall Road,Nottingham,,,NG7 6LH,Tel: 0800 6525505, - ,,,No ratings yet Rate it yourself - /Services/opticians/LeaveReview/DefaultView.aspx?id=OP_5EC_14901__000002_NG54GB,0,0,
A C Allen,OP_5EM_5859__000001_NG52GA,OPT,660 Mansfield Road,Sherwood,Nottingham,,,NG5 2GA,Tel: 0115 960 3594, - ,,,No ratings yet Rate it yourself - /Services/opticians/LeaveReview/DefaultView.aspx?id=OP_5EM_5859__000001_NG52GA,0,0,
Allen A C,MOB/0013/5N8__000002_NG52GA,OPT,660 Mansfield Road,Sherwood,Nottingham,Nottinghamshire,,NG5 2GA,Tel: 01159 603594, - ,,,No ratings yet Rate it yourself - /Services/opticians/LeaveReview/DefaultView.aspx?id=MOB/0013/5N8__000002_NG52GA,0,0,
Woolcott Opticians,34567__000004_NG52GE,OPT,672 Mansfield Road,,Nottingham,,,NG5 2GE,, - ,,,No ratings yet Rate it yourself - /Services/opticians/LeaveReview/DefaultView.aspx?id=34567__000004_NG52GE,0,0,
Trent Eye-Care Ltd,TP9DK,OPT,,680 Mansfield Road,,Nottingham,,NG5 2GE,Tel: 0115 8224822, - ,,,No ratings yet Rate it yourself - /Services/opticians/LeaveReview/DefaultView.aspx?id=TP9DK,0,0,
P D Rees Ltd,OP_5EM_14891__000001_NG72DZ,OPT,357c Derby Road,Lenton,Nottingham,,,NG7 2DZ,Tel: 0115 9781823, - ,,,No ratings yet Rate it yourself - /Services/opticians/LeaveReview/DefaultView.aspx?id=OP_5EM_14891__000001_NG72DZ,0,0,
Opticare Opticians,OP_5JC_3769__000001_LE127NA,OPT,22 King Street,Sileby,,Loughborough,Leicestershire,LE12 7NA,Tel: 01509 812088, - ,,,No ratings yet Rate it yourself - /Services/opticians/LeaveReview/DefaultView.aspx?id=OP_5JC_3769__000001_LE127NA,0,0,
Medina Express Opticians,OP_5EM_22780__000001_NG75FU,OPT,92 Radford Road,Hyson Green,Nottingham,Nottinghamshire,,NG7 5FU,Tel: 0115 9788786, - ,,,No ratings yet Rate it yourself - /Services/opticians/LeaveReview/DefaultView.aspx?id=OP_5EM_22780__000001_NG75FU,0,0,
Asda Opticians,OPT_NG7 5FP,OPT,,RADFORD ROAD,HYSON GREEN,NOTTINGHAM,,NG7 5FP,Tel: 01159 002520, - ,,,No ratings yet Rate it yourself - /Services/opticians/LeaveReview/DefaultView.aspx?id=OPT_NG7 5FP,0,0,
Mr A Khan T/A D I Blow Opticians Ltd,OP_5EM_5933__000001_NG75EH,OPT,143-145 Radford Road,Hyson Green,Nottingham,,,NG7 5EH,Tel: 0115 9786551, - ,,,3 ratings Rate it yourself - /Services/opticians/LeaveReview/DefaultView.aspx?id=OP_5EM_5933__000001_NG75EH,,,
DI Blow Opticians,MOB/2677/2/5N8__000002_NG75EH,OPT,143 Radford Road,,Nottingham,Nottinghamshire,,NG7 5EH,, - ,,,No ratings yet Rate it yourself - /Services/opticians/LeaveReview/DefaultView.aspx?id=MOB/2677/2/5N8__000002_NG75EH,0,0,
Adams Opticians,OP_5EC_8895__000001_NG57DE,OPT,19 High Street,Arnold,Nottingham,Nottingham,,NG5 7DE,Tel: 0115 9555520, - ,,,No ratings yet Rate it yourself - /Services/opticians/LeaveReview/DefaultView.aspx?id=OP_5EC_8895__000001_NG57DE,0,0,
Specsavers Opticians,OP_5EC_11181__000001_NG57EG,OPT,118 Front Street,Arnold,Nottingham,,,NG5 7EG,Tel: 0115 9670856, - ,,,No ratings yet Rate it yourself - /Services/opticians/LeaveReview/DefaultView.aspx?id=OP_5EC_11181__000001_NG57EG,0,0,
"Alan D Box, Opticians",OP_5EM_12436__000001_NG75GT,OPT,201 Radford Road,Hyson Green,Nottingham,,,NG7 5GT,Tel: 0115 978 5557, - ,,,No ratings yet Rate it yourself - /Services/opticians/LeaveReview/DefaultView.aspx?id=OP_5EM_12436__000001_NG75GT,0,0,
Thomas Bond & Partners,OP_5EC_3208__000002_NG57DJ,OPT,77b High Street,,,Arnold,Nottinghamshire,NG5 7DJ,Tel: 0115 926 7455, - ,,,No ratings yet Rate it yourself - /Services/opticians/LeaveReview/DefaultView.aspx?id=OP_5EC_3208__000002_NG57DJ,0,0,
Eyestyle Co,OP_5EC_14905__000001_NG57ED,OPT,155 Front Street,Arnold,Nottingham,,,NG5 7ED,Tel: 0115 9536526, - ,,,No ratings yet Rate it yourself - /Services/opticians/LeaveReview/DefaultView.aspx?id=OP_5EC_14905__000001_NG57ED,0,0,
Visual Answers Opticians,5PA 12558__000003_LE128PY,OPT,28a High Street,,Barrow On Soar,Leics,,LE12 8PY,Tel: 01509 416800, - ,,,No ratings yet Rate it yourself - /Services/opticians/LeaveReview/DefaultView.aspx?id=5PA 12558__000003_LE128PY,0,0,
Duffy Optometrists,OP_5EM_1437__000001_NG81EW,OPT,190 Wollaton Road,Wollaton,Nottingham,,,NG8 1HJ,Tel: 0115 928 2572, - ,,,1 rating Rate it yourself - /Services/opticians/LeaveReview/DefaultView.aspx?id=OP_5EM_1437__000001_NG81EW,,,
Healthcall Opticial Services (Chris J Jones Ltd),OP_LE157JH_34423,OPT,,4 Jubilee Drive Langham,,Rutland,,LE15 7JH,Tel: 0800 5677925, - ,,,No ratings yet Rate it yourself - /Services/opticians/LeaveReview/DefaultView.aspx?id=OP_LE157JH_34423,0,0,
Lancaster & Thorpe Opticians,OP_5EV_4027__000002_NG92LA,OPT,6 Stoney Street,Beeston,Nottingham,,,NG9 2LA,Tel: 01159 256484, - ,,,No ratings yet Rate it yourself - /Services/opticians/LeaveReview/DefaultView.aspx?id=OP_5EV_4027__000002_NG92LA,0,0,
Specsavers Opticians,CO-0022/4/5N8__000001_NG91EF,OPT,4 Chilwell Road,The Square,Beeston,Nottingham,,NG9 1EF,, - ,,,No ratings yet Rate it yourself - /Services/opticians/LeaveReview/DefaultView.aspx?id=CO-0022/4/5N8__000001_NG91EF,0,0,
Syston Eyecare,OP_5EH_1126__000002_LE71GZ,OPT,14b Town Square,Syston,Leicester,,,LE7 1GZ,Tel: 0116 260 5666, - ,,,No ratings yet Rate it yourself - /Services/opticians/LeaveReview/DefaultView.aspx?id=OP_5EH_1126__000002_LE71GZ,0,0,
Duffy  Optometrists,MOB/2230/5N8__000001_NG81HT,OPT,190 Wollaton Road,,Wollaton,Nottinghamshire,,NG8 1HT,, - ,,,No ratings yet Rate it yourself - /Services/opticians/LeaveReview/DefaultView.aspx?id=MOB/2230/5N8__000001_NG81HT,0,0,
John Flynn Opticians,OP_5EV_14899__000001_NG91BS,OPT,1a Devonshire Avenue,Beeston,,Nottingham,,NG9 1BS,Tel: 0115 9255051, - ,,,No ratings yet Rate it yourself - /Services/opticians/LeaveReview/DefaultView.aspx?id=OP_5EV_14899__000001_NG91BS,0,0,
Henry Smith & Hamylton Opticians,OL/CO-954/5PA__000001_LE78HD,OPT,,1284a Melton Road,,Syston,,LE7 2HD,Tel: 0116 260 2517, - ,,,1 rating Rate it yourself - /Services/opticians/LeaveReview/DefaultView.aspx?id=OL/CO-954/5PA__000001_LE78HD,,,
Pilbeam Opticians Ltd,OP_5JC_12699__000001_LE127AJ,OPT,49 Leicester Road,,Mountsorrel,Leicestershire,,LE12 7AJ,Tel: 0116 237 5462, - ,,,No ratings yet Rate it yourself - /Services/opticians/LeaveReview/DefaultView.aspx?id=OP_5JC_12699__000001_LE127AJ,0,0,