Organisation Name,NACS Code,Organisation Type,Address1,Address2,Address3,Address4,Address5,PostCode,Telephone Number,Opening time,Value  (Opening time),Banding Classification  (Opening time),NHS.UK users rating,Value  (NHS.UK users rating),Banding Classification  (NHS.UK users rating),Car parking (Is there car parking at this organisation?)
"G Uddin Ltd, T/A The Eye Emporium Ltd",OP_5H3_13511__000001_CH11EF,OPT,10 St Michaels Row,,Chester,Cheshire,,CH1 1EF,Tel: 01244 341116, - ,,,No ratings yet Rate it yourself - /Services/opticians/LeaveReview/DefaultView.aspx?id=OP_5H3_13511__000001_CH11EF,0,0,
"H T Churchman, T/A J D Siddall",OP_5H3_13447__000001_CH11XR,OPT,The Cross,4 Bridge Street,Chester,Cheshire,,CH1 1NQ,Tel: 01244 320222, - ,,,No ratings yet Rate it yourself - /Services/opticians/LeaveReview/DefaultView.aspx?id=OP_5H3_13447__000001_CH11XR,0,0,
Optical Express,CH11DD_12348,OPT,,"The Exchange, Suite 2, 1st Floor, St John Street",,Chester,,CH1 1DD,Tel: 0800 0232020, - ,,,No ratings yet Rate it yourself - /Services/opticians/LeaveReview/DefaultView.aspx?id=CH11DD_12348,0,0,
Chester Visionplus Limited,OP_5H3_3003__000004_CH12HA,OPT,40 Northgate Street,Chester,Cheshire,,,CH1 2HA,Tel: 01244 310 832, - ,,,No ratings yet Rate it yourself - /Services/opticians/LeaveReview/DefaultView.aspx?id=OP_5H3_3003__000004_CH12HA,0,0,
Vision Express UK Ltd,OP_5H3_12941__000003_CH12HA,OPT,42/48 Northgate Street,,Chester,Cheshire,,CH1 2HA,Tel: 01244 409138, - ,,,No ratings yet Rate it yourself - /Services/opticians/LeaveReview/DefaultView.aspx?id=OP_5H3_12941__000003_CH12HA,0,0,
Bayfields Opticians and Audiologists (Chester),O3M3N,OPT,,29 St Werburgh Street,,Chester,Cheshire,CH1 2DY,Tel: 01244 315112, - ,,,No ratings yet Rate it yourself - /Services/opticians/LeaveReview/DefaultView.aspx?id=O3M3N,0,0,
Jonathan Bryan Opticians,OP_5H3_13193__000002_CH12DY,OPT,St Oswalds Chambers,20-22 St Werburgh Street,Chester,Cheshire,,CH1 2DY,Tel: 01244 321045, - ,,,No ratings yet Rate it yourself - /Services/opticians/LeaveReview/DefaultView.aspx?id=OP_5H3_13193__000002_CH12DY,0,0,
Boots-Chester - Foregate St,OP_5H3_500__000002_CH11NA,OPT,47-55 Foregate Street,,,Chester,Cheshire,CH1 1NA,Tel: 01244 312843, - ,,,No ratings yet Rate it yourself - /Services/opticians/LeaveReview/DefaultView.aspx?id=OP_5H3_500__000002_CH11NA,0,0,
Boots-Chester - Frodsham St,OP_5H3_2734__000001_CH11HD,OPT,7 Frodsham Street,,Chester,Cheshire,,CH1 3JJ,Tel: 01244 321636, - ,,,No ratings yet Rate it yourself - /Services/opticians/LeaveReview/DefaultView.aspx?id=OP_5H3_2734__000001_CH11HD,0,0,
Houghton Opticians,OP_5H3_3612__000001_CH23AZ,OPT,14 Charles Street,Hoole,Chester,Cheshire,,CH2 3AZ,Tel: 01244 325969, - ,,,No ratings yet Rate it yourself - /Services/opticians/LeaveReview/DefaultView.aspx?id=OP_5H3_3612__000001_CH23AZ,0,0,
Jane Smellie Opticians Ltd,CH4 9DE_11111,OPT,,Wrexham Road,,Chester,,CH4 9DE,, - ,,,No ratings yet Rate it yourself - /Services/opticians/LeaveReview/DefaultView.aspx?id=CH4 9DE_11111,0,0,
Asda Opticians,OPT_CH1 4QQ,OPT,,"UNIT 33, GREYHOUND RETAIL PARK",CHASER COURT,CHESTER,,CH1 4QQ,Tel: 01244 360 816, - ,,,1 rating Rate it yourself - /Services/opticians/LeaveReview/DefaultView.aspx?id=OPT_CH1 4QQ,,,
A1 Vision,00082__000003_CH35LB,OPT,64 Green Lane,Vicars Cross,Chester,Cheshire,,CH3 5LB,Tel: 01244 329292, - ,,,No ratings yet Rate it yourself - /Services/opticians/LeaveReview/DefaultView.aspx?id=00082__000003_CH35LB,0,0,
Costco Wholesale UK Ltd,OP_CH16LT_84858,OPT,,Dunkirk Trading Estate,Chester Gates,Chester,,CH1 6LT,Tel: 01244 852 085, - ,,,No ratings yet Rate it yourself - /Services/opticians/LeaveReview/DefaultView.aspx?id=OP_CH16LT_84858,0,0,
Asda Stores Limited,CH65 0BZ__000001_CH650BZ,OPT,Wellington Road,,Ellesmere Port,Cheshire,,CH65 0BZ,Tel: 0151 348 6120, - ,,,No ratings yet Rate it yourself - /Services/opticians/LeaveReview/DefaultView.aspx?id=CH65 0BZ__000001_CH650BZ,0,0,
Ellesmere Port Visionplus Limited,OP_5H6_13343__000001_CH650BH,OPT,15 Marina Walk,Port Arcades,Ellesmere Port,,,CH65 0BH,Tel: 0151 355 3331, - ,,,No ratings yet Rate it yourself - /Services/opticians/LeaveReview/DefaultView.aspx?id=OP_5H6_13343__000001_CH650BH,0,0,
Boots-Ellesmere Port,OP_5H6_10570__000001_CH650AL,OPT,33 Marina Drive,,,Ellesmere Port,Cheshire,CH65 0AL,Tel: 0151 357 2464, - ,,,No ratings yet Rate it yourself - /Services/opticians/LeaveReview/DefaultView.aspx?id=OP_5H6_10570__000001_CH650AL,0,0,
Ellesmere Optical Ltd t/a Orrell Opticians,OP_5H6_10095__000001_CH650AA,OPT,,68 Whitby Road,,Ellesmere Port,Cheshire,CH65 0AA,Tel: 0151 355 1077, - ,,,1 rating Rate it yourself - /Services/opticians/LeaveReview/DefaultView.aspx?id=OP_5H6_10095__000001_CH650AA,,,
Ellesmere Optical Ltd,OP_5H6_4876__000001_CH663PH,OPT,6 Whetstone Hey,,Great Sutton,Cheshire,,CH66 3PH,Tel: 0151 339 5577, - ,,,No ratings yet Rate it yourself - /Services/opticians/LeaveReview/DefaultView.aspx?id=OP_5H6_4876__000001_CH663PH,0,0,
SPECS2U,OPL/01-25762/5NN,OPT,,Unit 21 Evans Business Centre,,Ellesmere Port ,,CH65 1AE,Tel: 0151 3573456, - ,,,No ratings yet Rate it yourself - /Services/opticians/LeaveReview/DefaultView.aspx?id=OPL/01-25762/5NN,0,0,
Worden Optometrists,OP_5H3_3936__000001_CW60DX,OPT,42 High Street,,,Tarporley,,CW6 0DX,Tel: 01829 732501, - ,,,3 ratings Rate it yourself - /Services/opticians/LeaveReview/DefaultView.aspx?id=OP_5H3_3936__000001_CW60DX,,,
I Wear Opticians Ltd,OL/CO-2071/5NN__000001_CW6OAT,OPT,72 High Street,Tarporley,Nr Chester,Cheshire,,CW6 0AT,Tel: 01829 733661, - ,,,No ratings yet Rate it yourself - /Services/opticians/LeaveReview/DefaultView.aspx?id=OL/CO-2071/5NN__000001_CW6OAT,0,0,
Taylor's Opticians,OP_5H3_13914__000001_WA66QS,OPT,4 Eddisbury Square,,Frodsham,Cheshire,Cheshire,WA6 6QS,Tel: 01928 732255, - ,,,No ratings yet Rate it yourself - /Services/opticians/LeaveReview/DefaultView.aspx?id=OP_5H3_13914__000001_WA66QS,0,0,
Boots-Frodsham,OP_5H3_10421__000001_WA66QW,OPT,32 Church Street,,Frodsham,Cheshire,,WA6 6QW,Tel: 01928 735341, - ,,,No ratings yet Rate it yourself - /Services/opticians/LeaveReview/DefaultView.aspx?id=OP_5H3_10421__000001_WA66QW,0,0,
M E Cook,OP_5H3_13362__000001_WA66PN,OPT,33 Church Street,,Frodsham,Cheshire,,WA6 6PN,Tel: 01928 733609, - ,,,No ratings yet Rate it yourself - /Services/opticians/LeaveReview/DefaultView.aspx?id=OP_5H3_13362__000001_WA66PN,0,0,
J A Allister Opticians Ltd,OP_5H6_535__000001_CH649UB,OPT,The Optician,9 The Cross,Neston,Cheshire,Cheshire,CH64 9UB,Tel: 0151 336 6629, - ,,,2 ratings Rate it yourself - /Services/opticians/LeaveReview/DefaultView.aspx?id=OP_5H6_535__000001_CH649UB,,,
The Eyeworks,OP_5F8_11733__000002_CH626BB,OPT,,"128, Allport Road",Bromborough,Wirral,,CH62 6BB,Tel: 0151 343 0044, - ,,,No ratings yet Rate it yourself - /Services/opticians/LeaveReview/DefaultView.aspx?id=OP_5F8_11733__000002_CH626BB,0,0,yes
Houghtons Opticians,OP_5F8_3955__000001_CH627HH,OPT,47 Allport Lane Precinct,Bromborough,Wirral,,,CH62 7HH,Tel: 0151 334 2805, - ,,,No ratings yet Rate it yourself - /Services/opticians/LeaveReview/DefaultView.aspx?id=OP_5F8_3955__000001_CH627HH,0,0,
Asda Opticians,OPT_CH62 3PL,OPT,,WELTON ROAD,CROFT BUSINESS PARK,BROMBOROUGH,,CH62 3PL,Tel: 0151 346 2512, - ,,,No ratings yet Rate it yourself - /Services/opticians/LeaveReview/DefaultView.aspx?id=OPT_CH62 3PL,0,0,
Martin & Kaye Opticians,OP_5HC_14726__000002_L242SE,OPT,19 Penketh Drive,Speke,Liverpool,,,L24 2WZ,Tel: 0151 486 3018, - ,,,No ratings yet Rate it yourself - /Services/opticians/LeaveReview/DefaultView.aspx?id=OP_5HC_14726__000002_L242SE,0,0,
Glasses123,OP_L192PA_29486,OPT,,30 Speke Road,,Liverpool,,L19 2PA,Tel: 0151 494 1121, - ,,,3 ratings Rate it yourself - /Services/opticians/LeaveReview/DefaultView.aspx?id=OP_L192PA_29486,,,
Francis (Opticians) Ltd,OP_5H3_13391__000001_SY148NP,OPT,1 Dobson Court,,Malpas,Cheshire,,SY14 8NP,Tel: 01948 861259, - ,,,No ratings yet Rate it yourself - /Services/opticians/LeaveReview/DefaultView.aspx?id=OP_5H3_13391__000001_SY148NP,0,0,
Asda Stores Ltd,OPT_L24 9WA,OPT,,Hunts Cross Shopping Centre,,Liverpool,,L24 9WA,Tel: 0151 728 4612, - ,,,No ratings yet Rate it yourself - /Services/opticians/LeaveReview/DefaultView.aspx?id=OPT_L24 9WA,0,0,
Boots-Liverpool - Hunts Cross,OP_5HC_723__000001_L249GB,OPT,19 Hunts Cross Centre,"Asda Complex, Speke Hall Road",,Liverpool,Merseyside,L24 9GB,Tel: 0151 448 1992, - ,,,No ratings yet Rate it yourself - /Services/opticians/LeaveReview/DefaultView.aspx?id=OP_5HC_723__000001_L249GB,0,0,
Batty and Dexter Hunts Cross,C2955NL__000003_L249GB,OPT,"Unit M, Hunts Cross Shopping Centre",Hunts Cross,,Liverpool,,L24 9GB,Tel: 01514489620, - ,,,No ratings yet Rate it yourself - /Services/opticians/LeaveReview/DefaultView.aspx?id=C2955NL__000003_L249GB,0,0,
J M Bennett,OP_5HC_13836__000001_L250NN,OPT,281 Speke Road,Woolton,Liverpool,,,L25 0NN,Tel: 0151 486 4121, - ,,,No ratings yet Rate it yourself - /Services/opticians/LeaveReview/DefaultView.aspx?id=OP_5HC_13836__000001_L250NN,0,0,
Ball & Gatehouse Opticians,OP_5F8_8133__000002_CH637PG,OPT,27a Church Road,Bebington,Wirral,Wirral,,CH63 7PG,Tel: 0151 645 3438, - ,,,No ratings yet Rate it yourself - /Services/opticians/LeaveReview/DefaultView.aspx?id=OP_5F8_8133__000002_CH637PG,0,0,
Nightingale Opticians,5J5 839,OPT,,16 Lawnhurst Grove,Aigburth,Liverpool,,L17 6ES,Tel: 0151 494 9375, - ,,,No ratings yet Rate it yourself - /Services/opticians/LeaveReview/DefaultView.aspx?id=5J5 839,0,0,
Specsavers Opticians,OP_5J1_4930__000001_WA72BY,OPT,104 Bridge Walk,Halton Lea,Runcorn,Cheshire,,WA7 2BY,Tel: 01928 716200, - ,,,No ratings yet Rate it yourself - /Services/opticians/LeaveReview/DefaultView.aspx?id=OP_5J1_4930__000001_WA72BY,0,0,
Mullens Opticians,OP_5J1_9152__000002_WA72BX,OPT,98 River Walk,Halton Lea,Runcorn,Cheshire,,WA7 2BX,Tel: 01928 790083, - ,,,No ratings yet Rate it yourself - /Services/opticians/LeaveReview/DefaultView.aspx?id=OP_5J1_9152__000002_WA72BX,0,0,
P & A Morgan Opticians,OP_5J1_3675__000001_WA71NA,OPT,2 Alcock Street,,,Runcorn,Cheshire,WA7 1NA,Tel: 01928 572177, - ,,,1 rating Rate it yourself - /Services/opticians/LeaveReview/DefaultView.aspx?id=OP_5J1_3675__000001_WA71NA,,,
Taylors Opticians,5J1 2583__000002_WA71LX,OPT,33 Church Street,,Runcorn,Cheshire,,WA7 1LX,Tel: 01928 574535, - ,,,No ratings yet Rate it yourself - /Services/opticians/LeaveReview/DefaultView.aspx?id=5J1 2583__000002_WA71LX,0,0,
P K McMullen,OP_5H2_14728__000001_CH625BH,OPT,,162 Bebington Road,Bebington,Wirral,,CH63 7NX,Tel: 0151 644 9550, - ,,,1 rating Rate it yourself - /Services/opticians/LeaveReview/DefaultView.aspx?id=OP_5H2_14728__000001_CH625BH,,,
Price  Opticians,OP_5H2_2112__000001_CH621AB,OPT,87 New Chester Road,New Ferry,Wirral,,,CH62 1AB,Tel: 0151 645 2367, - ,,,1 rating Rate it yourself - /Services/opticians/LeaveReview/DefaultView.aspx?id=OP_5H2_2112__000001_CH621AB,,,
Frederick Howard Opticians,OP_5F8_13831__000002_CH638QT,OPT,108 Teehey Lane,Bebington,,Wirral,,CH63 8QT,Tel: 0151 609 0990, - ,,,2 ratings Rate it yourself - /Services/opticians/LeaveReview/DefaultView.aspx?id=OP_5F8_13831__000002_CH638QT,,,
Julie Hatchell Opticians,OP_5HC_6617__000001_L255JD,OPT,34 Woolton Street,Woolton,Liverpool,,,L25 5JD,Tel: 0151 428 4040, - ,,,4 ratings Rate it yourself - /Services/opticians/LeaveReview/DefaultView.aspx?id=OP_5HC_6617__000001_L255JD,,,
Specs 2 U (MBOS Ltd),OP_WA88TL_29557,OPT,,Unit 7,St Michael's Industrial Estate,Widnes,Cheshire,WA8 8TL,Tel: 0151 420 0007, - ,,,No ratings yet Rate it yourself - /Services/opticians/LeaveReview/DefaultView.aspx?id=OP_WA88TL_29557,0,0,
Harris Opticians,OP_5F8_3453__000001_CH607SE,OPT,,175 -177 Telegraph Road,,Heswall,Merseyside,CH60 7SE,Tel: 0151 342 4130, - ,,,2 ratings Rate it yourself - /Services/opticians/LeaveReview/DefaultView.aspx?id=OP_5F8_3453__000001_CH607SE,,,
Specsavers,TP8L1,OPT,,183 Telegraph Road,,"Heswall, Wirral",,CH60 7SE,, - ,,,No ratings yet Rate it yourself - /Services/opticians/LeaveReview/DefaultView.aspx?id=TP8L1,0,0,
"Eye 2 Eye, (Gartshore Optical Centre)",OP_5F8_5092__000001_CH607SG,OPT,240 Telegraph Road,Heswall,,Wirral,Cheshire,CH60 7SG,Tel: 0151 342 8328, - ,,,5 ratings Rate it yourself - /Services/opticians/LeaveReview/DefaultView.aspx?id=OP_5F8_5092__000001_CH607SG,,,
Mersey Eyecare,OP_5HC_14747__000001_L177BR,OPT,164 Aigburth Road,,Liverpool,,,L17 7BR,Tel: 0151 727 3636, - ,,,3 ratings Rate it yourself - /Services/opticians/LeaveReview/DefaultView.aspx?id=OP_5HC_14747__000001_L177BR,,,
Looking Ahead,OP_5H4_4160__000002_CW83EU,OPT,37 Northwich Road,Weaverham,Nr Northwich,Cheshire,,CW8 3EU,Tel: 01606 853300, - ,,,No ratings yet Rate it yourself - /Services/opticians/LeaveReview/DefaultView.aspx?id=OP_5H4_4160__000002_CW83EU,0,0,
Bennett & Batty,OP_5HA_3785__000002_L182DD,OPT,93 Allerton Road,Mossley Hill,,Liverpool,,L18 2DD,Tel: 0151 724 4144, - ,,,9 ratings Rate it yourself - /Services/opticians/LeaveReview/DefaultView.aspx?id=OP_5HA_3785__000002_L182DD,,,
The Rock Ferry Optical Centre,OP_5H2_1053__000001_CH423XT,OPT,87 Grove Road,Rock Ferry,Birkenhead,,,CH42 3XT,Tel: 0151 645 4273, - ,,,No ratings yet Rate it yourself - /Services/opticians/LeaveReview/DefaultView.aspx?id=OP_5H2_1053__000001_CH423XT,0,0,
Hardmans Opticians,OP_5HA_2532__000001_L81PF,OPT,304 Park Road,Toxteth,Liverpool,,,L8 4QY,Tel: 0151 727 6054, - ,,,No ratings yet Rate it yourself - /Services/opticians/LeaveReview/DefaultView.aspx?id=OP_5HA_2532__000001_L81PF,0,0,
Millican Opticians,OP_5HA_14746__000001_L181LW,OPT,82-84 Allerton Road,,Liverpool,,,L18 1LW,Tel: 0151 734 5005, - ,,,No ratings yet Rate it yourself - /Services/opticians/LeaveReview/DefaultView.aspx?id=OP_5HA_14746__000001_L181LW,0,0,
Frederick Howard Opticians,OP_5F8_8878__000002_CH619PF,OPT,403 Pensby Road,Pensby,Wirral,Merseyside,,CH61 9PF,Tel: 0151 648 1182, - ,,,No ratings yet Rate it yourself - /Services/opticians/LeaveReview/DefaultView.aspx?id=OP_5F8_8878__000002_CH619PF,0,0,
Winsford Eye & Foot Care,OPT_CW72LX_1,OPT,,27 Delamere Street,,Winsford,,CW7 2LX,Tel: 01606 599 030, - ,,,No ratings yet Rate it yourself - /Services/opticians/LeaveReview/DefaultView.aspx?id=OPT_CW72LX_1,0,0,
Billy@Glasses123,OPT_L84UE_1,OPT,,284 Park Road,,Liverpool,,L8 4UE,Tel: 0151 726 0622, - ,,,1 rating Rate it yourself - /Services/opticians/LeaveReview/DefaultView.aspx?id=OPT_L84UE_1,,,
Martin & Kaye,OP_5HA_11513__000002_L84UE,OPT,256 Park Road,Toxteth,Liverpool,,,L8 4UE,Tel: 0151 727 5577, - ,,,No ratings yet Rate it yourself - /Services/opticians/LeaveReview/DefaultView.aspx?id=OP_5HA_11513__000002_L84UE,0,0,
Specsavers Opticians,11912__000001_L154HN,OPT,21/22 Smithdown Place,,Liverpool,,,L15 9EN,Tel: 0151 734 7555, - ,,,No ratings yet Rate it yourself - /Services/opticians/LeaveReview/DefaultView.aspx?id=11912__000001_L154HN,0,0,
Specsavers Belle Vale,C/293/5NL__000001_L252XT,OPT,Unit 3 Belle Vale Shopping Centre,Belle Vale,Liverpool,,,L25 2XT,, - ,,,No ratings yet Rate it yourself - /Services/opticians/LeaveReview/DefaultView.aspx?id=C/293/5NL__000001_L252XT,0,0,
Merton Beck Opticians,OP_5J1_7606__000001_WA86AZ,OPT,39 Widnes Road,,Widnes,,,WA8 6AZ,Tel: 0151 424 2141, - ,,,No ratings yet Rate it yourself - /Services/opticians/LeaveReview/DefaultView.aspx?id=OP_5J1_7606__000001_WA86AZ,0,0,
Tesco Opticians Park Road,1339092017,OPT,,215 Park Road,,Liverpool,,L8 4XF,, - ,,,No ratings yet Rate it yourself - /Services/opticians/LeaveReview/DefaultView.aspx?id=1339092017,0,0,
In-Style Opticians,OP_5HC_3689__000001_L252RQ,OPT,Unit 22,Belle Vale Shopping Centre,Belle Vale,,,L25 2RF,Tel: 0151 487 3713, - ,,,No ratings yet Rate it yourself - /Services/opticians/LeaveReview/DefaultView.aspx?id=OP_5HC_3689__000001_L252RQ,0,0,
John Prebble Opticians,OP_5HC_9800__000001_L252RG,OPT,Unit 21,Belle Vale Shopping Centre,Belle Vale,Liverpool,Merseyside,L25 2RG,Tel: 0151 487 5228, - ,,,12 ratings Rate it yourself - /Services/opticians/LeaveReview/DefaultView.aspx?id=OP_5HC_9800__000001_L252RG,,,
Scrivens Ltd,OP_5J1_10784__000001_WA86JW,OPT,,4,Albert Square,Widnes,Cheshire,WA8 6JW,Tel: 0151 424 3207, - ,,,No ratings yet Rate it yourself - /Services/opticians/LeaveReview/DefaultView.aspx?id=OP_5J1_10784__000001_WA86JW,0,0,
Vision Express (UK) Ltd,OP_5J1_6727__000001_WA86UD,OPT,10  Green Oaks Shopping Centre,Widnes,Cheshire,,,WA8 6UD,Tel: 0151 257 9559, - ,,,No ratings yet Rate it yourself - /Services/opticians/LeaveReview/DefaultView.aspx?id=OP_5J1_6727__000001_WA86UD,0,0,
Specsavers Opticians,OP_5J1_4210__000002_WA86JA,OPT,47 Albert Road,Widnes,Cheshire,,,WA8 6JA,Tel: 0151 495 3040, - ,,,No ratings yet Rate it yourself - /Services/opticians/LeaveReview/DefaultView.aspx?id=OP_5J1_4210__000002_WA86JA,0,0,
Smithdown Eyecare Limited,OP_5HA_14742__000001_L152JT,OPT,Smithdown Eyecare,"188, Smithdown Road",Wavertree,Liverpool,Merseyside,L15 3JT,Tel: 0151 280 7777, - ,,,No ratings yet Rate it yourself - /Services/opticians/LeaveReview/DefaultView.aspx?id=OP_5HA_14742__000001_L152JT,0,0,
i-Care Opticians,OP_5J1_0002__000001_WA86UE,OPT,"Unit G4, Widnes Market Hall",Green Oaks,Bradley Way,Widnes,Cheshire,WA8 6UE,Tel: 0151 4236324, - ,,,1 rating Rate it yourself - /Services/opticians/LeaveReview/DefaultView.aspx?id=OP_5J1_0002__000001_WA86UE,,,
Asda Stores Vision Centre,OP_5HA_14741__000001_L152LS,OPT,Sefton Park,Smithdown Road,,Liverpool,,L15 2LF,Tel: 0151 734 6712, - ,,,No ratings yet Rate it yourself - /Services/opticians/LeaveReview/DefaultView.aspx?id=OP_5HA_14741__000001_L152LS,0,0,
S Wilcox,OP_5HA_13841__000001_L167QQ,OPT,169 Dunbabin Road,Childwall,Childwall,,,L16 7QQ,Tel: 0151 722 1182, - ,,,No ratings yet Rate it yourself - /Services/opticians/LeaveReview/DefaultView.aspx?id=OP_5HA_13841__000001_L167QQ,0,0,
R T Booth & Co Ltd,OP_5H2_6272__000001_CH428PF,OPT,393 Woodchurch Road,Prenton,Birkenhead,,,CH42 8PF,Tel: 0151 608 7870, - ,,,No ratings yet Rate it yourself - /Services/opticians/LeaveReview/DefaultView.aspx?id=OP_5H2_6272__000001_CH428PF,0,0,
Taylors Optometrists,OPT_CW71BP_1,OPT,,4 Dene Drive,,Winsford,,CW7 1BP,Tel: 01606 551 093, - ,,,No ratings yet Rate it yourself - /Services/opticians/LeaveReview/DefaultView.aspx?id=OPT_CW71BP_1,0,0,
L R & E A Taylor,OP_5H4_10968__000002_CW71AE,OPT,,4 Dene Drive,Winsford,Cheshire,,CW7 1BP,Tel: 01606 551093, - ,,,No ratings yet Rate it yourself - /Services/opticians/LeaveReview/DefaultView.aspx?id=OP_5H4_10968__000002_CW71AE,0,0,yes
I R McGarvey Opticians,OP_5H2_9244__000001_CH428PG,OPT,354 Woodchurch Road,Prenton,Birkenhead,,,CH42 8PG,Tel: 0151 608 2823, - ,,,No ratings yet Rate it yourself - /Services/opticians/LeaveReview/DefaultView.aspx?id=OP_5H2_9244__000001_CH428PG,0,0,
Winsford Visionplus Limited,CW7 1AE__000003_CW71AE,OPT,4 Queens Parade,,Winsford,Cheshire,,CW7 1AE,Tel: 01606 541510, - ,,,No ratings yet Rate it yourself - /Services/opticians/LeaveReview/DefaultView.aspx?id=CW7 1AE__000003_CW71AE,0,0,
ASDA opticians,CW71BD041116,OPT,,The drumber,,Winsford,,CW7 1BD,Tel: 01606 596 412, - ,,,No ratings yet Rate it yourself - /Services/opticians/LeaveReview/DefaultView.aspx?id=CW71BD041116,0,0,
A & S Eye Centre,OPT_L150EG_1,OPT,,52 Lawrence Road,,Liverpool,,L15 0EG,Tel: 0151 733 9954, - ,,,1 rating Rate it yourself - /Services/opticians/LeaveReview/DefaultView.aspx?id=OPT_L150EG_1,,,
The Spectacle Centre,4291956__000001_L154LP,OPT,254 Picton Road,,Liverpool,,,L15 4LP,Tel: 0151 734 4486, - ,,,No ratings yet Rate it yourself - /Services/opticians/LeaveReview/DefaultView.aspx?id=4291956__000001_L154LP,0,0,
Bramwells Opticians,OP_5H4_2399__000001_CW72AD,OPT,62 High Street,,Winsford,Cheshire,,CW7 2AD,Tel: 01606 593270, - ,,,No ratings yet Rate it yourself - /Services/opticians/LeaveReview/DefaultView.aspx?id=OP_5H4_2399__000001_CW72AD,0,0,
Specsavers Opticians,OP_5H2_7164__000001_CH412XX,OPT,29 Borough Pavement,Grange Precinct,Birkenhead,,,CH41 2XX,Tel: 0151 650 1666, - ,,,No ratings yet Rate it yourself - /Services/opticians/LeaveReview/DefaultView.aspx?id=OP_5H2_7164__000001_CH412XX,0,0,
Rayner Opticians ,OP_5H2_8427__000001_CH412XZ,OPT,,9 St. Werburghs Square,Grange Precinct,Birkenhead,,CH41 2XZ,Tel: 0151 647 8277, - ,,,No ratings yet Rate it yourself - /Services/opticians/LeaveReview/DefaultView.aspx?id=OP_5H2_8427__000001_CH412XZ,0,0,
Vision Express (UK) Ltd,OP_5H2_323__000002_CH412ZL,OPT,Unit 1,"The Pyramids, Grange Road",Birkenhead,,,CH41 2ZL,Tel: 0151 647 4068, - ,,,No ratings yet Rate it yourself - /Services/opticians/LeaveReview/DefaultView.aspx?id=OP_5H2_323__000002_CH412ZL,0,0,
Boots-Birkenhead,OP_5H2_10569__000001_CH412ZL,OPT,"Unit 21, The Pyramids",,,Birkenhead,Merseyside,CH41 2ZL,Tel: 0151 666 1499, - ,,,No ratings yet Rate it yourself - /Services/opticians/LeaveReview/DefaultView.aspx?id=OP_5H2_10569__000001_CH412ZL,0,0,
"Eye 2 Eye, (Gartshore Optical Centre)",OP_5H2_3393__000002_CH412PH,OPT,231 Grange Road,Birkenhead,,Wirral,Merseyside,CH41 2PH,Tel: 0151 647 3048, - ,,,1 rating Rate it yourself - /Services/opticians/LeaveReview/DefaultView.aspx?id=OP_5H2_3393__000002_CH412PH,,,
I Care Opticians,OPT_CH416EB_1,OPT,i care opticians,254 Grange Road,,Birkenhead,Cheshire,CH41 6EB,Tel: 0151 647 5310, - ,,,No ratings yet Rate it yourself - /Services/opticians/LeaveReview/DefaultView.aspx?id=OPT_CH416EB_1,0,0,
I Care Opticians,OPT_CH416EB_3,OPT,,254 Grange Road,,Birkenhead,,CH41 6EB,, - ,,,No ratings yet Rate it yourself - /Services/opticians/LeaveReview/DefaultView.aspx?id=OPT_CH416EB_3,0,0,
Sinply Opticians,3099K__000002_L360UB,OPT,43 Manor Farm Road,Huyton,Liverpool,,,L36 0UB,Tel: 0151 489 7618, - ,,,No ratings yet Rate it yourself - /Services/opticians/LeaveReview/DefaultView.aspx?id=3099K__000002_L360UB,0,0,
R A Carr,OP_5M5_14750__000001_L31,OPT,Bridgefoot Farm,Hall Lane,Lydiate,,,L41 4LR,Tel: 01704 841315, - ,,,No ratings yet Rate it yourself - /Services/opticians/LeaveReview/DefaultView.aspx?id=OP_5M5_14750__000001_L31,0,0,
BOS Optical,OPT_CW81HH_1,OPT,,79 Chester Road,,Northwich,Cheshire,CW8 1HH,Tel: 01606 782 330, - ,,,1 rating Rate it yourself - /Services/opticians/LeaveReview/DefaultView.aspx?id=OPT_CW81HH_1,,,
Optical Express,OP_L18BU_46580,OPT,"Unit 69, 15 South John Street",,,Liverpool,Merseyside,L1 8BU,Tel: 0800 023 2020, - ,,,1 rating Rate it yourself - /Services/opticians/LeaveReview/DefaultView.aspx?id=OP_L18BU_46580,,,
Specsavers Opticians,OP_5J4_5817__000001_L365SF,OPT,16 Huyton Hey Road,Huyton,Liverpool,,,L36 5RT,Tel: 0151 481 0241, - ,,,No ratings yet Rate it yourself - /Services/opticians/LeaveReview/DefaultView.aspx?id=OP_5J4_5817__000001_L365SF,0,0,
Vision Express (UK) Ltd,OP_5HA_12731__000002_L11QR,OPT,"Unit 3, Tops Plaza",Clayton Square Shopping Centre,Liverpool,,,L1 1QR,Tel: 0151 707 0987, - ,,,No ratings yet Rate it yourself - /Services/opticians/LeaveReview/DefaultView.aspx?id=OP_5HA_12731__000002_L11QR,0,0,
Boots-Liverpool - Clayton SC ,OP_5HA_4722__000003_L11QR,OPT,18 Great Charlotte Street,,,Liverpool,Merseyside,L1 1QR,Tel: 0151 708 5000, - ,,,3 ratings Rate it yourself - /Services/opticians/LeaveReview/DefaultView.aspx?id=OP_5HA_4722__000003_L11QR,,,
Specsavers Opticians,OP_5HA_12271__000001_L21TD,OPT,76-78 Lord Street,,Liverpool,,,L2 1TL,Tel: 0151 709 9180, - ,,,No ratings yet Rate it yourself - /Services/opticians/LeaveReview/DefaultView.aspx?id=OP_5HA_12271__000001_L21TD,0,0,
Boots-Liverpool - Lord St,OP_5HA_5295__000002_L21TD,OPT,62 Lord Street,,Liverpool,Merseyside,,L2 1TD,Tel: 0151 708 7032, - ,,,No ratings yet Rate it yourself - /Services/opticians/LeaveReview/DefaultView.aspx?id=OP_5HA_5295__000002_L21TD,0,0,
Mark Blankstone Opticians,OP_5HA_7954__000001_L29XW,OPT,2a Derby Square,,Liverpool,,,L2 9XW,Tel: 0151 236 5392, - ,,,No ratings yet Rate it yourself - /Services/opticians/LeaveReview/DefaultView.aspx?id=OP_5HA_7954__000001_L29XW,0,0,