Organisation Name,NACS Code,Organisation Type,Address1,Address2,Address3,Address4,Address5,PostCode,Telephone Number,Opening time,Value  (Opening time),Banding Classification  (Opening time),NHS.UK users rating,Value  (NHS.UK users rating),Banding Classification  (NHS.UK users rating),Car parking (Is there car parking at this organisation?)
Bingham & Wilson,OP_5E2_4792__000001_YO84AL,OPT,19 Brook Street,,Selby,,,YO8 4AL,Tel: 01757 703367, - ,,,No ratings yet Rate it yourself - /Services/opticians/LeaveReview/DefaultView.aspx?id=OP_5E2_4792__000001_YO84AL,0,0,
Boots-Selby,OP_5E2_5804__000001_YO80HE,OPT,9 Gowthorpe,,,Selby,North Yorkshire,YO8 4HE,Tel: 01757 701848, - ,,,No ratings yet Rate it yourself - /Services/opticians/LeaveReview/DefaultView.aspx?id=OP_5E2_5804__000001_YO80HE,0,0,
Vision Value Opticians,OP_5E2_10363__000001_YO80ET,OPT,10 Gowthorpe,,Selby,,,YO8 4ET,Tel: 01757 213773, - ,,,No ratings yet Rate it yourself - /Services/opticians/LeaveReview/DefaultView.aspx?id=OP_5E2_10363__000001_YO80ET,0,0,
Selby Specsavers Ltd,OP_5E2_14397__000001_YO84ET,OPT,18/19 Market Place,,,Selby,North Yorkshire,YO8 4PB,Tel: 01757 293050, - ,,,No ratings yet Rate it yourself - /Services/opticians/LeaveReview/DefaultView.aspx?id=OP_5E2_14397__000001_YO84ET,0,0,
Colter Opticians,OP_5E2_6851__000001_YO84DT,OPT,25 Finkle Street,,Selby,,,YO8 4DT,Tel: 01757 705582, - ,,,No ratings yet Rate it yourself - /Services/opticians/LeaveReview/DefaultView.aspx?id=OP_5E2_6851__000001_YO84DT,0,0,
Rayner Opticians ,OP_5E2_10090__000001_YO84EA,OPT,,55 Micklegate,,Selby,North Yorkshire,YO8 4EA,Tel: 01757 702712, - ,,,No ratings yet Rate it yourself - /Services/opticians/LeaveReview/DefaultView.aspx?id=OP_5E2_10090__000001_YO84EA,0,0,
Moorhouse Opticians Ltd,OP_5E2_9496__000001_LS256EB,OPT,5a Finkle Hill,Sherburn In Elmet,Leeds,,,LS25 6EB,Tel: 01977 683166, - ,,,No ratings yet Rate it yourself - /Services/opticians/LeaveReview/DefaultView.aspx?id=OP_5E2_9496__000001_LS256EB,0,0,
Pollard Optics,OP_WF118DH_29559,OPT,Delta House,Delta Business Park,Fernley Green,Knottingley,West Yorkshire,WF11 8DH,Tel: 01977 670787, - ,,,No ratings yet Rate it yourself - /Services/opticians/LeaveReview/DefaultView.aspx?id=OP_WF118DH_29559,0,0,
Ryan Eyecare,WAK068__000001_WF118EB,OPT,17 Hilltop,,Knottingley,Wakefield,,WF11 8EB,Tel: 01924 672949, - ,,,No ratings yet Rate it yourself - /Services/opticians/LeaveReview/DefaultView.aspx?id=WAK068__000001_WF118EB,0,0,
Knottingley Vision Centre,TP9GK,OPT,,11 The Arcade,,Knottingley,,WF11 8EA,, - ,,,No ratings yet Rate it yourself - /Services/opticians/LeaveReview/DefaultView.aspx?id=TP9GK,0,0,
Michael James t/a Garner Opticians,OP_5E3_3141__000001_DN149HE,OPT,11 Market Place,SNAITH,,Goole,,DN14 9HE,Tel: 01405 862364, - ,,,No ratings yet Rate it yourself - /Services/opticians/LeaveReview/DefaultView.aspx?id=OP_5E3_3141__000001_DN149HE,0,0,
Specsavers,OP_5E7_7747__000002_WF81AZ,OPT,Specsavers Opticians,14 Woolmarket,Pontefract,West Yorkshire,,WF8 1AZ,Tel: 01977 602600, - ,,,No ratings yet Rate it yourself - /Services/opticians/LeaveReview/DefaultView.aspx?id=OP_5E7_7747__000002_WF81AZ,0,0,
Boots-Pontefract,OP_5E7_8533__000001_WF81AZ,OPT,15 Woolmarket,,,Pontefract,West Yorkshire,WF8 1AZ,Tel: 01977 795416, - ,,,No ratings yet Rate it yourself - /Services/opticians/LeaveReview/DefaultView.aspx?id=OP_5E7_8533__000001_WF81AZ,0,0,
Smartspec,OP_5E7_14062__000001_WF81AX,OPT,T/A Brosgill Opticians,4 Market Place,Pontefract,,,WF8 1AX,Tel: 01977 780974, - ,,,No ratings yet Rate it yourself - /Services/opticians/LeaveReview/DefaultView.aspx?id=OP_5E7_14062__000001_WF81AX,0,0,
Site for Sore Eyes,OPT_WF81DA_1,OPT,,19 Front Street,,Pontefract,,WF8 1DA,Tel: 01977 599000, - ,,,No ratings yet Rate it yourself - /Services/opticians/LeaveReview/DefaultView.aspx?id=OPT_WF81DA_1,0,0,
Bayfields Opticians,OP_5E7_14061__000001_WF81LY,OPT,32 Ropergate,Pontefract,West Yorkshire,WAKEFIELD,,WF8 1LY,Tel: 01977 702565, - ,,,No ratings yet Rate it yourself - /Services/opticians/LeaveReview/DefaultView.aspx?id=OP_5E7_14061__000001_WF81LY,0,0,
Premier Eyecare (Castleford),O6A8E,OPT,,38b Carlton Street,,Castleford,,WF10 1BA,, - ,,,No ratings yet Rate it yourself - /Services/opticians/LeaveReview/DefaultView.aspx?id=O6A8E,0,0,
VisionCare Optometry,OP_5E7_14038__000001_WF101AG,OPT,19 Sagar Street,Castleford,,West Yorkshire,,WF10 1AG,Tel: 01977 552361, - ,,,No ratings yet Rate it yourself - /Services/opticians/LeaveReview/DefaultView.aspx?id=OP_5E7_14038__000001_WF101AG,0,0,
Moorhouse Opticians Ltd,OP_5E7_12446__000001_WF81JY,OPT,51 Ropergate,,Pontefract,,,WF8 1JY,Tel: 01977 703307, - ,,,No ratings yet Rate it yourself - /Services/opticians/LeaveReview/DefaultView.aspx?id=OP_5E7_12446__000001_WF81JY,0,0,
Visionplus Castleford Ltd,OP_5E7_6209__000001_WF101AH,OPT,T/A Specsavers,54e Carlton Street,Castleford,Wakefield,,WF10 1AH,Tel: 01977 603300, - ,,,No ratings yet Rate it yourself - /Services/opticians/LeaveReview/DefaultView.aspx?id=OP_5E7_6209__000001_WF101AH,0,0,
iVision Opticians,OP_5E7_14039__000001_WF101AF,OPT,,73 Carlton Street,West Yorkshire,Castleford,Yorkshire(West Riding),WF10 1DE,Tel: 01977 552776, - ,,,No ratings yet Rate it yourself - /Services/opticians/LeaveReview/DefaultView.aspx?id=OP_5E7_14039__000001_WF101AF,0,0,
P A Stockton Opticians,OP_5HK_14028__000001_LS257AF,OPT,17 High Street,Kippax,Leeds,,,LS25 7AF,Tel: 0113 286 4488, - ,,,No ratings yet Rate it yourself - /Services/opticians/LeaveReview/DefaultView.aspx?id=OP_5HK_14028__000001_LS257AF,0,0,
Moorhouse Opticians Ltd,OP_5E2_2897__000001_LS249JB,OPT,13 Westgate,,Tadcaster,,,LS24 9JB,Tel: 01937 832257, - ,,,No ratings yet Rate it yourself - /Services/opticians/LeaveReview/DefaultView.aspx?id=OP_5E2_2897__000001_LS249JB,0,0,
Blenkinsop Opticians,OP_5HK_8028__000001_LS251EZ,OPT,8 Main Street,Garforth,Leeds,,,LS25 1EZ,Tel: 0113 286 2909, - ,,,No ratings yet Rate it yourself - /Services/opticians/LeaveReview/DefaultView.aspx?id=OP_5HK_8028__000001_LS251EZ,0,0,
Moorhouse Opticians (Northern) Ltd,OP_5HK_8645__000001_LS251AF,OPT,97 Main Street,Garforth,Leeds,,,LS25 1AF,Tel: 0113 286 9645, - ,,,No ratings yet Rate it yourself - /Services/opticians/LeaveReview/DefaultView.aspx?id=OP_5HK_8645__000001_LS251AF,0,0,
Moorhouse Opticians ,OP_5E7_9743__000002_WF75BE,OPT,19/21 Station Lane,Featherstone,Pontefract,,,WF7 5BE,Tel: 01977 791714, - ,,,No ratings yet Rate it yourself - /Services/opticians/LeaveReview/DefaultView.aspx?id=OP_5E7_9743__000002_WF75BE,0,0,
Moorhouse Opticians (Northern) Ltd,OP_5EL_3727__000001_DN60JA,OPT,16 Station Road,Askern,Doncaster,,,DN6 0JA,Tel: 01302 700425, - ,,,No ratings yet Rate it yourself - /Services/opticians/LeaveReview/DefaultView.aspx?id=OP_5EL_3727__000001_DN60JA,0,0,
Boots Thorpe Park,TP8YR,OPT,Unit 3,The Springs,Thorpe Park Approach,Leeds,,LS15 8GG,Tel: 0113 2648087, - ,,,No ratings yet Rate it yourself - /Services/opticians/LeaveReview/DefaultView.aspx?id=TP8YR,0,0,
Tesco Opticians,OPT_YO241LW_4,OPT,,"Askham Bar, Tadcaster Rd",,York,,YO24 1LW,, - ,,,No ratings yet Rate it yourself - /Services/opticians/LeaveReview/DefaultView.aspx?id=OPT_YO241LW_4,0,0,
Tesco Opticians,OPT_YO241LW_6,OPT,Askham Bar,Tadcaster Rd,,York,,YO24 1LW,Tel: 0345 601 3479, - ,,,No ratings yet Rate it yourself - /Services/opticians/LeaveReview/DefaultView.aspx?id=OPT_YO241LW_6,0,0,
Aldreds Ltd,OP_5E7_5397__000001_WF77HU,OPT,8 Bell Lane,Ackworth,,Pontefract,,WF7 7JA,Tel: 01977 613633, - ,,,No ratings yet Rate it yourself - /Services/opticians/LeaveReview/DefaultView.aspx?id=OP_5E7_5397__000001_WF77HU,0,0,
D G Opticians,OP_5E7_3694__000001_WF62DE,OPT,6 Church Lane,6 Church Lane,,Normanton,,WF6 2DE,Tel: 01924 892077, - ,,,No ratings yet Rate it yourself - /Services/opticians/LeaveReview/DefaultView.aspx?id=OP_5E7_3694__000001_WF62DE,0,0,
Moorhouse Opticians Ltd,OP_5E7_3467__000002_WF62AB,OPT,32 High Street,,Normanton,,,WF6 2AB,Tel: 01924 893202, - ,,,No ratings yet Rate it yourself - /Services/opticians/LeaveReview/DefaultView.aspx?id=OP_5E7_3467__000002_WF62AB,0,0,
Kennet Lahti Optical Glazing Limited,OPT_LS268JQ_2,OPT,The Old Oulton Primary School,Calverley Road,Oulton,Leeds,West Yorkshire,LS26 8JQ,Tel: 0113 288 0005, - ,,,No ratings yet Rate it yourself - /Services/opticians/LeaveReview/DefaultView.aspx?id=OPT_LS268JQ_2,0,0,
Kenett Lahti Optical Glazing Ltd,OPT_LS268JQ_1,OPT,The Old Oulton Primary School,Calverley Road,Oulton,Leeds,West Yorkshire,LS26 8JQ,Tel: 0113 2880005, - ,,,No ratings yet Rate it yourself - /Services/opticians/LeaveReview/DefaultView.aspx?id=OPT_LS268JQ_1,0,0,
Andrew Morgan Optometrist,OP_5HJ_14030__000002_LS236BW,OPT,170 High Street,Boston Spa,Leeds,,,LS23 6BW,Tel: 01937 849933, - ,,,2 ratings Rate it yourself - /Services/opticians/LeaveReview/DefaultView.aspx?id=OP_5HJ_14030__000002_LS236BW,,,
Mr M Young,OP_5HK_14021__000003_LS158BA,OPT,23 Austhorpe Road,Crossgates,Leeds,,,LS15 8BA,Tel: 0113 260 0972, - ,,,No ratings yet Rate it yourself - /Services/opticians/LeaveReview/DefaultView.aspx?id=OP_5HK_14021__000003_LS158BA,0,0,
Specsavers,OP_5HK_7008__000002_LS158ET,OPT,10 Crossgates Centre,Crossgates,Leeds,LEEDS,,LS15 8ET,Tel: 0113 232 8088, - ,,,No ratings yet Rate it yourself - /Services/opticians/LeaveReview/DefaultView.aspx?id=OP_5HK_7008__000002_LS158ET,0,0,
S McNicholas Opticians,OP_5HK_9873__000001_LS158EU,OPT,20 Crossgates Centre,Crossgates,,Leeds,,LS15 8ET,Tel: 0113 2643958, - ,,,No ratings yet Rate it yourself - /Services/opticians/LeaveReview/DefaultView.aspx?id=OP_5HK_9873__000001_LS158EU,0,0,
Blenkinsop Opticians,OP_5E3_12767__000001_DN146BP,OPT,71-73 Pasture Road,,Goole,,,DN14 6BP,Tel: 01405 763439, - ,,,No ratings yet Rate it yourself - /Services/opticians/LeaveReview/DefaultView.aspx?id=OP_5E3_12767__000001_DN146BP,0,0,
Specsavers Opticians,OP_5E3_13041__000001_DN145BT,OPT,68 Boothferry Road,,Goole,E Yorkshire,,DN14 5BT,Tel: 01405 760699, - ,,,No ratings yet Rate it yourself - /Services/opticians/LeaveReview/DefaultView.aspx?id=OP_5E3_13041__000001_DN145BT,0,0,
Michael James,OP_5E3_3140__000001_DN145DE,OPT,28 Boothferry Road,,Goole,,,DN14 5DA,Tel: 01405 761387, - ,,,No ratings yet Rate it yourself - /Services/opticians/LeaveReview/DefaultView.aspx?id=OP_5E3_3140__000001_DN145DE,0,0,
Eye Deal,OP_5E3_13039__000002_DN145DL,OPT,17 Paradise Place,,Goole,E Yorkshire,,DN14 5DL,Tel: 01405 767705, - ,,,No ratings yet Rate it yourself - /Services/opticians/LeaveReview/DefaultView.aspx?id=OP_5E3_13039__000002_DN145DL,0,0,
Tesco Opticians,OP_LS146LU_34680,OPT,,York Road,Seacroft,Leeds,West Yorkshire,LS14 6LU,Tel: 00000000000, - ,,,No ratings yet Rate it yourself - /Services/opticians/LeaveReview/DefaultView.aspx?id=OP_LS146LU_34680,0,0,
Eyesite Opticians,LS15 0LB__000001_LS150LB,OPT,198 Selby Road,Halton,Leeds,West Yorkshire,,LS15 0LB,Tel: 0113 2600063, - ,,,3 ratings Rate it yourself - /Services/opticians/LeaveReview/DefaultView.aspx?id=LS15 0LB__000001_LS150LB,,,
Mrs Marianne C Hick,OP_5HK_2604__000001_LS150DW,OPT,15 Irwin Approach,,Leeds,Leeds,,LS15 0DW,Tel: 01132 606958, - ,,,No ratings yet Rate it yourself - /Services/opticians/LeaveReview/DefaultView.aspx?id=OP_5HK_2604__000001_LS150DW,0,0,
Rae & Rae Opticians,OP_5E2_6184__000001_YO231NA,OPT,33 Bishopthorpe Road,,York,York,,YO23 1NA,Tel: 01904 611553, - ,,,2 ratings Rate it yourself - /Services/opticians/LeaveReview/DefaultView.aspx?id=OP_5E2_6184__000001_YO231NA,,,
Rayner Opticians,OP_5E2_10720__000003_YO244LZ,OPT,,50a York Road,Acomb,York,Yorkshire,YO24 4LZ,Tel: 01904 785233, - ,,,No ratings yet Rate it yourself - /Services/opticians/LeaveReview/DefaultView.aspx?id=OP_5E2_10720__000003_YO244LZ,0,0,
Specsavers Opticians,OPT_WF92SR_1,OPT,,10 Barnsley Road,,South Elmsall,,WF9 2SR,, - ,,,No ratings yet Rate it yourself - /Services/opticians/LeaveReview/DefaultView.aspx?id=OPT_WF92SR_1,0,0,
David Dowley Eyecare Opticians,OP_5E2_13997__000002_YO243BL,OPT,50 York Road,Acomb`,,York,North Yorkshire,YO24 4LZ,Tel: 01904 788811, - ,,,1 rating Rate it yourself - /Services/opticians/LeaveReview/DefaultView.aspx?id=OP_5E2_13997__000002_YO243BL,,,
VisionCare Optometry with Ruth Perrott,OP_5E2_3755__000002_YO244LZ,OPT,30 York Road,Acomb,,York,,YO24 4LZ,Tel: 01904 784040, - ,,,1 rating Rate it yourself - /Services/opticians/LeaveReview/DefaultView.aspx?id=OP_5E2_3755__000002_YO244LZ,,,
D S Webster,OP_5HL_8910__000001_LS260AW,OPT,46a Commercial Street,Rothwell,Leeds,,,LS26 0AW,Tel: 0113 282 7115, - ,,,No ratings yet Rate it yourself - /Services/opticians/LeaveReview/DefaultView.aspx?id=OP_5HL_8910__000001_LS260AW,0,0,
Moorhouse Opticians (Northern) Ltd,OP_5HL_1319__000003_LS260AP,OPT,35 Commercial Street,Rothwell,Leeds,,,LS26 0AP,Tel: 0113 282 3342, - ,,,No ratings yet Rate it yourself - /Services/opticians/LeaveReview/DefaultView.aspx?id=OP_5HL_1319__000003_LS260AP,0,0,
Specsavers,LDS204__000001_LS260AF,OPT,Unit 10 Commercial Street,Rothwell,Leeds,West Yorkshire,,LS26 0AF,, - ,,,No ratings yet Rate it yourself - /Services/opticians/LeaveReview/DefaultView.aspx?id=LDS204__000001_LS260AF,0,0,
Aldreds Opticians,15237__000002_WF92RT,OPT,2 Brookside Street,South Elmsall,Nr Pontefract,,,WF9 2RT,Tel: 01977 649598, - ,,,1 rating Rate it yourself - /Services/opticians/LeaveReview/DefaultView.aspx?id=15237__000002_WF92RT,,,
D. Bank Eyecare,OP_5E7_14037__000001_WF92AA,OPT,55 Barnsley Road,55 Barnsley Road,South Elmsall,South Elmsall,,WF9 2QW,Tel: 01977 642244, - ,,,No ratings yet Rate it yourself - /Services/opticians/LeaveReview/DefaultView.aspx?id=OP_5E7_14037__000001_WF92AA,0,0,
Binnington & Thurling Opticians,OP_5E2_10869__000001_YO16JH,OPT,17 Micklegate,,York,,,YO1 6JH,Tel: 01904 653297, - ,,,No ratings yet Rate it yourself - /Services/opticians/LeaveReview/DefaultView.aspx?id=OP_5E2_10869__000001_YO16JH,0,0,
Specsavers Opticians,OP_5E2_7514__000001_YO19QX,OPT,15 Low Ousegate,,York,,,YO1 9QX,Tel: 01904 655611, - ,,,No ratings yet Rate it yourself - /Services/opticians/LeaveReview/DefaultView.aspx?id=OP_5E2_7514__000001_YO19QX,0,0,
Coverdales Opticians,OP_5E2_7362__000001_YO19TY,OPT,53 Walmgate,,York,,,YO1 9TY,Tel: 01904 631793, - ,,,No ratings yet Rate it yourself - /Services/opticians/LeaveReview/DefaultView.aspx?id=OP_5E2_7362__000001_YO19TY,0,0,
Asda Stores Ltd,OP_5HK_14161__000001_LS146UT,OPT,Killingbeck Drive,York Road,,Killingbeck,,LS14 6UT,Tel: 0113 201 9582, - ,,,No ratings yet Rate it yourself - /Services/opticians/LeaveReview/DefaultView.aspx?id=OP_5HK_14161__000001_LS146UT,0,0,
Boots-York - Coney St,OP_5E2_11218__000002_YO19NH,OPT,43 Coney Street,,York,York,Yorkshire,YO1 9QL,Tel: 01904 642617, - ,,,No ratings yet Rate it yourself - /Services/opticians/LeaveReview/DefaultView.aspx?id=OP_5E2_11218__000002_YO19NH,0,0,
Vision Express (UK) Ltd,OP_5E2_10037__000001_YO18SE,OPT,8-10 Parliament Street,,York,,,YO1 8SE,Tel: 01904 541104, - ,,,No ratings yet Rate it yourself - /Services/opticians/LeaveReview/DefaultView.aspx?id=OP_5E2_10037__000001_YO18SE,0,0,
Viewpoint,OP_5E2_14411__000001_YO18BA,OPT,,9 Feasegate,,York,,YO1 8SH,Tel: 01904 667000, - ,,,1 rating Rate it yourself - /Services/opticians/LeaveReview/DefaultView.aspx?id=OP_5E2_14411__000001_YO18BA,,,
Vision Value Opticians,OP_5E2_4282__000001_YO18SG,OPT,21 Parliament Street,,York,,,YO1 8SG,Tel: 01904 637763, - ,,,No ratings yet Rate it yourself - /Services/opticians/LeaveReview/DefaultView.aspx?id=OP_5E2_4282__000001_YO18SG,0,0,
Optical Express,OP_5E2_13079__000001_YO19NJ,OPT,16 Parliament Street,,,York,North Yorkshire,YO1 8SG,Tel: 0800 023 2020, - ,,,No ratings yet Rate it yourself - /Services/opticians/LeaveReview/DefaultView.aspx?id=OP_5E2_13079__000001_YO19NJ,0,0,
Boots-York - Parliament St,OP_5E2_11397__000001_YO18RS,OPT,22 Parliament Street,,York,North Yorkshire,,YO1 8RS,Tel: 01904 638827, - ,,,1 rating Rate it yourself - /Services/opticians/LeaveReview/DefaultView.aspx?id=OP_5E2_11397__000001_YO18RS,,,
Moorhouse Opticians Ltd,OP_5E7_4957__000002_WF94DP,OPT,4 Highfield Road,Hemsworth,Pontefract,,,WF9 4DP,Tel: 01977 611744, - ,,,No ratings yet Rate it yourself - /Services/opticians/LeaveReview/DefaultView.aspx?id=OP_5E7_4957__000002_WF94DP,0,0,
McCormack Opticians,OP_5E7_11182__000001_WF94AS,OPT,73 Kirkby Road,Hemsworth,Pontefract,,,WF9 4AS,Tel: 01977 613310, - ,,,No ratings yet Rate it yourself - /Services/opticians/LeaveReview/DefaultView.aspx?id=OP_5E7_11182__000001_WF94AS,0,0,
Parkhurst Opticians Ltd,OP_5EK_7517__000001_DN85DG,OPT,8 Finkle Street,Thorne,Doncaster,,,DN8 5DE,Tel: 01405 740095, - ,,,No ratings yet Rate it yourself - /Services/opticians/LeaveReview/DefaultView.aspx?id=OP_5EK_7517__000001_DN85DG,0,0,
Bell Brothers (Opticians) Ltd,OP_5EK_9712__000003_DN85DE,OPT,23 Finkle Street,Thorne,,Doncaster,South Yorkshire,DN8 5DE,Tel: 01405 812209, - ,,,No ratings yet Rate it yourself - /Services/opticians/LeaveReview/DefaultView.aspx?id=OP_5EK_9712__000003_DN85DE,0,0,
South Kirkby Eye-Care Ltd,OPT_WF93AP_1,OPT,,Church View Health Centre,,South Kirkby,,WF9 3AP,Tel: 01977648844, - ,,,No ratings yet Rate it yourself - /Services/opticians/LeaveReview/DefaultView.aspx?id=OPT_WF93AP_1,0,0,
McCormack Opticians,OP_5E7_14749__000001_WF42DG,OPT,Ryecroft Primary Care Centre,Madeley Road,Havercroft,,,WF4 2DG,Tel: 01274 678701, - ,,,No ratings yet Rate it yourself - /Services/opticians/LeaveReview/DefaultView.aspx?id=OP_5E7_14749__000001_WF42DG,0,0,
Specsavers Opticians,OP_5J6_4803__000002_LS226FL,OPT,The Horsefair Centre,,,Wetherby,,LS22 6FL,Tel: 01937 545 370, - ,,,No ratings yet Rate it yourself - /Services/opticians/LeaveReview/DefaultView.aspx?id=OP_5J6_4803__000002_LS226FL,0,0,
Vision Express (UK) Ltd,OP_5HJ_6604__000001_LS224NE,OPT,,25A Market Place,,Wetherby,West Yorkshire,LS22 6LQ,Tel: 01937 581142, - ,,,No ratings yet Rate it yourself - /Services/opticians/LeaveReview/DefaultView.aspx?id=OP_5HJ_6604__000001_LS224NE,0,0,
Boots-Wetherby,LDS194__000004_LS226LQ,OPT,25B Market Place,,,Wetherby,West Yorkshire,LS22 6LQ,Tel: 01937 588635, - ,,,1 rating Rate it yourself - /Services/opticians/LeaveReview/DefaultView.aspx?id=LDS194__000004_LS226LQ,,,
Cameron Beaumont Opticians,CO-5155,OPT,,2-4 North Street,,Wetherby,Yorkshire,LS22 6NN,Tel: 01937 585742, - ,,,No ratings yet Rate it yourself - /Services/opticians/LeaveReview/DefaultView.aspx?id=CO-5155,0,0,
Appleson Optometrists,OP_5HJ_14027__000001_LS226LN,OPT,Appleson Optometrists / Wetherby Eye Clinic,43 Market Place,Wetherby,Leeds,,LS22 6LN,Tel: 01937 583278, - ,,,171 ratings Rate it yourself - /Services/opticians/LeaveReview/DefaultView.aspx?id=OP_5HJ_14027__000001_LS226LN,,,
Mackenzie Shaw Ltd,OP_5HJ_4077__000001_LS224LL,OPT,14 Westgate,,Wetherby,,,LS22 6LL,Tel: 01937 583185, - ,,,1 rating Rate it yourself - /Services/opticians/LeaveReview/DefaultView.aspx?id=OP_5HJ_4077__000001_LS224LL,,,
Maxwell Vites Opticians Ltd,OP_5HK_9482__000001_LS99LN,OPT,204a York Road,,Leeds,,,LS9 9LN,Tel: 0113 248 2232, - ,,,No ratings yet Rate it yourself - /Services/opticians/LeaveReview/DefaultView.aspx?id=OP_5HK_9482__000001_LS99LN,0,0,
Goldwyn Opticians,OP_5HK_5398__000001_LS97BG,OPT,302 Harehills Lane,,,Leeds,,LS9 7BG,Tel: 0113 249 0373, - ,,,No ratings yet Rate it yourself - /Services/opticians/LeaveReview/DefaultView.aspx?id=OP_5HK_5398__000001_LS97BG,0,0,
Simon Falk Eyecare,OP_5HJ_9803__000001_LS82HU,OPT,456 Roundhay Road,Oakwood,,Leeds,West Yorkshire,LS8 2HU,Tel: 0330 9002020, - ,,,2 ratings Rate it yourself - /Services/opticians/LeaveReview/DefaultView.aspx?id=OP_5HJ_9803__000001_LS82HU,,,
Valli Opticians Wakefield ,WAK065__000001_WF12PN,OPT,545 Leeds Road,Outwood,,Wakefield,West Yorkshire,WF1 2PN,Tel: 01924 822102, - ,,,2 ratings Rate it yourself - /Services/opticians/LeaveReview/DefaultView.aspx?id=WAK065__000001_WF12PN,,,
Specsavers - Wakefield Marsh Way,B5H3I,OPT,,"Sainsbury's, Lower Trinity Walk",,Wakefield,,WF1 1QQ,Tel: 01924 668174, - ,,,No ratings yet Rate it yourself - /Services/opticians/LeaveReview/DefaultView.aspx?id=B5H3I,0,0,
Nevies Opticians Ltd,OP_5HK_7067__000002_LS85HR,OPT,1 Harehills Road,,Leeds,,,LS8 5HR,Tel: 0113 249 0952, - ,,,No ratings yet Rate it yourself - /Services/opticians/LeaveReview/DefaultView.aspx?id=OP_5HK_7067__000002_LS85HR,0,0,
J R Morton (Wakefield) Ltd,OP_5E8_4139__000001_WF11QA,OPT,24-25 The Springs,,Wakefield,,,WF1 1QA,Tel: 01924 373117, - ,,,No ratings yet Rate it yourself - /Services/opticians/LeaveReview/DefaultView.aspx?id=OP_5E8_4139__000001_WF11QA,0,0,
Kamal Singh Saimbi,OP_5HK_11681__000003_LS84HS,OPT,T/A Optikaal,271 Roundhay Road,Leeds,,,LS8 4HS,Tel: 0113 248 0020, - ,,,1 rating Rate it yourself - /Services/opticians/LeaveReview/DefaultView.aspx?id=OP_5HK_11681__000003_LS84HS,,,
Eye2Eye Opticians,C/LDS205/5N1__000010_LS84HS,OPT,213 Roundhay Road,,Leeds,West Yorkshire,,LS8 4HS,, - ,,,No ratings yet Rate it yourself - /Services/opticians/LeaveReview/DefaultView.aspx?id=C/LDS205/5N1__000010_LS84HS,0,0,
Vision Express (UK) Ltd,OP_5E8_11386__000001_WF11LB,OPT,Unit G41,Trinity Shopping Centre,Wakefield,Wakefield,,WF1 1QS,Tel: 01924 239760, - ,,,No ratings yet Rate it yourself - /Services/opticians/LeaveReview/DefaultView.aspx?id=OP_5E8_11386__000001_WF11LB,0,0,
Boots-Wakefield - Bishopgate Walk,OP_5E8_8216__000001_WF11YB,OPT,66 Bishopgate Walk,The Ridings Centre,,Wakefield,West Yorkshire,WF1 1YB,Tel: 01924 375844, - ,,,No ratings yet Rate it yourself - /Services/opticians/LeaveReview/DefaultView.aspx?id=OP_5E8_8216__000001_WF11YB,0,0,
Scrivens Opticians,OP_5HL_6602__000002_LS102AP,OPT,"Unit 3, The Penny Hill Centre",Church Street,Hunslet,,,LS10 2AP,Tel: 0113 276 0025, - ,,,No ratings yet Rate it yourself - /Services/opticians/LeaveReview/DefaultView.aspx?id=OP_5HL_6602__000002_LS102AP,0,0,
Boots-Wakefield - Northgate,OP_5E8_13021__000001_WF11HE,OPT,1 Northgate,,,Wakefield,West Yorkshire,WF1 1HE,Tel: 01924 387 411, - ,,,No ratings yet Rate it yourself - /Services/opticians/LeaveReview/DefaultView.aspx?id=OP_5E8_13021__000001_WF11HE,0,0,
Groves Opticians ,OP_5E2_14410__000002_YO304RZ,OPT,Tower Court Health Centre,Oakdale Road,Clifton Moor,,,YO30 4RZ,Tel: 01904 479555, - ,,,No ratings yet Rate it yourself - /Services/opticians/LeaveReview/DefaultView.aspx?id=OP_5E2_14410__000002_YO304RZ,0,0,
Bayfields Opticians,OP_5E8_14033__000001_WF13BX,OPT,73 Northgate,Wakefield,,West Yorkshire,,WF1 3BX,Tel: 01924 374282, - ,,,No ratings yet Rate it yourself - /Services/opticians/LeaveReview/DefaultView.aspx?id=OP_5E8_14033__000001_WF13BX,0,0,
Pollards Optical Clinic,OP_5E8_14034__000001_WF11PQ,OPT,21 Cross Square,Wakefield,,West Yorkshire,,WF1 1PQ,Tel: 01924 373697, - ,,,No ratings yet Rate it yourself - /Services/opticians/LeaveReview/DefaultView.aspx?id=OP_5E8_14034__000001_WF11PQ,0,0,
White Rose Optical,TP5M3,OPT,,11 Westgate,,Wakefield,,WF1 1JZ,, - ,,,No ratings yet Rate it yourself - /Services/opticians/LeaveReview/DefaultView.aspx?id=TP5M3,0,0,
Wakefield Visionplus Ltd,OP_5E8_7021__000001_WF11JY,OPT,Wakefield Visionplus Ltd,"T/A Specsavers, 32 Little Westgate",,Wakefield,,WF1 1JY,Tel: 01924 383500, - ,,,No ratings yet Rate it yourself - /Services/opticians/LeaveReview/DefaultView.aspx?id=OP_5E8_7021__000001_WF11JY,0,0,
Brosgill Opticians,OP_5HL_12901__000001_LS16BE,OPT,,55 Street Lane,Roundhay,Leeds,West Yorkshire,LS8 1AP,Tel: 0113 266 3818, - ,,,No ratings yet Rate it yourself - /Services/opticians/LeaveReview/DefaultView.aspx?id=OP_5HL_12901__000001_LS16BE,0,0,yes
Hunslet Carr Vision Centre,OP_LS102JJ_88838,OPT,,3 Moor Road,,Leeds,,LS10 2JJ,, - ,,,No ratings yet Rate it yourself - /Services/opticians/LeaveReview/DefaultView.aspx?id=OP_LS102JJ_88838,0,0,
Parkhurst Opticians Ltd,OP_5EL_5106__000001_DN50AT,OPT,110 High Street,Bentley,,Doncaster,,DN5 0AT,Tel: 01405 740095, - ,,,1 rating Rate it yourself - /Services/opticians/LeaveReview/DefaultView.aspx?id=OP_5EL_5106__000001_DN50AT,,,