Organisation Name,NACS Code,Organisation Type,Address1,Address2,Address3,Address4,Address5,PostCode,Telephone Number,Opening time,Value  (Opening time),Banding Classification  (Opening time),NHS.UK users rating,Value  (NHS.UK users rating),Banding Classification  (NHS.UK users rating),Car parking (Is there car parking at this organisation?)
J M Bennett,OP_5HC_13836__000001_L250NN,OPT,281 Speke Road,Woolton,Liverpool,,,L25 0NN,Tel: 0151 486 4121, - ,,,No ratings yet Rate it yourself - /Services/opticians/LeaveReview/DefaultView.aspx?id=OP_5HC_13836__000001_L250NN,0,0,
Julie Hatchell Opticians,OP_5HC_6617__000001_L255JD,OPT,34 Woolton Street,Woolton,Liverpool,,,L25 5JD,Tel: 0151 428 4040, - ,,,4 ratings Rate it yourself - /Services/opticians/LeaveReview/DefaultView.aspx?id=OP_5HC_6617__000001_L255JD,,,
Martin & Kaye Opticians,OP_5HC_14726__000002_L242SE,OPT,19 Penketh Drive,Speke,Liverpool,,,L24 2WZ,Tel: 0151 486 3018, - ,,,No ratings yet Rate it yourself - /Services/opticians/LeaveReview/DefaultView.aspx?id=OP_5HC_14726__000002_L242SE,0,0,
John Prebble Opticians,OP_5HC_9800__000001_L252RG,OPT,Unit 21,Belle Vale Shopping Centre,Belle Vale,Liverpool,Merseyside,L25 2RG,Tel: 0151 487 5228, - ,,,12 ratings Rate it yourself - /Services/opticians/LeaveReview/DefaultView.aspx?id=OP_5HC_9800__000001_L252RG,,,
In-Style Opticians,OP_5HC_3689__000001_L252RQ,OPT,Unit 22,Belle Vale Shopping Centre,Belle Vale,,,L25 2RF,Tel: 0151 487 3713, - ,,,No ratings yet Rate it yourself - /Services/opticians/LeaveReview/DefaultView.aspx?id=OP_5HC_3689__000001_L252RQ,0,0,
Boots-Liverpool - Hunts Cross,OP_5HC_723__000001_L249GB,OPT,19 Hunts Cross Centre,"Asda Complex, Speke Hall Road",,Liverpool,Merseyside,L24 9GB,Tel: 0151 448 1992, - ,,,No ratings yet Rate it yourself - /Services/opticians/LeaveReview/DefaultView.aspx?id=OP_5HC_723__000001_L249GB,0,0,
Specsavers Belle Vale,C/293/5NL__000001_L252XT,OPT,Unit 3 Belle Vale Shopping Centre,Belle Vale,Liverpool,,,L25 2XT,, - ,,,No ratings yet Rate it yourself - /Services/opticians/LeaveReview/DefaultView.aspx?id=C/293/5NL__000001_L252XT,0,0,
Batty and Dexter Hunts Cross,C2955NL__000003_L249GB,OPT,"Unit M, Hunts Cross Shopping Centre",Hunts Cross,,Liverpool,,L24 9GB,Tel: 01514489620, - ,,,No ratings yet Rate it yourself - /Services/opticians/LeaveReview/DefaultView.aspx?id=C2955NL__000003_L249GB,0,0,
Asda Stores Ltd,OPT_L24 9WA,OPT,,Hunts Cross Shopping Centre,,Liverpool,,L24 9WA,Tel: 0151 728 4612, - ,,,No ratings yet Rate it yourself - /Services/opticians/LeaveReview/DefaultView.aspx?id=OPT_L24 9WA,0,0,
Sinply Opticians,3099K__000002_L360UB,OPT,43 Manor Farm Road,Huyton,Liverpool,,,L36 0UB,Tel: 0151 489 7618, - ,,,No ratings yet Rate it yourself - /Services/opticians/LeaveReview/DefaultView.aspx?id=3099K__000002_L360UB,0,0,
Specs 2 U (MBOS Ltd),OP_WA88TL_29557,OPT,,Unit 7,St Michael's Industrial Estate,Widnes,Cheshire,WA8 8TL,Tel: 0151 420 0007, - ,,,No ratings yet Rate it yourself - /Services/opticians/LeaveReview/DefaultView.aspx?id=OP_WA88TL_29557,0,0,
Specsavers Opticians,OP_5J4_5817__000001_L365SF,OPT,16 Huyton Hey Road,Huyton,Liverpool,,,L36 5RT,Tel: 0151 481 0241, - ,,,No ratings yet Rate it yourself - /Services/opticians/LeaveReview/DefaultView.aspx?id=OP_5J4_5817__000001_L365SF,0,0,
Millican Opticians,OP_5J4_8614__000002_L369UJ,OPT,,44 Derby Road,Huyton,Liverpool,Merseyside,L36 9UJ,Tel: 0151 489 1845, - ,,,No ratings yet Rate it yourself - /Services/opticians/LeaveReview/DefaultView.aspx?id=OP_5J4_8614__000002_L369UJ,0,0,
ASDA Huyton,2058H__000001_L367TX,OPT,Huyton Lane,,,Huyton,,L36 7TX,Tel: 0151 449 4620, - ,,,1 rating Rate it yourself - /Services/opticians/LeaveReview/DefaultView.aspx?id=2058H__000001_L367TX,,,
Glasses123,OP_L192PA_29486,OPT,,30 Speke Road,,Liverpool,,L19 2PA,Tel: 0151 494 1121, - ,,,3 ratings Rate it yourself - /Services/opticians/LeaveReview/DefaultView.aspx?id=OP_L192PA_29486,,,
S Wilcox,OP_5HA_13841__000001_L167QQ,OPT,169 Dunbabin Road,Childwall,Childwall,,,L16 7QQ,Tel: 0151 722 1182, - ,,,No ratings yet Rate it yourself - /Services/opticians/LeaveReview/DefaultView.aspx?id=OP_5HA_13841__000001_L167QQ,0,0,
Bennett & Batty,OP_5HA_3785__000002_L182DD,OPT,93 Allerton Road,Mossley Hill,,Liverpool,,L18 2DD,Tel: 0151 724 4144, - ,,,9 ratings Rate it yourself - /Services/opticians/LeaveReview/DefaultView.aspx?id=OP_5HA_3785__000002_L182DD,,,
Merton Beck Opticians,OP_5J1_7606__000001_WA86AZ,OPT,39 Widnes Road,,Widnes,,,WA8 6AZ,Tel: 0151 424 2141, - ,,,No ratings yet Rate it yourself - /Services/opticians/LeaveReview/DefaultView.aspx?id=OP_5J1_7606__000001_WA86AZ,0,0,
R D Wilkes (Optometrists) Ltd,OP_5J3_6795__000001_L354LU,OPT,15 Dane Court,Rainhill,Prescot,,,L35 4LU,Tel: 0151 426 2214, - ,,,No ratings yet Rate it yourself - /Services/opticians/LeaveReview/DefaultView.aspx?id=OP_5J3_6795__000001_L354LU,0,0,
Scrivens Ltd,OP_5J1_10784__000001_WA86JW,OPT,,4,Albert Square,Widnes,Cheshire,WA8 6JW,Tel: 0151 424 3207, - ,,,No ratings yet Rate it yourself - /Services/opticians/LeaveReview/DefaultView.aspx?id=OP_5J1_10784__000001_WA86JW,0,0,
Rainhill Designer Spectacles,C/227/5NM__000001_L350LP,OPT,11 Station Street,,Rainhill,Merseyside,,L35 0LP,, - ,,,1 rating Rate it yourself - /Services/opticians/LeaveReview/DefaultView.aspx?id=C/227/5NM__000001_L350LP,,,
Millican Opticians,OP_5HA_14746__000001_L181LW,OPT,82-84 Allerton Road,,Liverpool,,,L18 1LW,Tel: 0151 734 5005, - ,,,No ratings yet Rate it yourself - /Services/opticians/LeaveReview/DefaultView.aspx?id=OP_5HA_14746__000001_L181LW,0,0,
Specsavers Opticians,OP_5J1_4210__000002_WA86JA,OPT,47 Albert Road,Widnes,Cheshire,,,WA8 6JA,Tel: 0151 495 3040, - ,,,No ratings yet Rate it yourself - /Services/opticians/LeaveReview/DefaultView.aspx?id=OP_5J1_4210__000002_WA86JA,0,0,
Vision Express (UK) Ltd,OP_5J1_6727__000001_WA86UD,OPT,10  Green Oaks Shopping Centre,Widnes,Cheshire,,,WA8 6UD,Tel: 0151 257 9559, - ,,,No ratings yet Rate it yourself - /Services/opticians/LeaveReview/DefaultView.aspx?id=OP_5J1_6727__000001_WA86UD,0,0,
i-Care Opticians,OP_5J1_0002__000001_WA86UE,OPT,"Unit G4, Widnes Market Hall",Green Oaks,Bradley Way,Widnes,Cheshire,WA8 6UE,Tel: 0151 4236324, - ,,,1 rating Rate it yourself - /Services/opticians/LeaveReview/DefaultView.aspx?id=OP_5J1_0002__000001_WA86UE,,,
Specsavers Opticians,11912__000001_L154HN,OPT,21/22 Smithdown Place,,Liverpool,,,L15 9EN,Tel: 0151 734 7555, - ,,,No ratings yet Rate it yourself - /Services/opticians/LeaveReview/DefaultView.aspx?id=11912__000001_L154HN,0,0,
Millican Opticians,OP_5J4_5746__000001_L345QA,OPT,29-31 Eccleston Street,Prescot,Merseyside,,,L34 5QA,Tel: 0151 426 6286, - ,,,No ratings yet Rate it yourself - /Services/opticians/LeaveReview/DefaultView.aspx?id=OP_5J4_5746__000001_L345QA,0,0,
Price & Ankers,OP_5J4_9247__000001_L345QP,OPT,2 Leyland Street,Prescot,Merseyside,,,L34 5QP,Tel: 0151 430 9187, - ,,,No ratings yet Rate it yourself - /Services/opticians/LeaveReview/DefaultView.aspx?id=OP_5J4_9247__000001_L345QP,0,0,
Taylors Opticians,5J1 2583__000002_WA71LX,OPT,33 Church Street,,Runcorn,Cheshire,,WA7 1LX,Tel: 01928 574535, - ,,,No ratings yet Rate it yourself - /Services/opticians/LeaveReview/DefaultView.aspx?id=5J1 2583__000002_WA71LX,0,0,
P & A Morgan Opticians,OP_5J1_3675__000001_WA71NA,OPT,2 Alcock Street,,,Runcorn,Cheshire,WA7 1NA,Tel: 01928 572177, - ,,,1 rating Rate it yourself - /Services/opticians/LeaveReview/DefaultView.aspx?id=OP_5J1_3675__000001_WA71NA,,,
Nightingale Opticians,5J5 839,OPT,,16 Lawnhurst Grove,Aigburth,Liverpool,,L17 6ES,Tel: 0151 494 9375, - ,,,No ratings yet Rate it yourself - /Services/opticians/LeaveReview/DefaultView.aspx?id=5J5 839,0,0,
The Spectacle Centre,4291956__000001_L154LP,OPT,254 Picton Road,,Liverpool,,,L15 4LP,Tel: 0151 734 4486, - ,,,No ratings yet Rate it yourself - /Services/opticians/LeaveReview/DefaultView.aspx?id=4291956__000001_L154LP,0,0,
SPECSAVERS OLD SWAN,11912OLSWA__000003_L135XE,OPT,628 Prescot Road,Old Swan,Liverpool,Merseyside,,L13 5XE,Tel: 0151 250 6360, - ,,,1 rating Rate it yourself - /Services/opticians/LeaveReview/DefaultView.aspx?id=11912OLSWA__000003_L135XE,,,
Smithdown Eyecare Limited,OP_5HA_14742__000001_L152JT,OPT,Smithdown Eyecare,"188, Smithdown Road",Wavertree,Liverpool,Merseyside,L15 3JT,Tel: 0151 280 7777, - ,,,No ratings yet Rate it yourself - /Services/opticians/LeaveReview/DefaultView.aspx?id=OP_5HA_14742__000001_L152JT,0,0,
Martin & Kaye Opticians,OP_5HA_262__000001_L135UX,OPT,585 Prescot Road,Old Swan,Liverpool,,,L13 5UX,Tel: 0151 220 6161, - ,,,No ratings yet Rate it yourself - /Services/opticians/LeaveReview/DefaultView.aspx?id=OP_5HA_262__000001_L135UX,0,0,
Millican Opticians,OP_5HA_8976__000002_L135XE,OPT,,589 Prescot Road,Old Swan,Liverpool,,L13 5UX,Tel: 0151 228 8561, - ,,,No ratings yet Rate it yourself - /Services/opticians/LeaveReview/DefaultView.aspx?id=OP_5HA_8976__000002_L135XE,0,0,
Eye Design,OP_L126QX_30293,OPT,,78 Baycliff Road,,Liverpool,,L12 6QX,, - ,,,No ratings yet Rate it yourself - /Services/opticians/LeaveReview/DefaultView.aspx?id=OP_L126QX_30293,0,0,
West Derby Eye Centre,OP_5HA_13837__000002_L126QX,OPT,74 Baycliff Road,West Derby,Liverpool,,,L12 6QX,Tel: 0151 228 6854, - ,,,No ratings yet Rate it yourself - /Services/opticians/LeaveReview/DefaultView.aspx?id=OP_5HA_13837__000002_L126QX,0,0,
Asda Stores Vision Centre,OP_5HA_14741__000001_L152LS,OPT,Sefton Park,Smithdown Road,,Liverpool,,L15 2LF,Tel: 0151 734 6712, - ,,,No ratings yet Rate it yourself - /Services/opticians/LeaveReview/DefaultView.aspx?id=OP_5HA_14741__000001_L152LS,0,0,
A & S Eye Centre,OPT_L150EG_1,OPT,,52 Lawrence Road,,Liverpool,,L15 0EG,Tel: 0151 733 9954, - ,,,1 rating Rate it yourself - /Services/opticians/LeaveReview/DefaultView.aspx?id=OPT_L150EG_1,,,
I CARE OPTICIANS,5NMC385__000003_WA95PE,OPT,i care opticians,128 Thatto Heath Road,Thatto Heath,St.Helens,,WA9 5PE,Tel: 01744 811890, - ,,,3 ratings Rate it yourself - /Services/opticians/LeaveReview/DefaultView.aspx?id=5NMC385__000003_WA95PE,,,yes
Mersey Eyecare,OP_5HC_14747__000001_L177BR,OPT,164 Aigburth Road,,Liverpool,,,L17 7BR,Tel: 0151 727 3636, - ,,,3 ratings Rate it yourself - /Services/opticians/LeaveReview/DefaultView.aspx?id=OP_5HC_14747__000001_L177BR,,,
Eyecall Opticians,OP_5HA_14743__000001_L125HP,OPT,"Unit 3,7/7a Almonds Green Parade",West Derby Village,Liverpool,,,L12 5HP,Tel: 0151 256 6060, - ,,,No ratings yet Rate it yourself - /Services/opticians/LeaveReview/DefaultView.aspx?id=OP_5HA_14743__000001_L125HP,0,0,
Jonathan Kay,OP_5HA_9602__000002_L70LA,OPT,15 Prescot Road,Fairfield,Liverpool,,,L7 0LA,Tel: 0151 263 1100, - ,,,No ratings yet Rate it yourself - /Services/opticians/LeaveReview/DefaultView.aspx?id=OP_5HA_9602__000002_L70LA,0,0,
Specsavers Opticians,OP_5J1_4930__000001_WA72BY,OPT,104 Bridge Walk,Halton Lea,Runcorn,Cheshire,,WA7 2BY,Tel: 01928 716200, - ,,,No ratings yet Rate it yourself - /Services/opticians/LeaveReview/DefaultView.aspx?id=OP_5J1_4930__000001_WA72BY,0,0,
Martin & Kaye,OP_5HA_11516__000001_L138AE,OPT,571 West Derby Road,Old Swan,Liverpool,,,L13 8AE,Tel: 0151 228 1997, - ,,,No ratings yet Rate it yourself - /Services/opticians/LeaveReview/DefaultView.aspx?id=OP_5HA_11516__000001_L138AE,0,0,
Hardmans Opticians,OP_5HA_2532__000001_L81PF,OPT,304 Park Road,Toxteth,Liverpool,,,L8 4QY,Tel: 0151 727 6054, - ,,,No ratings yet Rate it yourself - /Services/opticians/LeaveReview/DefaultView.aspx?id=OP_5HA_2532__000001_L81PF,0,0,
Mullens Opticians,OP_5J1_9152__000002_WA72BX,OPT,98 River Walk,Halton Lea,Runcorn,Cheshire,,WA7 2BX,Tel: 01928 790083, - ,,,No ratings yet Rate it yourself - /Services/opticians/LeaveReview/DefaultView.aspx?id=OP_5J1_9152__000002_WA72BX,0,0,
Martin & Kaye,OP_5HA_11513__000002_L84UE,OPT,256 Park Road,Toxteth,Liverpool,,,L8 4UE,Tel: 0151 727 5577, - ,,,No ratings yet Rate it yourself - /Services/opticians/LeaveReview/DefaultView.aspx?id=OP_5HA_11513__000002_L84UE,0,0,
Billy@Glasses123,OPT_L84UE_1,OPT,,284 Park Road,,Liverpool,,L8 4UE,Tel: 0151 726 0622, - ,,,1 rating Rate it yourself - /Services/opticians/LeaveReview/DefaultView.aspx?id=OPT_L84UE_1,,,
Tesco Opticians Park Road,1339092017,OPT,,215 Park Road,,Liverpool,,L8 4XF,, - ,,,No ratings yet Rate it yourself - /Services/opticians/LeaveReview/DefaultView.aspx?id=1339092017,0,0,
Industrial Eyecare Opticians,OP_WA102PF_46199,OPT,,51-55 Eccleston Street,,St.Helens,,WA10 2PF,, - ,,,No ratings yet Rate it yourself - /Services/opticians/LeaveReview/DefaultView.aspx?id=OP_WA102PF_46199,0,0,
SPECS2U,OPL/01-25762/5NN,OPT,,Unit 21 Evans Business Centre,,Ellesmere Port ,,CH65 1AE,Tel: 0151 3573456, - ,,,No ratings yet Rate it yourself - /Services/opticians/LeaveReview/DefaultView.aspx?id=OPL/01-25762/5NN,0,0,
Specsavers Opticians,OP_5J3_383__000001_WA101NW,OPT,2-4 Bridge Street,St Helens,Merseyside,,,WA10 1NW,Tel: 01744 453 665, - ,,,1 rating Rate it yourself - /Services/opticians/LeaveReview/DefaultView.aspx?id=OP_5J3_383__000001_WA101NW,,,
Vision Express (UK) Ltd,OP_5J3_13090__000002_WA101BN,OPT,6 La Grange Arcade,Church Square Shopping Centre,St Helens,,,WA10 1BN,Tel: 01744 737993, - ,,,No ratings yet Rate it yourself - /Services/opticians/LeaveReview/DefaultView.aspx?id=OP_5J3_13090__000002_WA101BN,0,0,
Boots-St Helens - La Grange Arcade (in Boots UK),OP_5J3_12056__000001_WA10,OPT,La Grange Arcade,24 Church Street,,St Helens,Merseyside,WA10 1BD,Tel: 0174 4751087, - ,,,2 ratings Rate it yourself - /Services/opticians/LeaveReview/DefaultView.aspx?id=OP_5J3_12056__000001_WA10,,,
M E Cook,OP_5H3_13362__000001_WA66PN,OPT,33 Church Street,,Frodsham,Cheshire,,WA6 6PN,Tel: 01928 733609, - ,,,No ratings yet Rate it yourself - /Services/opticians/LeaveReview/DefaultView.aspx?id=OP_5H3_13362__000001_WA66PN,0,0,
Boots-Frodsham,OP_5H3_10421__000001_WA66QW,OPT,32 Church Street,,Frodsham,Cheshire,,WA6 6QW,Tel: 01928 735341, - ,,,No ratings yet Rate it yourself - /Services/opticians/LeaveReview/DefaultView.aspx?id=OP_5H3_10421__000001_WA66QW,0,0,
Batty & Dexter Opticians,OP_5HA_1901__000001_L42RD,OPT,98 Breck Road,Anfield,Liverpool,,,L4 2RD,Tel: 0151 260 4677, - ,,,3 ratings Rate it yourself - /Services/opticians/LeaveReview/DefaultView.aspx?id=OP_5HA_1901__000001_L42RD,,,
Breck road Spectacle Centre,2662509__000001_L56QB,OPT,294 Breck Road,,Liverpool,,,L5 6QB,Tel: 0151 263 4005, - ,,,No ratings yet Rate it yourself - /Services/opticians/LeaveReview/DefaultView.aspx?id=2662509__000001_L56QB,0,0,
Kays Opticians Ltd,OP_5J3_10072__000001_WA101AJ,OPT,95 Church Street,St Helens,Merseyside,,,WA10 1AJ,Tel: 01744 23672, - ,,,No ratings yet Rate it yourself - /Services/opticians/LeaveReview/DefaultView.aspx?id=OP_5J3_10072__000001_WA101AJ,0,0,
R A Carr,OP_5J3_1196__000002_WA101AJ,OPT,101 Church Street,,,St Helens,Merseyside,WA10 1AJ,Tel: 01744 23955, - ,,,No ratings yet Rate it yourself - /Services/opticians/LeaveReview/DefaultView.aspx?id=OP_5J3_1196__000002_WA101AJ,0,0,
Specsavers Opticians,OP_5G9_7432__000001_L111BX,OPT,11-13 Broadway,Norris Green,Liverpool,,,L11 1BX,Tel: 0151 226 6617, - ,,,1 rating Rate it yourself - /Services/opticians/LeaveReview/DefaultView.aspx?id=OP_5G9_7432__000001_L111BX,,,
Robert Glass Opticians t/a Glasses 4 Less,OP_5G9_2452__000001_L111BZ,OPT,25 Broadway,Norris Green,Liverpool,Liverpool,,L11 1BX,Tel: 0151 256 1166, - ,,,No ratings yet Rate it yourself - /Services/opticians/LeaveReview/DefaultView.aspx?id=OP_5G9_2452__000001_L111BZ,0,0,
Norris Green Specsavers Ltd,TP6PA,OPT,,"11-13 Broadway, Norris Green",,Liverpool,,L11 1BX,, - ,,,No ratings yet Rate it yourself - /Services/opticians/LeaveReview/DefaultView.aspx?id=TP6PA,0,0,
Taylor's Opticians,OP_5H3_13914__000001_WA66QS,OPT,4 Eddisbury Square,,Frodsham,Cheshire,Cheshire,WA6 6QS,Tel: 01928 732255, - ,,,No ratings yet Rate it yourself - /Services/opticians/LeaveReview/DefaultView.aspx?id=OP_5H3_13914__000001_WA66QS,0,0,
Prebble Opticians,OP_5G9_4286__000001_L111DQ,OPT,4-8 Utting Avenue East,Norris Green,Liverpool,Liverpool,,L11 1DQ,Tel: 0151 256 1944, - ,,,2 ratings Rate it yourself - /Services/opticians/LeaveReview/DefaultView.aspx?id=OP_5G9_4286__000001_L111DQ,,,
The Spectacle Centre,OP_5J3_13928__000001_WA101AR,OPT,Kiosk 1a,The Hardshaw Centre,,St Helens,,WA10 1EB,Tel: 01744 736665, - ,,,No ratings yet Rate it yourself - /Services/opticians/LeaveReview/DefaultView.aspx?id=OP_5J3_13928__000001_WA101AR,0,0,
J H Gains Opticians,OP_5HA_3381__000002_L56SW,OPT,12 The Mall,Breck Road,Liverpool,,,L5 6SW,Tel: 0151 263 8143, - ,,,No ratings yet Rate it yourself - /Services/opticians/LeaveReview/DefaultView.aspx?id=OP_5HA_3381__000002_L56SW,0,0,
Howards Opticians,OP_5J3_2795__000001_WA102JE,OPT,47 Duke Street,St Helens,Merseyside,,,WA10 2JE,Tel: 01744 24324, - ,,,No ratings yet Rate it yourself - /Services/opticians/LeaveReview/DefaultView.aspx?id=OP_5J3_2795__000001_WA102JE,0,0,
Asda Opticians,OPT_CH62 3PL,OPT,,WELTON ROAD,CROFT BUSINESS PARK,BROMBOROUGH,,CH62 3PL,Tel: 0151 346 2512, - ,,,No ratings yet Rate it yourself - /Services/opticians/LeaveReview/DefaultView.aspx?id=OPT_CH62 3PL,0,0,
Rosenburgh Opticians Ltd,OP_5J2_2525__000004_WA52EY,OPT,15 Honiton Way,Penketh,Warrington,Cheshire,,WA5 2EY,Tel: 01925 724000, - ,,,No ratings yet Rate it yourself - /Services/opticians/LeaveReview/DefaultView.aspx?id=OP_5J2_2525__000004_WA52EY,0,0,
Eyeline,OP_5J3_10510__000002_WA91AD,OPT,77 Higher Parr Street,St Helens,Merseyside,,,WA9 1AD,Tel: 01744 451041, - ,,,No ratings yet Rate it yourself - /Services/opticians/LeaveReview/DefaultView.aspx?id=OP_5J3_10510__000002_WA91AD,0,0,
Boots-Liverpool - Clayton SC ,OP_5HA_4722__000003_L11QR,OPT,18 Great Charlotte Street,,,Liverpool,Merseyside,L1 1QR,Tel: 0151 708 5000, - ,,,3 ratings Rate it yourself - /Services/opticians/LeaveReview/DefaultView.aspx?id=OP_5HA_4722__000003_L11QR,,,
Vision Express (UK) Ltd,OP_5HA_12731__000002_L11QR,OPT,"Unit 3, Tops Plaza",Clayton Square Shopping Centre,Liverpool,,,L1 1QR,Tel: 0151 707 0987, - ,,,No ratings yet Rate it yourself - /Services/opticians/LeaveReview/DefaultView.aspx?id=OP_5HA_12731__000002_L11QR,0,0,
Houghtons Opticians,OP_5F8_3955__000001_CH627HH,OPT,47 Allport Lane Precinct,Bromborough,Wirral,,,CH62 7HH,Tel: 0151 334 2805, - ,,,No ratings yet Rate it yourself - /Services/opticians/LeaveReview/DefaultView.aspx?id=OP_5F8_3955__000001_CH627HH,0,0,
Ellesmere Optical Ltd t/a Orrell Opticians,OP_5H6_10095__000001_CH650AA,OPT,,68 Whitby Road,,Ellesmere Port,Cheshire,CH65 0AA,Tel: 0151 355 1077, - ,,,1 rating Rate it yourself - /Services/opticians/LeaveReview/DefaultView.aspx?id=OP_5H6_10095__000001_CH650AA,,,
Boots-Ellesmere Port,OP_5H6_10570__000001_CH650AL,OPT,33 Marina Drive,,,Ellesmere Port,Cheshire,CH65 0AL,Tel: 0151 357 2464, - ,,,No ratings yet Rate it yourself - /Services/opticians/LeaveReview/DefaultView.aspx?id=OP_5H6_10570__000001_CH650AL,0,0,
Silverberg Opticians,OP_5HA_6726__000002_L16DZ,OPT,40 Whitechapel,,Liverpool,,,L1 6DZ,Tel: 0151 709 2012, - ,,,3 ratings Rate it yourself - /Services/opticians/LeaveReview/DefaultView.aspx?id=OP_5HA_6726__000002_L16DZ,,,
Specsavers Opticians,OP_5HA_12271__000001_L21TD,OPT,76-78 Lord Street,,Liverpool,,,L2 1TL,Tel: 0151 709 9180, - ,,,No ratings yet Rate it yourself - /Services/opticians/LeaveReview/DefaultView.aspx?id=OP_5HA_12271__000001_L21TD,0,0,
Optical Express,OP_L18BU_46580,OPT,"Unit 69, 15 South John Street",,,Liverpool,Merseyside,L1 8BU,Tel: 0800 023 2020, - ,,,1 rating Rate it yourself - /Services/opticians/LeaveReview/DefaultView.aspx?id=OP_L18BU_46580,,,
Ellesmere Port Visionplus Limited,OP_5H6_13343__000001_CH650BH,OPT,15 Marina Walk,Port Arcades,Ellesmere Port,,,CH65 0BH,Tel: 0151 355 3331, - ,,,No ratings yet Rate it yourself - /Services/opticians/LeaveReview/DefaultView.aspx?id=OP_5H6_13343__000001_CH650BH,0,0,
Asda Stores Limited,CH65 0BZ__000001_CH650BZ,OPT,Wellington Road,,Ellesmere Port,Cheshire,,CH65 0BZ,Tel: 0151 348 6120, - ,,,No ratings yet Rate it yourself - /Services/opticians/LeaveReview/DefaultView.aspx?id=CH65 0BZ__000001_CH650BZ,0,0,
Boots-Liverpool - Lord St,OP_5HA_5295__000002_L21TD,OPT,62 Lord Street,,Liverpool,Merseyside,,L2 1TD,Tel: 0151 708 7032, - ,,,No ratings yet Rate it yourself - /Services/opticians/LeaveReview/DefaultView.aspx?id=OP_5HA_5295__000002_L21TD,0,0,
Price  Opticians,OP_5H2_2112__000001_CH621AB,OPT,87 New Chester Road,New Ferry,Wirral,,,CH62 1AB,Tel: 0151 645 2367, - ,,,1 rating Rate it yourself - /Services/opticians/LeaveReview/DefaultView.aspx?id=OP_5H2_2112__000001_CH621AB,,,
Jonny Goggles,OP_5HA_8263__000001_L29QJ,OPT,32 North John Street,,Liverpool,,,L2 9QJ,Tel: 0151 227 3232, - ,,,1 rating Rate it yourself - /Services/opticians/LeaveReview/DefaultView.aspx?id=OP_5HA_8263__000001_L29QJ,,,
Mark Blankstone Opticians,OP_5HA_7954__000001_L29XW,OPT,2a Derby Square,,Liverpool,,,L2 9XW,Tel: 0151 236 5392, - ,,,No ratings yet Rate it yourself - /Services/opticians/LeaveReview/DefaultView.aspx?id=OP_5HA_7954__000001_L29XW,0,0,
The Eyeworks,OP_5F8_11733__000002_CH626BB,OPT,,"128, Allport Road",Bromborough,Wirral,,CH62 6BB,Tel: 0151 343 0044, - ,,,No ratings yet Rate it yourself - /Services/opticians/LeaveReview/DefaultView.aspx?id=OP_5F8_11733__000002_CH626BB,0,0,yes
P K McMullen,OP_5H2_14728__000001_CH625BH,OPT,,162 Bebington Road,Bebington,Wirral,,CH63 7NX,Tel: 0151 644 9550, - ,,,1 rating Rate it yourself - /Services/opticians/LeaveReview/DefaultView.aspx?id=OP_5H2_14728__000001_CH625BH,,,
Ball & Gatehouse Opticians,OP_5F8_8133__000002_CH637PG,OPT,27a Church Road,Bebington,Wirral,Wirral,,CH63 7PG,Tel: 0151 645 3438, - ,,,No ratings yet Rate it yourself - /Services/opticians/LeaveReview/DefaultView.aspx?id=OP_5F8_8133__000002_CH637PG,0,0,
J H Gains Opticians,OP_5G9_3380__000002_L43QH,OPT,10 County Road,Walton,Liverpool,,,L4 3QH,Tel: 0151 525 8833, - ,,,No ratings yet Rate it yourself - /Services/opticians/LeaveReview/DefaultView.aspx?id=OP_5G9_3380__000002_L43QH,0,0,
Store Optical,OP_5G9_3291__000001_L43QA,OPT,33 County Road,Walton,Liverpool,,,L4 3QA,Tel: 0151 524 1945, - ,,,2 ratings Rate it yourself - /Services/opticians/LeaveReview/DefaultView.aspx?id=OP_5G9_3291__000001_L43QA,,,
Costco Wholesale UK Limited,OPT_L37HY_1,OPT,,30 Waterloo Road,,Liverpool,,L3 7HY,Tel: 0151 224 7685, - ,,,No ratings yet Rate it yourself - /Services/opticians/LeaveReview/DefaultView.aspx?id=OPT_L37HY_1,0,0,
The Rock Ferry Optical Centre,OP_5H2_1053__000001_CH423XT,OPT,87 Grove Road,Rock Ferry,Birkenhead,,,CH42 3XT,Tel: 0151 645 4273, - ,,,No ratings yet Rate it yourself - /Services/opticians/LeaveReview/DefaultView.aspx?id=OP_5H2_1053__000001_CH423XT,0,0,
Ellesmere Optical Ltd,OP_5H6_4876__000001_CH663PH,OPT,6 Whetstone Hey,,Great Sutton,Cheshire,,CH66 3PH,Tel: 0151 339 5577, - ,,,No ratings yet Rate it yourself - /Services/opticians/LeaveReview/DefaultView.aspx?id=OP_5H6_4876__000001_CH663PH,0,0,
Healthy Eyes Opticians,OP_5G9_14012__000001_L45PQ,OPT,257 County Road,Walton,Liverpool,,,L4 5PQ,Tel: 0151 523 5004, - ,,,No ratings yet Rate it yourself - /Services/opticians/LeaveReview/DefaultView.aspx?id=OP_5G9_14012__000001_L45PQ,0,0,
Specsavers Opticians,01-20561,OPT,,21 St Chad's Parade,,Kirby,,L32 8RD,Tel: 0151 545 5310, - ,,,No ratings yet Rate it yourself - /Services/opticians/LeaveReview/DefaultView.aspx?id=01-20561,0,0,
Asda Opticians (Westbrook),C/2058/Q44,OPT,,501 Westbrook Centre,,Warrington,,WA5 8UQ,Tel: 01925 646801, - ,,,1 rating Rate it yourself - /Services/opticians/LeaveReview/DefaultView.aspx?id=C/2058/Q44,,,
Rayner Opticians ,OP_5H2_8427__000001_CH412XZ,OPT,,9 St. Werburghs Square,Grange Precinct,Birkenhead,,CH41 2XZ,Tel: 0151 647 8277, - ,,,No ratings yet Rate it yourself - /Services/opticians/LeaveReview/DefaultView.aspx?id=OP_5H2_8427__000001_CH412XZ,0,0,