Organisation Name,NACS Code,Organisation Type,Address1,Address2,Address3,Address4,Address5,PostCode,Telephone Number,Opening time,Value  (Opening time),Banding Classification  (Opening time),NHS.UK users rating,Value  (NHS.UK users rating),Banding Classification  (NHS.UK users rating),Car parking (Is there car parking at this organisation?)
T. J. Woolley,000179__000002_ME72YN,OPT,60 Watling Street,,Gillingham,Kent,,ME7 2YN,Tel: 01634 281291, - ,,,12 ratings Rate it yourself - /Services/opticians/LeaveReview/DefaultView.aspx?id=000179__000002_ME72YN,,,
Vision Express (Chatham),OP_5L3_6149__000002_ME44BG,OPT,199 - 201 High Street,,Chatham,Kent,,ME4 4BG,Tel: 01634 404808, - ,,,1 rating Rate it yourself - /Services/opticians/LeaveReview/DefaultView.aspx?id=OP_5L3_6149__000002_ME44BG,,,
Specsavers (Chatham),OP_5L3_7948__000001_ME44BG,OPT,215 High Street,,Chatham,Kent,,ME4 4BG,Tel: 01634 818555, - ,,,5 ratings Rate it yourself - /Services/opticians/LeaveReview/DefaultView.aspx?id=OP_5L3_7948__000001_ME44BG,,,
Boots-Chatham - Wilmot Sq,OP_5L3_1784__000002_ME44BB,OPT,30-34 Wilmot Square,Pentagon Centre,,Kent,Kent,ME4 4BB,Tel: 01634 828672, - ,,,1 rating Rate it yourself - /Services/opticians/LeaveReview/DefaultView.aspx?id=OP_5L3_1784__000002_ME44BB,,,
Tesco Optician (Gillingham),ME80GX060716,OPT,,Courtney Road,,Gillingham,,ME8 0GX,Tel: 0345 601 3479, - ,,,1 rating Rate it yourself - /Services/opticians/LeaveReview/DefaultView.aspx?id=ME80GX060716,,,
Specsavers (Gillingham),00323__000002_ME71AQ,OPT,137 High Street,,Gillingham,Kent,,ME7 1AQ,Tel: 01634 583350, - ,,,1 rating Rate it yourself - /Services/opticians/LeaveReview/DefaultView.aspx?id=00323__000002_ME71AQ,,,
Vraitch Vision (Walderslade),OPT_ME59LR_1,OPT,,3-4 Thetford House,,Walderslade,,ME5 9LR,Tel: 01634 682595, - ,,,No ratings yet Rate it yourself - /Services/opticians/LeaveReview/DefaultView.aspx?id=OPT_ME59LR_1,0,0,
Vision Express (Gillingham),OPT_ME73PD_1,OPT,,Unit 39 Hempstead Valley Shopping Centre,,Gillingham,,ME7 3PD,Tel: 01634 365661, - ,,,No ratings yet Rate it yourself - /Services/opticians/LeaveReview/DefaultView.aspx?id=OPT_ME73PD_1,0,0,
Leightons Opticians & Hearing Care,OP_5L3_154__000001_ME73PD,OPT,,67 Hempstead Valley Shopping Centre,,Gillingham,Kent,ME7 3PD,Tel: 01634 261311, - ,,,No ratings yet Rate it yourself - /Services/opticians/LeaveReview/DefaultView.aspx?id=OP_5L3_154__000001_ME73PD,0,0,
Asda Stores Limited,OPT_ME7 1RX,OPT,,Pier Road,,Gillingham,,ME7 1RX,Tel: 01732 753131, - ,,,No ratings yet Rate it yourself - /Services/opticians/LeaveReview/DefaultView.aspx?id=OPT_ME7 1RX,0,0,
Patrick Duff Opticians,OP_5L3_2150__000001_ME87HS,OPT,65 High Street,Rainham,Gillingham,Kent,,ME8 7HS,Tel: 01634 231308, - ,,,1 rating Rate it yourself - /Services/opticians/LeaveReview/DefaultView.aspx?id=OP_5L3_2150__000001_ME87HS,,,
John High Opticians (Rainham),OP_5L3_439__000001_ME87PH,OPT,73 High Street,Rainham,Gillingham,Kent,,ME8 7HS,Tel: 01634 233634, - ,,,1 rating Rate it yourself - /Services/opticians/LeaveReview/DefaultView.aspx?id=OP_5L3_439__000001_ME87PH,,,
Boots-Rainham,OP_5L3_7198__000003_ME87HW,OPT,15 Rainham Shopping Centre,Rainham,Gillingham,Kent,,ME8 7HW,Tel: 01634 362738, - ,,,No ratings yet Rate it yourself - /Services/opticians/LeaveReview/DefaultView.aspx?id=OP_5L3_7198__000003_ME87HW,0,0,
Specsavvy Opticians Ltd,TP8FC,OPT,Unit 42,Dockside Shopping Centre,"Maritime Way, St Mary's Island",Chatham,Kent,ME4 3ED,Tel: 01634 891000, - ,,,39 ratings Rate it yourself - /Services/opticians/LeaveReview/DefaultView.aspx?id=TP8FC,,,
Niall O'Kane Optometrists,OP_5L3_10355__000001_ME24AR,OPT,78 - 80 High Street,Strood,Rochester,Kent,,ME2 4AR,Tel: 01634 290178, - ,,,7 ratings Rate it yourself - /Services/opticians/LeaveReview/DefaultView.aspx?id=OP_5L3_10355__000001_ME24AR,,,
Specsavers Opticians,OPT_ME24AR_1,OPT,,58 High Street,,"Strood, Rochester",Kent,ME2 4AR,Tel: 01634 540399, - ,,,No ratings yet Rate it yourself - /Services/opticians/LeaveReview/DefaultView.aspx?id=OPT_ME24AR_1,0,0,
Boots-Strood,OP_5L3_1926__000001_ME24TJ,OPT,117 High Street,,,Strood,Kent,ME2 4TJ,Tel: 01634 718676, - ,,,No ratings yet Rate it yourself - /Services/opticians/LeaveReview/DefaultView.aspx?id=OP_5L3_1926__000001_ME24TJ,0,0,
Sanford Opticians,000281__000001_ME39AA,OPT,7 Main Road,Hoo,Rochester,Kent,,ME3 9AA,Tel: 01634 256565, - ,,,No ratings yet Rate it yourself - /Services/opticians/LeaveReview/DefaultView.aspx?id=000281__000001_ME39AA,0,0,
The Village Optician,OPT_ME65NJ_1,OPT,,4 Holborough Road,,Snodland,,ME6 5NJ,Tel: 01634 240090, - ,,,No ratings yet Rate it yourself - /Services/opticians/LeaveReview/DefaultView.aspx?id=OPT_ME65NJ_1,0,0,
Buchanan Optometrists,OP_5L2_663__000001_ME65AG,OPT,Buchanan House,56 Malling Road,,Snodland,Kent,ME6 5NB,Tel: 01634 757227, - ,,,20 ratings Rate it yourself - /Services/opticians/LeaveReview/DefaultView.aspx?id=OP_5L2_663__000001_ME65AG,,,yes
Eye 2 Eye,OP_5L2_11435__000002_ME160PU,OPT,Mid Kent Shopping Centre,Castle Road,Allington,Maidstone,Kent,ME16 0PU,Tel: 01622 672563, - ,,,4 ratings Rate it yourself - /Services/opticians/LeaveReview/DefaultView.aspx?id=OP_5L2_11435__000002_ME160PU,,,yes
Tesco Optician (Lunsford Park),ME206RJ060716,OPT,,Lunsford Park,,Larkfield,,ME20 6RJ,Tel: 0345 601 3479, - ,,,No ratings yet Rate it yourself - /Services/opticians/LeaveReview/DefaultView.aspx?id=ME206RJ060716,0,0,
Specsavers Opticians,OPT_ME207NA_2,OPT,,Sainsburys Supermarket,"Quarry Wood, Mills road",Aylesford,Kent,ME20 7NA,Tel: 01622 797200, - ,,,No ratings yet Rate it yourself - /Services/opticians/LeaveReview/DefaultView.aspx?id=OPT_ME207NA_2,0,0,
Specsavers (Maidstone),OPT_ME141QS_1,OPT,,21-25 Week Street,,Maidstone,Kent,ME14 1QS,Tel: 01622 663111, - ,,,No ratings yet Rate it yourself - /Services/opticians/LeaveReview/DefaultView.aspx?id=OPT_ME141QS_1,0,0,
Boots-Maidstone - King St,OP_5L2_195__000002_ME141BW,OPT,56-62 King Street,,Kent,Maidstone,,ME14 1BW,Tel: 01622 762337, - ,,,No ratings yet Rate it yourself - /Services/opticians/LeaveReview/DefaultView.aspx?id=OP_5L2_195__000002_ME141BW,0,0,
Bayfields Opticians and Audiologists (Maidstone),I9V4Y,OPT,,6 Pudding Lane,,Maidstone,,ME14 1LN,Tel: 01622 758566, - ,,,No ratings yet Rate it yourself - /Services/opticians/LeaveReview/DefaultView.aspx?id=I9V4Y,0,0,
Vision Express (Maidstone),OP_5L2_6952__000001_ME156AS,OPT,346-348 Dukes Walk,Chequers Centre,Maidstone,Kent,,ME15 6AS,Tel: 01622 678123, - ,,,No ratings yet Rate it yourself - /Services/opticians/LeaveReview/DefaultView.aspx?id=OP_5L2_6952__000001_ME156AS,0,0,
Tinsons ,OP_5L2_760__000001_ME141TG,OPT,9 Middle Row,,Kent,Maidstone,,ME14 1TG,Tel: 01622 686051, - ,,,No ratings yet Rate it yourself - /Services/opticians/LeaveReview/DefaultView.aspx?id=OP_5L2_760__000001_ME141TG,0,0,
William J Wilkinson (Maidstone),OP_5L2_2043__000001_ME156JJ,OPT,50 Gabriels Hill,,Kent,Maidstone,,ME15 6JJ,Tel: 01622 677424, - ,,,No ratings yet Rate it yourself - /Services/opticians/LeaveReview/DefaultView.aspx?id=OP_5L2_2043__000001_ME156JJ,0,0,
Kent Eye Care Ltd,NKCCKNCK,OPT,Kent Eye Care Independent Specialist Optometrists & Opticians,786 London Road,,"Larkfield, Aylesford",Kent,ME20 6BE,Tel: 01732 873378, - ,,,1 rating Rate it yourself - /Services/opticians/LeaveReview/DefaultView.aspx?id=NKCCKNCK,,,no
West Malling Opticians ,OP_5L2_7653__000001_ME196QR,OPT,32 High Street,,Kent,West Malling,,ME19 6QR,Tel: 01732 841403, - ,,,No ratings yet Rate it yourself - /Services/opticians/LeaveReview/DefaultView.aspx?id=OP_5L2_7653__000001_ME196QR,0,0,
John Frewin Opticians (Sittingbourne),OP_5L4_1462__000002_ME104PL,OPT,,114 High Street,,Sittingbourne,,ME10 4PL,Tel: 01795 472550, - ,,,No ratings yet Rate it yourself - /Services/opticians/LeaveReview/DefaultView.aspx?id=OP_5L4_1462__000002_ME104PL,0,0,
Boots Opticians (Sittingbourne),OPT_ME104AJ_1,OPT,,99 High Street,,Sittingbourne,,ME10 4AJ,Tel: 01795 427935, - ,,,No ratings yet Rate it yourself - /Services/opticians/LeaveReview/DefaultView.aspx?id=OPT_ME104AJ_1,0,0,
Specsavers (Sittingbourne),OP_5L4_9722__000001_ME103DL,OPT,,7/8 The Forum,,Sittingbourne,Kent,ME10 3DL,Tel: 01795 436100, - ,,,2 ratings Rate it yourself - /Services/opticians/LeaveReview/DefaultView.aspx?id=OP_5L4_9722__000001_ME103DL,,,
W & K Pope ,OP_5L4_9234__000001_ME104DW,OPT,The Oast Business Centre,Office 4C,62 Bell Road,Sittingbourne,Kent,ME10 4HE,Tel: 01795 470507, - ,,,No ratings yet Rate it yourself - /Services/opticians/LeaveReview/DefaultView.aspx?id=OP_5L4_9234__000001_ME104DW,0,0,
Vision Express (Sittingbourne),OP_5L4_10433__000002_ME104PB,OPT,,38 High Street,,Sittingbourne,,ME10 4PB,Tel: 01795 424149, - ,,,No ratings yet Rate it yourself - /Services/opticians/LeaveReview/DefaultView.aspx?id=OP_5L4_10433__000002_ME104PB,0,0,
John High Opticians (Sittingbourne),OP_5L4_2920__000001_ME104AW,OPT,,73 High Street,,Sittingbourne,,ME10 4AW,Tel: 01795 472525, - ,,,No ratings yet Rate it yourself - /Services/opticians/LeaveReview/DefaultView.aspx?id=OP_5L4_2920__000001_ME104AW,0,0,
Kings Hill Opticians,00325__000001_ME194AU,OPT,Liberty Square,,West Malling,Kent,,ME19 4AU,Tel: 01732 875544, - ,,,17 ratings Rate it yourself - /Services/opticians/LeaveReview/DefaultView.aspx?id=00325__000001_ME194AU,,,
Medical Eye Centre,00314__000001_DA122EB,OPT,14 King Street,,Gravesend,Kent,,DA12 2EB,Tel: 01474 321553, - ,,,No ratings yet Rate it yourself - /Services/opticians/LeaveReview/DefaultView.aspx?id=00314__000001_DA122EB,0,0,
Specsavers (Gravesend),OP_5CM_2356__000001_DA110AU,OPT,19-20 Thamesgate Shopping Centre,,Kent,Gravesend,,DA11 0AU,Tel: 01474 537 878, - ,,,1 rating Rate it yourself - /Services/opticians/LeaveReview/DefaultView.aspx?id=OP_5CM_2356__000001_DA110AU,,,
Boots-Gravesend - Kempthorne St,OP_5CM_416__000002_DA110TA,OPT,9 Kempthorne Street,St Georges Shopping Centre,,Gravsend,Kent,DA11 0TA,Tel: 01474 352911, - ,,,No ratings yet Rate it yourself - /Services/opticians/LeaveReview/DefaultView.aspx?id=OP_5CM_416__000002_DA110TA,0,0,
Asda Opticans (Gravesend),00306__000001_DA110DQ,OPT,Thames Way,,Gravesend,Kent,,DA11 0DQ,Tel: 01474 543 412, - ,,,No ratings yet Rate it yourself - /Services/opticians/LeaveReview/DefaultView.aspx?id=00306__000001_DA110DQ,0,0,
Ewoma Aibangbee,OPT_DA118BZ_1,OPT,,"Gateway Medical Practice, Fleet Health Campus, Vale Road",Northfleet,Gravesend,Kent,DA11 8BZ,Tel: 07591 246595, - ,,,No ratings yet Rate it yourself - /Services/opticians/LeaveReview/DefaultView.aspx?id=OPT_DA118BZ_1,0,0,
K Lewis & Partners,OP_5GQ_9847__000001_RM187QT,OPT,39 - 41 Calcutta Road,,Tilbury,Essex,,RM18 7QT,Tel: 01375 843074, - ,,,No ratings yet Rate it yourself - /Services/opticians/LeaveReview/DefaultView.aspx?id=OP_5GQ_9847__000001_RM187QT,0,0,
Specsavers Opticians (Sheerness),TP925,OPT,,67-69 High Street,,Sheerness,Kent,ME12 1NS,Tel: 01795 414000, - ,,,No ratings yet Rate it yourself - /Services/opticians/LeaveReview/DefaultView.aspx?id=TP925,0,0,
W & K  Pope ,OP_5L4_4276__000002_ME121TX,OPT,,83 High Street,,Sheerness,,ME12 1TX,Tel: 01795 662460, - ,,,No ratings yet Rate it yourself - /Services/opticians/LeaveReview/DefaultView.aspx?id=OP_5L4_4276__000002_ME121TX,0,0,
Rowland Opticians,OP_5CM_2066__000002_DA37QA,OPT,,79 Station Road,Kent,Longfield,,DA3 7QA,Tel: 01474 702125, - ,,,No ratings yet Rate it yourself - /Services/opticians/LeaveReview/DefaultView.aspx?id=OP_5CM_2066__000002_DA37QA,0,0,
Sheppey Eyecare Centre,TP5E7,OPT,,6 Halfway Road,,Sheerness,Kent,ME12 3AU,Tel: 01795 667255, - ,,,1 rating Rate it yourself - /Services/opticians/LeaveReview/DefaultView.aspx?id=TP5E7,,,
John Frewin Opticians (Sheerness),OP_5L4_3360__000001_ME121AB,OPT,,7 Broadway,,Sheerness,,ME12 1AB,Tel: 01795 662818, - ,,,1 rating Rate it yourself - /Services/opticians/LeaveReview/DefaultView.aspx?id=OP_5L4_3360__000001_ME121AB,,,
Castle Opticians,OP_5JP_1560__000001_SS80JP,OPT,164 Long Road,,Canvey Island,Essex,,SS8 0JP,Tel: 01268 514666, - ,,,No ratings yet Rate it yourself - /Services/opticians/LeaveReview/DefaultView.aspx?id=OP_5JP_1560__000001_SS80JP,0,0,
Tyler Goodchild,OP_5JP_4887__000002_SS87AG,OPT,51 Furtherwick Road,,Canvey Island,Essex,,SS8 7AG,Tel: 01268 693532, - ,,,No ratings yet Rate it yourself - /Services/opticians/LeaveReview/DefaultView.aspx?id=OP_5JP_4887__000002_SS87AG,0,0,
Bodys-Optic (part of the Goldsmith Webb Group),OP_5JP_2441__000002_SS87AD,OPT,12 Knightswick Centre,,Canvey Island,Essex,Essex,SS8 7AD,Tel: 01268 683447, - ,,,No ratings yet Rate it yourself - /Services/opticians/LeaveReview/DefaultView.aspx?id=OP_5JP_2441__000002_SS87AD,0,0,yes
Chandler Clarke Opticians,OP_5GQ_4880__000001_RM164BD,OPT,83 Riverview,Chadwell St. Mary,Grays,Essex,,RM16 4BD,Tel: 01375 842103, - ,,,No ratings yet Rate it yourself - /Services/opticians/LeaveReview/DefaultView.aspx?id=OP_5GQ_4880__000001_RM164BD,0,0,
Borough Green Opticians,OP_5FF_10481__000002_TN158BT,OPT,25 High Street,Borough Green,Sevenoaks,Kent,,TN15 8BT,Tel: 01732 884558, - ,,,1 rating Rate it yourself - /Services/opticians/LeaveReview/DefaultView.aspx?id=OP_5FF_10481__000002_TN158BT,,,
Stanford Opticians,OP_5GQ_7872__000001_SS170EX,OPT,6 The Green,,Stanford-le-Hope,Essex,,SS17 0EX,Tel: 01375 672149, - ,,,No ratings yet Rate it yourself - /Services/opticians/LeaveReview/DefaultView.aspx?id=OP_5GQ_7872__000001_SS170EX,0,0,
Goldsmith Webb,OP_5GQ_11951__000001_SS177LY,OPT,8 Grover Walk,Corringham,Stanford-le-Hope,Essex,,SS17 7LY,Tel: 01375 677577, - ,,,No ratings yet Rate it yourself - /Services/opticians/LeaveReview/DefaultView.aspx?id=OP_5GQ_11951__000001_SS177LY,0,0,
Belson & Sons,OP_5GQ_4450__000001_SS177NA,OPT,63 St. Johns Way,Corringham,Stanford-le-Hope,Essex,,SS17 7NA,Tel: 01375 674130, - ,,,No ratings yet Rate it yourself - /Services/opticians/LeaveReview/DefaultView.aspx?id=OP_5GQ_4450__000001_SS177NA,0,0,
Portobello Eyecare Ltd,K8A7B,OPT,,"3 Portobello Parade, Fawkham Road",,"West Kingsdown, Kent",,TN15 6JP,, - ,,,1 rating Rate it yourself - /Services/opticians/LeaveReview/DefaultView.aspx?id=K8A7B,,,
Specsavers,RM17 6QF__000001_RM176QF,OPT,3 The Mall,Grays Shopping Centre,Grays,Essex,,RM17 6QF,Tel: 01375 389740, - ,,,No ratings yet Rate it yourself - /Services/opticians/LeaveReview/DefaultView.aspx?id=RM17 6QF__000001_RM176QF,0,0,
Kennedy Rath Opticians,0111910__000002_RM176QE,OPT,32 The Mall,,Grays,Essex,,RM17 6QE,Tel: 01375 372444, - ,,,No ratings yet Rate it yourself - /Services/opticians/LeaveReview/DefaultView.aspx?id=0111910__000002_RM176QE,0,0,
Euin Steele & Partners,OP_5GQ_587__000001_RM175EH,OPT,58 Orsett Road,,,Grays,,RM17 5EH,Tel: 01375 373000, - ,,,No ratings yet Rate it yourself - /Services/opticians/LeaveReview/DefaultView.aspx?id=OP_5GQ_587__000001_RM175EH,0,0,
Vision Express (Bluewater),OP_5CM_1771__000001_DA99SP,OPT,Unit 14 Upper Rose Gallery,Bluewater,Greenhithe,Kent,,DA9 9SP,Tel: 01322 624814, - ,,,4 ratings Rate it yourself - /Services/opticians/LeaveReview/DefaultView.aspx?id=OP_5CM_1771__000001_DA99SP,,,
Boots-Bluewater Dartford,DA9 9SJ_98372,OPT,,"Unit MSU02, Lower Thames Walk",Bluewater Shopping Centre,Greenhithe,,DA9 9SJ,Tel: 01322624780, - ,,,No ratings yet Rate it yourself - /Services/opticians/LeaveReview/DefaultView.aspx?id=DA9 9SJ_98372,0,0,
Asda Opticians (Greenhithe),00276__000002_DA99RE,OPT,Station Road,,Greenhithe,Kent,,DA9 9RE,Tel: 01322 374162, - ,,,4 ratings Rate it yourself - /Services/opticians/LeaveReview/DefaultView.aspx?id=00276__000002_DA99RE,,,
Boots Opticians (Bluewater),OP_5CM_972__000002_DA99BA,OPT,South Mall,Bluewater Shopping Centre,Greenhithe,Kent,,DA9 9BA,Tel: 01322 623854, - ,,,1 rating Rate it yourself - /Services/opticians/LeaveReview/DefaultView.aspx?id=OP_5CM_972__000002_DA99BA,,,
John Lewis Opticians,OPT_DA99SA_1,OPT,,Bluewater,,Greenhithe,,DA9 9SA,, - ,,,No ratings yet Rate it yourself - /Services/opticians/LeaveReview/DefaultView.aspx?id=OPT_DA99SA_1,0,0,
David Clulow (Bluewater),OP_5CM_10603__000001_DA99SS,OPT,Unit 110 Upper Guild Hall,Bluewater,Greenhithe,Kent,,DA9 9SS,Tel: 01322 624915, - ,,,No ratings yet Rate it yourself - /Services/opticians/LeaveReview/DefaultView.aspx?id=OP_5CM_10603__000001_DA99SS,0,0,
Castle Opticians,OP_5JP_11661__000002_SS75HA,OPT,275 High Road,,Benfleet,Essex,,SS7 5HA,Tel: 01268 792165, - ,,,No ratings yet Rate it yourself - /Services/opticians/LeaveReview/DefaultView.aspx?id=OP_5JP_11661__000002_SS75HA,0,0,
Bodys Opticians (part of Goldsmith Webb Group),OP_5AK_870__000001_SS92BX,OPT,37 Broadway West,,Leigh-on-Sea,Essex,Essex,SS9 2BX,Tel: 01702 710031, - ,,,1 rating Rate it yourself - /Services/opticians/LeaveReview/DefaultView.aspx?id=OP_5AK_870__000001_SS92BX,,,
Broadway Opticians,OP_5AK_4244__000001_SS91AJ,OPT,,30 Broadway,,Leigh-on-Sea,Essex,SS9 1AJ,Tel: 01702 477758, - ,,,No ratings yet Rate it yourself - /Services/opticians/LeaveReview/DefaultView.aspx?id=OP_5AK_4244__000001_SS91AJ,0,0,no
Observatory The Opticians,OP_5AK_14377__000001_SS92HA,OPT,33 Rectory Grove,,,Leigh-on-Sea,Essex,SS9 2HA,Tel: 01702 719335, - ,,,No ratings yet Rate it yourself - /Services/opticians/LeaveReview/DefaultView.aspx?id=OP_5AK_14377__000001_SS92HA,0,0,
Focus on Broadway,01-28534,OPT,,57 Broadway,,Leigh-on-Sea,Essex,SS9 1PE,Tel: 01702 480607, - ,,,No ratings yet Rate it yourself - /Services/opticians/LeaveReview/DefaultView.aspx?id=01-28534,0,0,no
Mr Stuart Alistair Thomas Humfrey,OP_5AK_2951__000001_SS91SJ,OPT,90 Elm Road,,Leigh-on-Sea,Essex,,SS9 1SJ,Tel: 01702 476502, - ,,,No ratings yet Rate it yourself - /Services/opticians/LeaveReview/DefaultView.aspx?id=OP_5AK_2951__000001_SS91SJ,0,0,
E Megafu,OP_5AK_6235__000001_SS92SF,OPT,1536 London Road,,Leigh-on-Sea,Essex,,SS9 2QG,Tel: 01702 472162, - ,,,No ratings yet Rate it yourself - /Services/opticians/LeaveReview/DefaultView.aspx?id=OP_5AK_6235__000001_SS92SF,0,0,
Greens Opticians Ltd,5P1OPH__000002_SS92SW,OPT,1745 London Road,,Leigh On Sea,Essex,,SS9 2SW,Tel: 01702 471077, - ,,,No ratings yet Rate it yourself - /Services/opticians/LeaveReview/DefaultView.aspx?id=5P1OPH__000002_SS92SW,0,0,
Paul Fletcher Opticians,01-9281__000001_SS92UH,OPT,,1346 London Road,,Leigh On  Sea,,SS9 2UH,Tel: 01702 716750, - ,,,1 rating Rate it yourself - /Services/opticians/LeaveReview/DefaultView.aspx?id=01-9281__000001_SS92UH,,,
Forbes Opticians Ltd,OP_5JP_12807__000001_SS72PD,OPT,198 London Road,Hadleigh,Benfleet,Essex,,SS7 2PD,Tel: 01702 555345, - ,,,2 ratings Rate it yourself - /Services/opticians/LeaveReview/DefaultView.aspx?id=OP_5JP_12807__000001_SS72PD,,,
Headcorn Eye Centre,OPT_TN279NH_1,OPT,,25 High Street,,Headcorn,Kent,TN27 9NH,Tel: 01622 890044, - ,,,1 rating Rate it yourself - /Services/opticians/LeaveReview/DefaultView.aspx?id=OPT_TN279NH_1,,,
Scher & Ward,OP_5AK_12730__000001_SS07LN,OPT,130 Hamlet Court Road,,Westcliff-on-Sea,Essex,,SS0 7LN,Tel: 01702 345338, - ,,,No ratings yet Rate it yourself - /Services/opticians/LeaveReview/DefaultView.aspx?id=OP_5AK_12730__000001_SS07LN,0,0,
Specsavers Opticians,OP_5AK_3602__000001_SS12NG,OPT,82 High Street,Southend-on-Sea,Essex,,,SS1 1JH,Tel: 01702 619021, - ,,,No ratings yet Rate it yourself - /Services/opticians/LeaveReview/DefaultView.aspx?id=OP_5AK_3602__000001_SS12NG,0,0,
Marina King Optometrists,OP_5C1_9948__000001_N147HD,OPT,,759 London Road,,Westcliff on Sea,Essex,SS0 9SU,Tel: 01702477989, - ,,,No ratings yet Rate it yourself - /Services/opticians/LeaveReview/DefaultView.aspx?id=OP_5C1_9948__000001_N147HD,0,0,
Morris King,OP_5AK_14379__000002_SS09SU,OPT,759 London Road,,Westcliff-on-Sea,Essex,,SS0 9SU,Tel: 01702 477989, - ,,,No ratings yet Rate it yourself - /Services/opticians/LeaveReview/DefaultView.aspx?id=OP_5AK_14379__000002_SS09SU,0,0,
Tesco Opticians,OP_5GR_12819__000002_SS133JU,OPT,Off Station Lane,Pitsea,Basildon,Essex,,SS13 3JU,Tel: 01268 367438, - ,,,No ratings yet Rate it yourself - /Services/opticians/LeaveReview/DefaultView.aspx?id=OP_5GR_12819__000002_SS133JU,0,0,
Scrivens Opticians,OP_5AK_2539__000001_SS07LJ,OPT,CLOSED,"162, Hamlet Court Road",Westcliff-on-Sea,Westcliff-on-Sea,Essex,SS0 7LJ,Tel: 01214568700, - ,,,No ratings yet Rate it yourself - /Services/opticians/LeaveReview/DefaultView.aspx?id=OP_5AK_2539__000001_SS07LJ,0,0,
Boots-Southend - The Royals,OP_5AK_6072__000002_SS11DE,OPT,"Unit 2, The Royals",,,Southend-On-Sea,Essex,SS1 1DE,Tel: 01702 466346, - ,,,No ratings yet Rate it yourself - /Services/opticians/LeaveReview/DefaultView.aspx?id=OP_5AK_6072__000002_SS11DE,0,0,
Vision Express UK Limited,OP_5AK_14372__000001_SS11DQ,OPT,The Royals Shopping Centre,,Southend-on-Sea,Essex,,SS1 1DQ,Tel: 01702 463434, - ,,,No ratings yet Rate it yourself - /Services/opticians/LeaveReview/DefaultView.aspx?id=OP_5AK_14372__000001_SS11DQ,0,0,
Rose Opticians (Westcliff),B7R6F,OPT,,336 London Road,,Westcliff on Sea,Essex,SS0 7JJ,Tel: 01702 346 828, - ,,,No ratings yet Rate it yourself - /Services/opticians/LeaveReview/DefaultView.aspx?id=B7R6F,0,0,
Optical Express,K5B4X,OPT,40 Lower Level,"Riverbridge House, Anchor Boulevard",,Dartford,Kent,DA2 6SL,Tel: 0800 023 2020, - ,,,No ratings yet Rate it yourself - /Services/opticians/LeaveReview/DefaultView.aspx?id=K5B4X,0,0,
Boots-Southend - High St,OP_5AK_7908__000001_SS11HS,OPT,,59 - 61 High Street,,Southend-On-Sea,Essex,SS1 1HZ,Tel: 01702 337 316, - ,,,2 ratings Rate it yourself - /Services/opticians/LeaveReview/DefaultView.aspx?id=OP_5AK_7908__000001_SS11HS,,,
Peter Jones Opticians,OP_5L2_2643__000001_TN120AY,OPT,5 Church Hill,Staplehurst,Tonbridge,,,TN12 0AX,Tel: 01580 892269, - ,,,No ratings yet Rate it yourself - /Services/opticians/LeaveReview/DefaultView.aspx?id=OP_5L2_2643__000001_TN120AY,0,0,
Costco Wholesale UK Ltd,CO-1833-17,OPT,,West Thurrock Way,,West Thurrock,Essex,RM20 3WY,Tel: 01708 683 085, - ,,,1 rating Rate it yourself - /Services/opticians/LeaveReview/DefaultView.aspx?id=CO-1833-17,,,
Specsavers Opticians,,OPT,,Sainsburys Howard Road,,"Chafford Hundred, Grays",,RM16 6YJ,Tel: 01375 808301, - ,,,N/A - Data not available,,,
Belson & Sons,OP_5GR_2283__000002_SS133AT,OPT,3 Broadway North,Pitsea,Basildon,Essex,,SS13 3AT,Tel: 01268 552030, - ,,,No ratings yet Rate it yourself - /Services/opticians/LeaveReview/DefaultView.aspx?id=OP_5GR_2283__000002_SS133AT,0,0,
Body Opticians Ltd,OP_5AK_407__000001_SS11LT,OPT,25 Queens Road,,Southend-on-Sea,Essex,,SS1 1LT,Tel: 01702 354553, - ,,,No ratings yet Rate it yourself - /Services/opticians/LeaveReview/DefaultView.aspx?id=OP_5AK_407__000001_SS11LT,0,0,
K J Green Opticians,OP_5JP_1025__000002_SS75UH,OPT,135 London Road,,Benfleet,Essex,,SS7 5UH,Tel: 01268 752919, - ,,,No ratings yet Rate it yourself - /Services/opticians/LeaveReview/DefaultView.aspx?id=OP_5JP_1025__000002_SS75UH,0,0,
Williams Optometrists,OP_5JP_12952__000001_SS75TG,OPT,,91 London Road,,Benfleet,Essex,SS7 5TG,Tel: 01268 799999, - ,,,No ratings yet Rate it yourself - /Services/opticians/LeaveReview/DefaultView.aspx?id=OP_5JP_12952__000001_SS75TG,0,0,
Opticial Express,OP_12345_RM20 2ZP,OPT,"Unit 230, Level 2",Lakeside Shopping Centre,,Thurrock,Essex,RM20 2ZP,Tel: 0800 023 2020, - ,,,No ratings yet Rate it yourself - /Services/opticians/LeaveReview/DefaultView.aspx?id=OP_12345_RM20 2ZP,0,0,
Boots Opticians Ltd,OP_5GQ_1340__000001_RM202ZG,OPT,74-75 Thurrock Lakeside Shopping Centre,West Thurrock,Grays,,,RM20 2ZG,Tel: 01708 861534, - ,,,2 ratings Rate it yourself - /Services/opticians/LeaveReview/DefaultView.aspx?id=OP_5GQ_1340__000001_RM202ZG,,,
Vision Express (UK) Ltd,OP_5GQ_13034__000001_RM202ZH,OPT,337 Thurrock Lakeside Shopping Centre,West Thurrock,Grays,,,RM20 2ZH,Tel: 01708 860300, - ,,,No ratings yet Rate it yourself - /Services/opticians/LeaveReview/DefaultView.aspx?id=OP_5GQ_13034__000001_RM202ZH,0,0,
Patrick Duff,OP_5L2_12575__000001_TN126EN,OPT,3 Commercial Road,Paddock Wood,Tonbridge,,,TN12 6EN,Tel: 01892 838608, - ,,,No ratings yet Rate it yourself - /Services/opticians/LeaveReview/DefaultView.aspx?id=OP_5L2_12575__000001_TN126EN,0,0,