Organisation Name,NACS Code,Organisation Type,Address1,Address2,Address3,Address4,Address5,PostCode,Telephone Number,Opening time,Value  (Opening time),Banding Classification  (Opening time),NHS.UK users rating,Value  (NHS.UK users rating),Banding Classification  (NHS.UK users rating),Car parking (Is there car parking at this organisation?)
HENRY MORGAN OPTICIANS,10020__000001_E49LE,OPT,3 Bank Building,The Avenue,London,,,E4 9LE,Tel: 020 8923 1714, - ,,,No ratings yet Rate it yourself - /Services/opticians/LeaveReview/DefaultView.aspx?id=10020__000001_E49LE,0,0,
Homesight UK Ltd,OP_IG89NB_84735,OPT,,261 Hale end road,Woodford Green,London,Greater London,IG8 9NB,Tel: 02085314148, - ,,,1 rating Rate it yourself - /Services/opticians/LeaveReview/DefaultView.aspx?id=OP_IG89NB_84735,,,
C J PACKFORD OPTICIANS,OP_5NC34572__000002_E112RL,OPT,373 High Road,Woodford Green,Essex,,,IG8 0XQ,Tel: 020 8504 2296, - ,,,No ratings yet Rate it yourself - /Services/opticians/LeaveReview/DefaultView.aspx?id=OP_5NC34572__000002_E112RL,0,0,
KENNETH BIRD (OPTICIANS) LTD,OP_5NA45710__000001_E182QS,OPT,144 High Road,South Woodford,London,,,E18 2QS,Tel: 020 8504 8817, - ,,,No ratings yet Rate it yourself - /Services/opticians/LeaveReview/DefaultView.aspx?id=OP_5NA45710__000001_E182QS,0,0,
Rose Optical Services Ltd,106000__000001_E182JP,OPT,42-48 High Street,South Woodford,,London,,E18 2JP,Tel: 0800 731 0031, - ,,,No ratings yet Rate it yourself - /Services/opticians/LeaveReview/DefaultView.aspx?id=106000__000001_E182JP,0,0,
DERMOTT EYECARE,OP_5NC34576__000003_E48LP,OPT,245 Chingford Mount Road,Chingford,,London,,E4 8LP,Tel: 0208 524 3737, - ,,,9 ratings Rate it yourself - /Services/opticians/LeaveReview/DefaultView.aspx?id=OP_5NC34576__000003_E48LP,,,yes
Homecall Optical Services (DOM),5LA_OPT_113__000003_E182QL,OPT,42-48 High Street,,London,,,E18 2QL,Tel: 0208 551 7512, - ,,,No ratings yet Rate it yourself - /Services/opticians/LeaveReview/DefaultView.aspx?id=5LA_OPT_113__000003_E182QL,0,0,
"TUOMINEN, RICKY",10041__000001_IG89AR,OPT,17 Shenfield Road,Woodford Green,Essex,London,,IG8 9AR,Tel: 020 8504 1939, - ,,,No ratings yet Rate it yourself - /Services/opticians/LeaveReview/DefaultView.aspx?id=10041__000001_IG89AR,0,0,
Optom Solutions,10081__000003_IG89AR,OPT,17 Shenfield Road,Woodford Green,Essex,London,,IG8 9AR,Tel: 07968371368, - ,,,No ratings yet Rate it yourself - /Services/opticians/LeaveReview/DefaultView.aspx?id=10081__000003_IG89AR,0,0,
SCRIVENS OPTICIANS,OP_5NC34596__000002_E46SJ,OPT,13 Old Church Road,Chingford,London,London,,E4 6SJ,Tel: 0208 529 8998, - ,,,No ratings yet Rate it yourself - /Services/opticians/LeaveReview/DefaultView.aspx?id=OP_5NC34596__000002_E46SJ,0,0,
SPECSAVERS OPTICIANS,OP_5NC34600__000003_E48DD,OPT,26 Old Church Road,Chingford,London,,,E4 8DD,Tel: 0208 506 3780, - ,,,No ratings yet Rate it yourself - /Services/opticians/LeaveReview/DefaultView.aspx?id=OP_5NC34600__000003_E48DD,0,0,
E 4 EYES,OP_5NC34578__000001_E48DD,OPT,12 Old Church Road,Chingford,London,,,E4 8DD,Tel: 020 8529 1838, - ,,,No ratings yet Rate it yourself - /Services/opticians/LeaveReview/DefaultView.aspx?id=OP_5NC34578__000001_E48DD,0,0,
F & YM HYBEL,OP_5NC34582__000001_E173LX,OPT,153 Wood Street,Walthamstow,London,,,E17 3LX,Tel: 020 8520 3769, - ,,,No ratings yet Rate it yourself - /Services/opticians/LeaveReview/DefaultView.aspx?id=OP_5NC34582__000001_E173LX,0,0,
KENNETH BIRD LTD,OP_5NC34583__000001_E48BX,OPT,94 Old Church Road,Chingford,London,,,E4 8BX,Tel: 020 8529 4878, - ,,,No ratings yet Rate it yourself - /Services/opticians/LeaveReview/DefaultView.aspx?id=OP_5NC34583__000001_E48BX,0,0,
Bayfields Opticians and Audiologists (South Woodford),M1O9B,OPT,,135a George Lane,,South Woodford,,E18 1AN,Tel: 0208 9891996, - ,,,No ratings yet Rate it yourself - /Services/opticians/LeaveReview/DefaultView.aspx?id=M1O9B,0,0,
Care Optics,01-15072-1,OPT,,14 The Broadway,,London,,IG8 0HL,, - ,,,1 rating Rate it yourself - /Services/opticians/LeaveReview/DefaultView.aspx?id=01-15072-1,,,yes
Scher and Lasky Opticians,10080__000005_IG87QF,OPT,4 Jubilee Parade,Snakes Lane East,Woodford Green,Essex,,IG8 7QF,Tel: 020 8504 9243, - ,,,No ratings yet Rate it yourself - /Services/opticians/LeaveReview/DefaultView.aspx?id=10080__000005_IG87QF,0,0,
Costco Wholesale UK Ltd,CO-1833-7,OPT,,1 Shadbolt Avenue,Off Harbet Road,Chingford,,E4 8GP,Tel: 020 8501 9315, - ,,,No ratings yet Rate it yourself - /Services/opticians/LeaveReview/DefaultView.aspx?id=CO-1833-7,0,0,
SCRIVENS,OP_5NC34585__000001_E173AY,OPT,212 Hoe Street,,London,Walthamstow,,E17 3AY,Tel: 0208 520 3079, - ,,,No ratings yet Rate it yourself - /Services/opticians/LeaveReview/DefaultView.aspx?id=OP_5NC34585__000001_E173AY,0,0,
SPECSAVERS{WALTHAMSTOW}LTD,OP_5NC34601__000001_E177BH,OPT,203 High Street,Walthamstow,London,,,E17 7BH,Tel: 020 8520 7200, - ,,,9 ratings Rate it yourself - /Services/opticians/LeaveReview/DefaultView.aspx?id=OP_5NC34601__000001_E177BH,,,
Eye Fashions,L2H8W,OPT,,7 Palace Parade High Street,,Walthamstow,Greater London,E17 7BU,Tel: 02085205535, - ,,,No ratings yet Rate it yourself - /Services/opticians/LeaveReview/DefaultView.aspx?id=L2H8W,0,0,
VICKERY & UTTERIDGE LTD,OP_5NC34603__000001_E46AG,OPT,20 Station Road,Chingford,,London,Greater London,E4 7BE,Tel: 020 8529 1703, - ,,,No ratings yet Rate it yourself - /Services/opticians/LeaveReview/DefaultView.aspx?id=OP_5NC34603__000001_E46AG,0,0,
Boots-Walthamstow,OP_5NC34577__000003_E177JR,OPT,2 Selbourne Walk,Town Centre Shopping Precinct.,,Walthamstow,,E17 7JR,Tel: 0208 509 3204, - ,,,No ratings yet Rate it yourself - /Services/opticians/LeaveReview/DefaultView.aspx?id=OP_5NC34577__000003_E177JR,0,0,
NEW ERA OPTICAL,OP_5NC34586__000002_E177JY,OPT,114 High Street,Walthamstow,London,,,E17 7JY,Tel: 020 8509 1935, - ,,,No ratings yet Rate it yourself - /Services/opticians/LeaveReview/DefaultView.aspx?id=OP_5NC34586__000002_E177JY,0,0,
McANDREW OPTICIANS,OP_5NC34567__000001_E177JY,OPT,114b High Street,Walthamstow,London,,,E17 7JY,Tel: 020 8509 1935, - ,,,No ratings yet Rate it yourself - /Services/opticians/LeaveReview/DefaultView.aspx?id=OP_5NC34567__000001_E177JY,0,0,
HD Jameson & Associates,OP_5AJ_13309__000001_IG96LN,OPT,46 Station Way,,Buckhurst Hill,Essex,,IG9 6LN,Tel: 0208 504 4830, - ,,,No ratings yet Rate it yourself - /Services/opticians/LeaveReview/DefaultView.aspx?id=OP_5AJ_13309__000001_IG96LN,0,0,
Scrivens Opticians,OP_5NC34594__000001_E106AJ,OPT,583 Lea Bridge Road,Leyton,London,London,,E10 6AJ,Tel: 020 8509 2467, - ,,,1 rating Rate it yourself - /Services/opticians/LeaveReview/DefaultView.aspx?id=OP_5NC34594__000001_E106AJ,,,
PHILIPS OPTICIAL WORLD,OP_5NC34568__000004_E179AP,OPT,405 Hoe Street,Walthamstow,London,,,E17 9AP,Tel: 020 8520 5278, - ,,,No ratings yet Rate it yourself - /Services/opticians/LeaveReview/DefaultView.aspx?id=OP_5NC34568__000004_E179AP,0,0,
Visionwise Opticians,OP_5NC34602__000001_E177BX,OPT,,27 High Street,London,Walthamstow,,E17 7AD,Tel: 020 8520 4105, - ,,,2 ratings Rate it yourself - /Services/opticians/LeaveReview/DefaultView.aspx?id=OP_5NC34602__000001_E177BX,,,
Tesco Opticians,C/OL2453__000002_N183HF,OPT,Tesco Pharmacy,1 Glover Drive,Upper Edmonton,London,,N18 3HF,Tel: 0345 677 9691, - ,,,No ratings yet Rate it yourself - /Services/opticians/LeaveReview/DefaultView.aspx?id=C/OL2453__000002_N183HF,0,0,
OPTICAL WORLD,OP_5NC34589__000003_E107AA,OPT,853 High Road,Leyton,London,,,E10 7AA,Tel: 0208 539 9722, - ,,,No ratings yet Rate it yourself - /Services/opticians/LeaveReview/DefaultView.aspx?id=OP_5NC34589__000003_E107AA,0,0,
JAMES SCOTT OPTICIANS LTD,OP_5NA45709__000001_IG88AJ,OPT,637a Chigwell Road,Woodford Bridge,London,,,IG8 8AJ,Tel: 020 8504 3292, - ,,,No ratings yet Rate it yourself - /Services/opticians/LeaveReview/DefaultView.aspx?id=OP_5NA45709__000001_IG88AJ,0,0,
Queens Road Opticians,OP_5AJ_5829__000001_IG95BU,OPT,55 Queens Road,,Buckhurst Hill,Essex,,IG9 5BU,Tel: 020 8504 5175, - ,,,2 ratings Rate it yourself - /Services/opticians/LeaveReview/DefaultView.aspx?id=OP_5AJ_5829__000001_IG95BU,,,
PATEL OPTICIANS,10100__000002_E111EA,OPT,49 Hainault Road,Leytonstone,London,,,E11 1EA,Tel: 020 8539 2535, - ,,,No ratings yet Rate it yourself - /Services/opticians/LeaveReview/DefaultView.aspx?id=10100__000002_E111EA,0,0,
Wanstead Opticians,OP_5NA45690__000001_E112LR,OPT,T/A C W Dixey and Son Ltd,127 High Street Wanstead,London,London,,E11 2LR,Tel: 020 8989-3327, - ,,,3 ratings Rate it yourself - /Services/opticians/LeaveReview/DefaultView.aspx?id=OP_5NA45690__000001_E112LR,,,
Specsavers Opticians,F85A120__000001_N90EJ,OPT,20 North Mall,Edmonton,London,London,,N9 0EJ,Tel: 020 8887 1300, - ,,,No ratings yet Rate it yourself - /Services/opticians/LeaveReview/DefaultView.aspx?id=F85A120__000001_N90EJ,0,0,
Budget Eyewear Ltd,OL/2455-5C1__000001_N90QU,OPT,11 South Mall,Edmonton Green Shopping Centre,Edmonton,,,N9 0QU,, - ,,,No ratings yet Rate it yourself - /Services/opticians/LeaveReview/DefaultView.aspx?id=OL/2455-5C1__000001_N90QU,0,0,
Scher & Marks,OP_5C1_2857__000001_N90EH,OPT,29 North Mall,Edmonton,,london,,N9 0EQ,Tel: 020 8807 2113, - ,,,7 ratings Rate it yourself - /Services/opticians/LeaveReview/DefaultView.aspx?id=OP_5C1_2857__000001_N90EH,,,
The Angel Opticians,OP_5C1_13557__000001_N182ND,OPT,188 Upper Fore Street,Edmonton,London	,,,N18 2JB,Tel: 0208 8078445, - ,,,No ratings yet Rate it yourself - /Services/opticians/LeaveReview/DefaultView.aspx?id=OP_5C1_13557__000001_N182ND,0,0,
Infocus Eye Care,OP_5C1_2928__000001_N182TW,OPT,89 Fore Street,Edmonton,London,Middx,,N18 2TW,Tel: 020 8807 2981, - ,,,No ratings yet Rate it yourself - /Services/opticians/LeaveReview/DefaultView.aspx?id=OP_5C1_2928__000001_N182TW,0,0,
Alfred Jay Opticians,OP_5C1_3426__000001_N90TY,OPT,5 The Concourse,Edmonton Green Shopping Centre,London,Edmonton Green,,N9 0TY,Tel: 020 8884 3870, - ,,,No ratings yet Rate it yourself - /Services/opticians/LeaveReview/DefaultView.aspx?id=OP_5C1_3426__000001_N90TY,0,0,
Eyes on Call,OP_N182UP_29653,OPT,,35 Park Avenue,,Edmonton,,N18 2UP,Tel: 0800 047 0425, - ,,,No ratings yet Rate it yourself - /Services/opticians/LeaveReview/DefaultView.aspx?id=OP_N182UP_29653,0,0,
D H Burns,OP_5C9_1611__000001_N170EY,OPT,830 High Road,Tottenham,London,,,N17 0EY,Tel: 020 8808 7910, - ,,,No ratings yet Rate it yourself - /Services/opticians/LeaveReview/DefaultView.aspx?id=OP_5C9_1611__000001_N170EY,0,0,
The Eye Pod,TP0YX,OPT,,560-568 High Road,,Tottenham,,N17 9TA,, - ,,,No ratings yet Rate it yourself - /Services/opticians/LeaveReview/DefaultView.aspx?id=TP0YX,0,0,
M.D. Cooper,OP_5C1_6138__000002_N99DP,OPT,1 Keats Parade,Church Street,London,Middx,,N9 9DP,Tel: 020 8807 5664, - ,,,No ratings yet Rate it yourself - /Services/opticians/LeaveReview/DefaultView.aspx?id=OP_5C1_6138__000002_N99DP,0,0,
Hammonds Eye Practice,OP_5C9_1617__000001_N179SY,OPT,,546 HIGH ROAD,BRUCE GROVE,LONDON,Greater London,N17 9SY,Tel: 020 8808 3327, - ,,,3 ratings Rate it yourself - /Services/opticians/LeaveReview/DefaultView.aspx?id=OP_5C9_1617__000001_N179SY,,,
Scrivens Opticians,E10 5PW_56347,OPT,,262 High Road,,London,,E10 5PW,Tel: 0208 5396784, - ,,,No ratings yet Rate it yourself - /Services/opticians/LeaveReview/DefaultView.aspx?id=E10 5PW_56347,0,0,
 Specsavers Opticians Tottenham,5C9_2332_N17 9SX,OPT,,"514 High Road, London, N17 9SX",,Tottenham,,N17 9SX,, - ,,,No ratings yet Rate it yourself - /Services/opticians/LeaveReview/DefaultView.aspx?id=5C9_2332_N17 9SX,0,0,
ROSE OPTOMETRISTS,OP_5NA45716__000010_IG26JZ,OPT,583 Cranbrook Road,Gants Hill,London,,,IG2 6JZ,Tel: 020 8551 5353, - ,,,No ratings yet Rate it yourself - /Services/opticians/LeaveReview/DefaultView.aspx?id=OP_5NA45716__000010_IG26JZ,0,0,
ROSE OPTICAL SERVICE,10079__000004_IG26JU,OPT,48/50 Wayside Mews,,Ilford,,,IG2 6JU,Tel: 020 8551 7512, - ,,,No ratings yet Rate it yourself - /Services/opticians/LeaveReview/DefaultView.aspx?id=10079__000004_IG26JU,0,0,
ASDA WALLMART VISION CENTRE,OP_5NC34571__000002_E105NH,OPT,1 Leyton Mill 1 Marshall Road,,London,London,,E10 5NH,Tel: 0208 988 8300, - ,,,1 rating Rate it yourself - /Services/opticians/LeaveReview/DefaultView.aspx?id=OP_5NC34571__000002_E105NH,,,
MOBELEYES LTD,30000__000002_IG26LE,OPT,747 Cranbrook Road,Gants Hill,Essex,,,IG2 6LE,Tel: 0208 518 3769, - ,,,No ratings yet Rate it yourself - /Services/opticians/LeaveReview/DefaultView.aspx?id=30000__000002_IG26LE,0,0,
HOWARD HARRIS,OP_5NA45706__000001_IG26LE,OPT,474 Cranbrook Road,Gants Hill,Ilford,Essex,,IG2 6LE,Tel: 020 8518 3666, - ,,,2 ratings Rate it yourself - /Services/opticians/LeaveReview/DefaultView.aspx?id=OP_5NA45706__000001_IG26LE,,,
CHIGWELL MEDICAL CENTRE,20000__000001_IG62TA,OPT,300 Fencepiece Road,Hainault,Essex,,,IG6 2TA,, - ,,,2 ratings Rate it yourself - /Services/opticians/LeaveReview/DefaultView.aspx?id=20000__000001_IG62TA,,,
ELLIS BASS OPTOMETRISTS,5NA_0121__000001_IG62AA,OPT,"Unit 4c, 3-19 High Street",Barkingside,Ilford,Essex,,IG6 2AA,Tel: 020 8550 9288, - ,,,1 rating Rate it yourself - /Services/opticians/LeaveReview/DefaultView.aspx?id=5NA_0121__000001_IG62AA,,,
SPECSAVERS,50000__000004_IG62AD,OPT,45 High Street,Barkingside,Essex,,,IG6 2AD,Tel: 0208 418 2480, - ,,,66 ratings Rate it yourself - /Services/opticians/LeaveReview/DefaultView.aspx?id=50000__000004_IG62AD,,,
Boots-Barkingside - High St,OP_5NA45687__000001_IG62DF,OPT,10 High Street,Barkingside,London,London,Essex,IG6 2DF,Tel: 020 8550 7740, - ,,,No ratings yet Rate it yourself - /Services/opticians/LeaveReview/DefaultView.aspx?id=OP_5NA45687__000001_IG62DF,0,0,
Boots-Barkingside - High St,OP_5NA45695__000001_IG62DR,OPT,90 High Street,Barkingside,London,London,Essex,IG6 2DR,Tel: 0208 550 2920, - ,,,No ratings yet Rate it yourself - /Services/opticians/LeaveReview/DefaultView.aspx?id=OP_5NA45695__000001_IG62DR,0,0,
Atkinson Opticians Ltd,OP_5AJ_794__000001_IG101DX,OPT,24 Forest Road,,Loughton,,,IG10 1DX,Tel: 0208 508 1325, - ,,,No ratings yet Rate it yourself - /Services/opticians/LeaveReview/DefaultView.aspx?id=OP_5AJ_794__000001_IG101DX,0,0,
AVES OPTICIAN (MRS GUPTA),10090__000001_IG62UE,OPT,49 New North Road,Hainult,Essex,,,IG6 2UE,Tel: 020 8502 7000, - ,,,No ratings yet Rate it yourself - /Services/opticians/LeaveReview/DefaultView.aspx?id=10090__000001_IG62UE,0,0,
Tesco Opticians,EN3 4DP,OPT,,288 High Street,,Ponders End,,EN3 4DP,Tel: 0845 601 3479, - ,,,No ratings yet Rate it yourself - /Services/opticians/LeaveReview/DefaultView.aspx?id=EN3 4DP,0,0,
Forest Gate Eye Clinic & Home Visits,OP_5PW_0093__000001_E70DJ,OPT,47 Woodford Road,,Forest Gate,London,,E7 0DJ,Tel: 0208 1819171, - ,,,1 rating Rate it yourself - /Services/opticians/LeaveReview/DefaultView.aspx?id=OP_5PW_0093__000001_E70DJ,,,
"OSAGIE, HENRY",10036__000001_IG103HT,OPT,61 The Lindens,Loughton,Essex,,,IG10 3HT,Tel: 020 8965 6707, - ,,,No ratings yet Rate it yourself - /Services/opticians/LeaveReview/DefaultView.aspx?id=10036__000001_IG103HT,0,0,
M. A. Heylen,OP_5C9_13529__000001_N154HH,OPT,206 Philip Lane,Tottenham,London,,,N15 4HH,Tel: 020 8808 2522, - ,,,No ratings yet Rate it yourself - /Services/opticians/LeaveReview/DefaultView.aspx?id=OP_5C9_13529__000001_N154HH,0,0,
Specsavers Opticians,OP_5AJ_14203__000001_IG101AD,OPT,231 High Road,,Loughton,Essex,,IG10 1AD,Tel: 0208 498 6740, - ,,,No ratings yet Rate it yourself - /Services/opticians/LeaveReview/DefaultView.aspx?id=OP_5AJ_14203__000001_IG101AD,0,0,
Boots-Loughton,IG10 1AD_19218,OPT,,247 High Road,,Loughton,Essex,IG10 1AD,Tel: 02085 087 497, - ,,,1 rating Rate it yourself - /Services/opticians/LeaveReview/DefaultView.aspx?id=IG10 1AD_19218,,,
Eye Deal Spectacles Limited,OPT_IG13EE_5,OPT,,108 De Vere Gardens,,Ilford,,IG1 3EE,, - ,,,No ratings yet Rate it yourself - /Services/opticians/LeaveReview/DefaultView.aspx?id=OPT_IG13EE_5,0,0,
Eye Deal Spectacles Limited,OPT_IG13EE_4,OPT,,108 De Vere Gardens,,Ilford,,IG1 3EE,, - ,,,No ratings yet Rate it yourself - /Services/opticians/LeaveReview/DefaultView.aspx?id=OPT_IG13EE_4,0,0,
Eye Deal Spectacles Limited,OPT_IG13EE_2,OPT,,108 De Vere Gardens,,Ilford,Essex,IG1 3EE,Tel: 02085548400, - ,,,No ratings yet Rate it yourself - /Services/opticians/LeaveReview/DefaultView.aspx?id=OPT_IG13EE_2,0,0,
Eye Deal Spectacles Limited,OPT_IG13EE_3,OPT,,108 De Vere Gardens,,Ilford,,IG1 3EE,, - ,,,No ratings yet Rate it yourself - /Services/opticians/LeaveReview/DefaultView.aspx?id=OPT_IG13EE_3,0,0,
Eye Deal Spectacles Limited,OPT_IG13EE_1,OPT,,108 De Vere Gardens,,Ilford,,IG1 3EE,, - ,,,No ratings yet Rate it yourself - /Services/opticians/LeaveReview/DefaultView.aspx?id=OPT_IG13EE_1,0,0,
Eye Deal Spectacles Limited,CO-3845,OPT,,108 De Vere Gardens,,Ilford,,IG1 3EE,, - ,,,No ratings yet Rate it yourself - /Services/opticians/LeaveReview/DefaultView.aspx?id=CO-3845,0,0,
Eye Deal Spectacles Limited,OPT_IG13EE_6,OPT,,108 De Vere Gardens,,Ilford,,IG1 3EE,, - ,,,No ratings yet Rate it yourself - /Services/opticians/LeaveReview/DefaultView.aspx?id=OPT_IG13EE_6,0,0,
Eye Deal Spectacles Limited,OPT_IG13EE_7,OPT,,108 De Vere Gardens,,Ilford,,IG1 3EE,, - ,,,No ratings yet Rate it yourself - /Services/opticians/LeaveReview/DefaultView.aspx?id=OPT_IG13EE_7,0,0,
Eye Deal Spectacles Limited,OPT_IG13EE_8,OPT,,108 De Vere Gardens,,Ilford,,IG1 3EE,, - ,,,No ratings yet Rate it yourself - /Services/opticians/LeaveReview/DefaultView.aspx?id=OPT_IG13EE_8,0,0,
SILVERMANS OPTICIANS,OP_5C3_13776__000001_E59AG,OPT,,176 Clapton Common,,London,Greater London,E5 9AG,Tel: 0208 211 7575, - ,,,No ratings yet Rate it yourself - /Services/opticians/LeaveReview/DefaultView.aspx?id=OP_5C3_13776__000001_E59AG,0,0,
"AUSTIN, ANTONY OPTICIANS",OP_5C3_14460__000001_N165TR,OPT,74 Oldhill Street,,London,,,N16 6NA,Tel: 020 8211 7228, - ,,,No ratings yet Rate it yourself - /Services/opticians/LeaveReview/DefaultView.aspx?id=OP_5C3_14460__000001_N165TR,0,0,
David Clulow Opticians,NEW WEPCT__000002_IG101AH,OPT,297 High Road,,Loughton,Essex,,IG10 1AH,Tel: 0208 502 5259, - ,,,No ratings yet Rate it yourself - /Services/opticians/LeaveReview/DefaultView.aspx?id=NEW WEPCT__000002_IG101AH,0,0,
Bird & Fairley,OP_5AJ_3042__000001_IG101AH,OPT,269 High Road,,,Loughton,Essex,IG10 1AH,Tel: 0208 508 4070, - ,,,No ratings yet Rate it yourself - /Services/opticians/LeaveReview/DefaultView.aspx?id=OP_5AJ_3042__000001_IG101AH,0,0,
FOREST GATE OPTICIANS,OP_5C5_14557__000002_E70EW,OPT,94 Woodgrange Road,Forest Gate,London,,,E7 0EW,Tel: 020 8534 5170, - ,,,1 rating Rate it yourself - /Services/opticians/LeaveReview/DefaultView.aspx?id=OP_5C5_14557__000002_E70EW,,,
EYE CLINIC CHIGWELL LTD, TP2FH,OPT,The Opticians,173 Manor Road,,Chigwell,Essex,IG7 5QB,Tel: 0208 928 1500, - ,,,No ratings yet Rate it yourself - /Services/opticians/LeaveReview/DefaultView.aspx?id=TP2FH,0,0,
EYE CLINIC CHIGWELL LTD, TP2FH,OPT,,173 Manor Road,,Chigwell Essex,,IG7 5QB,, - ,,,No ratings yet Rate it yourself - /Services/opticians/LeaveReview/DefaultView.aspx?id=TP2FH,0,0,
Scher & Ward Opticians,OP_5AJ_2908__000001_IG101BR,OPT,278 High Road,,Loughton,Essex,,IG10 1RB,Tel: 020 8508 5852, - ,,,1 rating Rate it yourself - /Services/opticians/LeaveReview/DefaultView.aspx?id=OP_5AJ_2908__000001_IG101BR,,,
CHARLES LEADSHAM OPTICIANS (MR J PLASKOW),OP_5C3_14554__000001_N166RA,OPT,202stamford Hill,London,,,,N16 6RA,Tel: 020 8800 3189, - ,,,No ratings yet Rate it yourself - /Services/opticians/LeaveReview/DefaultView.aspx?id=OP_5C3_14554__000001_N166RA,0,0,
Egbentu Site Services trading as Clapton Opticians,10016__000001_E58BQ,OPT,,1 Station Parade,Upper Clapton Road,Hackney,,E5 8BD,Tel: 020 8806 7432, - ,,,No ratings yet Rate it yourself - /Services/opticians/LeaveReview/DefaultView.aspx?id=10016__000001_E58BQ,0,0,
Kingsway Eyecare ,OP_E151SE_30652,OPT,,Unit 3 Ibex House,Maryland Place,London,,E15 1SE,Tel: 020 8534 6080, - ,,,No ratings yet Rate it yourself - /Services/opticians/LeaveReview/DefaultView.aspx?id=OP_E151SE_30652,0,0,
PRADIP PATEL LTD,OP_5C5_3687__000001_E70QH,OPT,34 Woodgrange Road,London,,,,E7 0QH,Tel: 020 8555 8834, - ,,,1 rating Rate it yourself - /Services/opticians/LeaveReview/DefaultView.aspx?id=OP_5C5_3687__000001_E70QH,,,
"GUPTA, MRS NP",10073__000004_IG14JT,OPT,17 Wellesley Road,,Ilford,,,IG1 4JT,Tel: 020 8554 1088, - ,,,No ratings yet Rate it yourself - /Services/opticians/LeaveReview/DefaultView.aspx?id=10073__000004_IG14JT,0,0,
AVES OPTICIANS,OP_5NA45684__000002_IG14JT,OPT,17 Wellesley Road,Ilford,London,,,IG1 4JT,Tel: 020 8551 1088, - ,,,No ratings yet Rate it yourself - /Services/opticians/LeaveReview/DefaultView.aspx?id=OP_5NA45684__000002_IG14JT,0,0,
A Ray Eyecare,OP_5C9_5813__000001_N225DD,OPT,514 Lordship Lane,,,London,,N22 5DD,Tel: 020 8888 8715, - ,,,No ratings yet Rate it yourself - /Services/opticians/LeaveReview/DefaultView.aspx?id=OP_5C9_5813__000001_N225DD,0,0,
InFocus Optometrists,TP5Y8,OPT,,62A Brooksby's Walk,,London,,E9 6DA,, - ,,,No ratings yet Rate it yourself - /Services/opticians/LeaveReview/DefaultView.aspx?id=TP5Y8,0,0,
Forest Gate Eye Clinic,OP_5PV_3711__000001_IG13PD,OPT,47 Woodford Road,,Forest Gate,London,,E7 8AB,Tel: 0208 181 9171, - ,,,4 ratings Rate it yourself - /Services/opticians/LeaveReview/DefaultView.aspx?id=OP_5PV_3711__000001_IG13PD,,,
KITE Opticians,CO-4988_E20 1EJ130614,OPT,Ground Floor,Stratford City Westfield,,London,,E20 1EJ,Tel: 0203 7287777, - ,,,No ratings yet Rate it yourself - /Services/opticians/LeaveReview/DefaultView.aspx?id=CO-4988_E20 1EJ130614,0,0,
R. J. Mattes Opticians ,OP_5C1_13555__000001_EN35BA,OPT,8 Brick Lane,Enfield,London,Middx,,EN3 5BA,Tel: 020 8804 2818, - ,,,No ratings yet Rate it yourself - /Services/opticians/LeaveReview/DefaultView.aspx?id=OP_5C1_13555__000001_EN35BA,0,0,
"KAHAN, HENRY",10034__000002_NW119AS,OPT,,25 St Andrews Mews,,London,,N16 5HR,Tel: 020 8455 8883, - ,,,No ratings yet Rate it yourself - /Services/opticians/LeaveReview/DefaultView.aspx?id=10034__000002_NW119AS,0,0,
Lais Opticians,OP_5C5_14558__000001_E125AQ,OPT,622 Romford Road,Manor Park,London,London,,E12 5AQ,Tel: 020 8478 1631, - ,,,No ratings yet Rate it yourself - /Services/opticians/LeaveReview/DefaultView.aspx?id=OP_5C5_14558__000001_E125AQ,0,0,
Boots-Stratford - London,OP_E201EH_30648,OPT,"31-32 Lower Ground Floor, The Arcade, Westfields",,,Stratford City,,E20 1EH,Tel: 0208 5345037, - ,,,No ratings yet Rate it yourself - /Services/opticians/LeaveReview/DefaultView.aspx?id=OP_E201EH_30648,0,0,
Vision Express ,OP_E201EH_30653,OPT,The Arcade,Lower Ground Floor,Westfield,"Stratford City, London",,E20 1EH,Tel: 020 8522 7336, - ,,,No ratings yet Rate it yourself - /Services/opticians/LeaveReview/DefaultView.aspx?id=OP_E201EH_30653,0,0,
LITEBLUE OPTICIANS (MR PATEL),10023__000002_E96AS,OPT,163 Homerton High Street,,London,,,E9 6AS,Tel: 020 8985 8244, - ,,,No ratings yet Rate it yourself - /Services/opticians/LeaveReview/DefaultView.aspx?id=10023__000002_E96AS,0,0,
EYE CARE (LEWIS JACOBS),OP_5NA45699__000001_IG14DU,OPT,13 Cranbrook Road,Ilford,London,,,IG1 4DU,Tel: 020 8478 3767, - ,,,No ratings yet Rate it yourself - /Services/opticians/LeaveReview/DefaultView.aspx?id=OP_5NA45699__000001_IG14DU,0,0,
EYEWEAR CLINIC,OP_5NA45703__000001_IG11AS,OPT,Unit 49,"The Exchange, Ilford",London,,,IG1 1AS,Tel: 020 8478 2971, - ,,,No ratings yet Rate it yourself - /Services/opticians/LeaveReview/DefaultView.aspx?id=OP_5NA45703__000001_IG11AS,0,0,
VISION EXPRESS,OP_5NA45722__000002_IG11AS,OPT,The Exchange,Ilford,London,,,IG1 1AS,Tel: 0208 553 0505, - ,,,No ratings yet Rate it yourself - /Services/opticians/LeaveReview/DefaultView.aspx?id=OP_5NA45722__000002_IG11AS,0,0,
SPECSAVERS OPTICIANS,OP_5C5_6369__000001_E151XQ,OPT,78 The Mall,The Stratford Centre,Stratford,,,E15 1XQ,Tel: 020 8221 1113, - ,,,No ratings yet Rate it yourself - /Services/opticians/LeaveReview/DefaultView.aspx?id=OP_5C5_6369__000001_E151XQ,0,0,