Organisation Name,NACS Code,Organisation Type,Address1,Address2,Address3,Address4,Address5,PostCode,Telephone Number,Opening time,Value  (Opening time),Banding Classification  (Opening time),NHS.UK users rating,Value  (NHS.UK users rating),Banding Classification  (NHS.UK users rating),Car parking (Is there car parking at this organisation?)
David Burghardt Vision Care (David Burghardt),OP_5D2_1569__000002_LN22PD,OPT,1 Church Street,Nettleham,Lincoln,",",,LN2 2PD,Tel: 01522 754821, - ,,,No ratings yet Rate it yourself - /Services/opticians/LeaveReview/DefaultView.aspx?id=OP_5D2_1569__000002_LN22PD,0,0,
Craig Leaver Eyecare,OP_5D2_13820__000001_LN24QP,OPT,2 Bunkers Hill,Lincoln,,",",,LN2 4QP,Tel: 01522 522088, - ,,,No ratings yet Rate it yourself - /Services/opticians/LeaveReview/DefaultView.aspx?id=OP_5D2_13820__000001_LN24QP,0,0,
Tesco Opticians,TP6NY,OPT,,Wragby Road,,Lincoln,,LN2 4QQ,, - ,,,No ratings yet Rate it yourself - /Services/opticians/LeaveReview/DefaultView.aspx?id=TP6NY,0,0,
Harold Barnaby Optical Services,OP_5D2_13817__000001_LN24BL,OPT,,31 Mainwaring Road,,Lincoln,,LN2 4BL,Tel: 01522 524732, - ,,,No ratings yet Rate it yourself - /Services/opticians/LeaveReview/DefaultView.aspx?id=OP_5D2_13817__000001_LN24BL,0,0,yes
Clear View Vision Ltd (Mrs Annabelle Magee),LN1_3LW_1,OPT,Clear View Opticians,169 Burton Road,,Lincoln,Lincolnshire,LN1 3LW,Tel: 01522 542121, - ,,,No ratings yet Rate it yourself - /Services/opticians/LeaveReview/DefaultView.aspx?id=LN1_3LW_1,0,0,yes
Vision Care @ No 8 (Julian Gunn & Jason Rickaby),OP_5D2_14304__000001_LN13AJ,OPT,3 Gordon Road,8 Gordon Road,,Lincoln,,LN1 3AJ,Tel: 01522 530088, - ,,,No ratings yet Rate it yourself - /Services/opticians/LeaveReview/DefaultView.aspx?id=OP_5D2_14304__000001_LN13AJ,0,0,
Mucklow & Hardy,OP_5D2_13819__000001_LN21QA,OPT,Clear View Opticians,6a Eastgate,,Lincoln,Lincolnshire,LN2 1QA,Tel: 01522 538889, - ,,,No ratings yet Rate it yourself - /Services/opticians/LeaveReview/DefaultView.aspx?id=OP_5D2_13819__000001_LN21QA,0,0,no
Opticial Express,OP_12345_LN1 1XP,OPT,"2nd Floor, Lincoln House",37 Newland,,Lincoln,Lincolnshire,LN1 1XP,Tel: 0800 023 2020, - ,,,No ratings yet Rate it yourself - /Services/opticians/LeaveReview/DefaultView.aspx?id=OP_12345_LN1 1XP,0,0,
Optique Vision,C/0117-Q59_LN2 1DH,OPT,The Stonebow,224 High Street,,Lincoln,Lincolnshire,LN2 1AH,Tel: 01522244390, - ,,,1 rating Rate it yourself - /Services/opticians/LeaveReview/DefaultView.aspx?id=C/0117-Q59_LN2 1DH,,,yes
Martin Smith Opticians Ltd,OP_5D2_2805__000001_LN21DH,OPT,22 Saltergate,,Lincoln,,,LN2 1DH,Tel: 01522 521100, - ,,,No ratings yet Rate it yourself - /Services/opticians/LeaveReview/DefaultView.aspx?id=OP_5D2_2805__000001_LN21DH,0,0,yes
Water Lane Opticians,OP_5D2_13818__000001_LN11TY,OPT,5 Water Lane,Lincoln,,,,LN1 1TY,Tel: 01522 525395, - ,,,No ratings yet Rate it yourself - /Services/opticians/LeaveReview/DefaultView.aspx?id=OP_5D2_13818__000001_LN11TY,0,0,
Vision Express (UK) Ltd,OP_5D2_10307__000003_LN21AP,OPT,Unit 8 Waterside Shopping Centre,High Street,Lincoln,Lincolnshire,,LN2 1AP,Tel: 01522 560111, - ,,,No ratings yet Rate it yourself - /Services/opticians/LeaveReview/DefaultView.aspx?id=OP_5D2_10307__000003_LN21AP,0,0,
Boots-Lincoln - High St (in Boots UK),OP_5D2_6992__000002_LN57DZ,OPT,311-312 High Street,,,Lincoln,Lincolnshire,LN5 7DZ,Tel: 01522 536982, - ,,,1 rating Rate it yourself - /Services/opticians/LeaveReview/DefaultView.aspx?id=OP_5D2_6992__000002_LN57DZ,,,
Boots-Lincoln - High St,OP_5D2_7188__000001_LN57AL,OPT,192 High Street,,,Lincoln,Lincolnshire,LN5 7AL,Tel: 01522 523 960, - ,,,1 rating Rate it yourself - /Services/opticians/LeaveReview/DefaultView.aspx?id=OP_5D2_7188__000001_LN57AL,,,
E R Dixon Ltd,OP_5D2_2970__000002_LN57AL,OPT,,194 High Street,,Lincoln,,LN5 7AL,Tel: 01522 523786, - ,,,No ratings yet Rate it yourself - /Services/opticians/LeaveReview/DefaultView.aspx?id=OP_5D2_2970__000002_LN57AL,0,0,no
Specsavers Opticians,OP_5D2_2444__000001_LN57DW,OPT,324 High Street,,Lincoln,,,LN5 7DW,Tel: 01522 576655, - ,,,No ratings yet Rate it yourself - /Services/opticians/LeaveReview/DefaultView.aspx?id=OP_5D2_2444__000001_LN57DW,0,0,no
Specsavers Opticians,OP_5D2_14302__000001_LN67QL,OPT,Unit 4,Morrisons Supermarket,Tritton Road,Lincoln,,LN6 7QL,Tel: 01522 572710, - ,,,No ratings yet Rate it yourself - /Services/opticians/LeaveReview/DefaultView.aspx?id=OP_5D2_14302__000001_LN67QL,0,0,yes
Greenwood Opticians,OP_5D2_3341__000001_LN83HL,OPT,25 Market Place,,,Market Rasen,Lincolnshire,LN8 3HL,Tel: 01673 842265, - ,,,8 ratings Rate it yourself - /Services/opticians/LeaveReview/DefaultView.aspx?id=OP_5D2_3341__000001_LN83HL,,,
Yeomans Opticians Ltd,OP_5D2_13821__000003_LN60QQ,OPT,,"Unit 23, Birchwood Shopping Centre",Jasmin Road,Lincoln,Lincolnshire,LN6 0QQ,Tel: 01522 694548, - ,,,No ratings yet Rate it yourself - /Services/opticians/LeaveReview/DefaultView.aspx?id=OP_5D2_13821__000003_LN60QQ,0,0,yes
Rayner Opticians,OP_5D2_7512__000001_LN67PX,OPT,5 Rookery Lane,,,Lincoln,Lincolnshire,LN6 7PX,Tel: 01522 527974, - ,,,No ratings yet Rate it yourself - /Services/opticians/LeaveReview/DefaultView.aspx?id=OP_5D2_7512__000001_LN67PX,0,0,yes
Asda Opticians,190920161532,OPT,,Newark Road,,Lincoln,,LN6 8JY,Tel: 01522 581148, - ,,,No ratings yet Rate it yourself - /Services/opticians/LeaveReview/DefaultView.aspx?id=190920161532,0,0,
Kirton in Lindsey Opticians,OP_5EF_3529__000002_DN214LU,OPT,6 High Street,Kirton Lindsey,Gainsborough,Lincolnshire,,DN21 4LU,Tel: 01652 649024, - ,,,No ratings yet Rate it yourself - /Services/opticians/LeaveReview/DefaultView.aspx?id=OP_5EF_3529__000002_DN214LU,0,0,
Gainsborough VisionPlus Ltd,OPT082__000001_DN212NA,OPT,"Unit 22, Marshalls Yard",Beaumont Street,Gainsborough,Lincolnshire,,DN21 2NA,Tel: 01472 619870, - ,,,No ratings yet Rate it yourself - /Services/opticians/LeaveReview/DefaultView.aspx?id=OPT082__000001_DN212NA,0,0,
Bingham and Young ,180420171310,OPT,,33 Market Street,,Gainsborough,Lincolnshire,DN21 2BE,Tel: 01427678333, - ,,,No ratings yet Rate it yourself - /Services/opticians/LeaveReview/DefaultView.aspx?id=180420171310,0,0,yes
Davies-Todd Opticians Ltd,OP_5D2_6710__000002_DN212BE,OPT,12 Market Street,,Gainsborough,,,DN21 2BE,Tel: 01427 612853, - ,,,No ratings yet Rate it yourself - /Services/opticians/LeaveReview/DefaultView.aspx?id=OP_5D2_6710__000002_DN212BE,0,0,
Walters Opticians,OP_5D2_692__000002_DN212BY,OPT,34 Market Place,,Gainsborough,,,DN21 2BY,Tel: 01427 616505, - ,,,No ratings yet Rate it yourself - /Services/opticians/LeaveReview/DefaultView.aspx?id=OP_5D2_692__000002_DN212BY,0,0,no
O'Brien's Opticians,OP_5EF_3276__000001_DN208JB,OPT,43-44 Wrawby Street,Brigg,Scunthorpe,North Lincolnshire,,DN20 8BS,Tel: 01652 653595, - ,,,No ratings yet Rate it yourself - /Services/opticians/LeaveReview/DefaultView.aspx?id=OP_5EF_3276__000001_DN208JB,0,0,
Brigg Optical,OPT_5EF_017__000001_DN208JZ,OPT,5 Chapel Court,,Brigg,North Lincolnshire,,DN20 8JZ,Tel: 01652 650400, - ,,,1 rating Rate it yourself - /Services/opticians/LeaveReview/DefaultView.aspx?id=OPT_5EF_017__000001_DN208JZ,,,
Charlotte Saunders Ltd (Charlotte Saunders),OP_NG236QA_34422,OPT,,5 High Street,,Newark,,NG23 6QA,Tel: 07898695809, - ,,,No ratings yet Rate it yourself - /Services/opticians/LeaveReview/DefaultView.aspx?id=OP_NG236QA_34422,0,0,
Opticks Opticians,OP_5H9_2501__000001_LN106QL,OPT,,7 Station Road,Woodhall Spa,Lincolnshire,,LN10 6QL,Tel: 01526 352236, - ,,,No ratings yet Rate it yourself - /Services/opticians/LeaveReview/DefaultView.aspx?id=OP_5H9_2501__000001_LN106QL,0,0,
I S Merry,OP_5EF_2727__000001_DN162SF,OPT,Alexandra Road,Ashby,Scunthorpe,North Lincolnshire,,DN16 2SF,Tel: 01724 852987, - ,,,No ratings yet Rate it yourself - /Services/opticians/LeaveReview/DefaultView.aspx?id=OP_5EF_2727__000001_DN162SF,0,0,
Norfolk Optics Limited,OPT_5EF_018__000001_DN162SD,OPT,259 Ashby High Street,,Scunthorpe,North Lincolnshire,,DN16 2SD,Tel: 01724 867117, - ,,,1 rating Rate it yourself - /Services/opticians/LeaveReview/DefaultView.aspx?id=OPT_5EF_018__000001_DN162SD,,,
Charles Irvine,OPT-5EF-022__000002_DN162RY,OPT,295 Ashby High Street,Ashby,Scunthorpe,,,DN16 2RY,, - ,,,6 ratings Rate it yourself - /Services/opticians/LeaveReview/DefaultView.aspx?id=OPT-5EF-022__000002_DN162RY,,,
Asda Vision Centre,OP_5EF_13988__000001_DN172XE,OPT,Burringham Road,,,Scunthorpe,,DN17 2XF,Tel: 01724 407220, - ,,,No ratings yet Rate it yourself - /Services/opticians/LeaveReview/DefaultView.aspx?id=OP_5EF_13988__000001_DN172XE,0,0,
Boots-Horncastle,OP_5H9_5286__000001_LN95HZ,OPT,,10 Bridge Street,Horncastle,Lincolnshire,,LN9 5HZ,Tel: 01507 527044, - ,,,No ratings yet Rate it yourself - /Services/opticians/LeaveReview/DefaultView.aspx?id=OP_5H9_5286__000001_LN95HZ,0,0,
Retford Specsavers Ltd,OP_5ET_9436__000001_DN226DR,OPT,10a Market Place,,,Retford,,DN22 6DR,Tel: 01777 711711, - ,,,4 ratings Rate it yourself - /Services/opticians/LeaveReview/DefaultView.aspx?id=OP_5ET_9436__000001_DN226DR,,,
Woolcott Opticians,OP_5ET_3205__000003_DN226DY,OPT,30 Carolgate,,Retford,,,DN22 6DY,Tel: 01777 703340, - ,,,1 rating Rate it yourself - /Services/opticians/LeaveReview/DefaultView.aspx?id=OP_5ET_3205__000003_DN226DY,,,
Bingham & Young(Young Optical Limited),OP_5ET_2900__000001_DN227SQ,OPT,2 Exchange Street,,Retford,Retford,,DN22 6BL,Tel: 01777 703328, - ,,,No ratings yet Rate it yourself - /Services/opticians/LeaveReview/DefaultView.aspx?id=OP_5ET_2900__000001_DN227SQ,0,0,
Dudley & Severn,OP_5ET_A469__000001_DN226ES,OPT,9 West Street,,Retford,Nottinghamshire,,DN22 6ES,Tel: 01777 703030, - ,,,No ratings yet Rate it yourself - /Services/opticians/LeaveReview/DefaultView.aspx?id=OP_5ET_A469__000001_DN226ES,0,0,
Horncastle Opticians (Garry Crome),OP_5H9_8477__000002_LN95BL,OPT,,6a High Street,,Horncastle,Lincolnshire,LN9 5BL,Tel: 01507 526205, - ,,,No ratings yet Rate it yourself - /Services/opticians/LeaveReview/DefaultView.aspx?id=OP_5H9_8477__000002_LN95BL,0,0,no
Edwards & Mahal,OP_5EF_9090__000002_DN91ER,OPT,12 Church Street,Epworth,Doncaster,,,DN9 1ER,Tel: 01427 873578, - ,,,No ratings yet Rate it yourself - /Services/opticians/LeaveReview/DefaultView.aspx?id=OP_5EF_9090__000002_DN91ER,0,0,
Boots-Scunthorpe - Oswald Rd,OP_5EF_6059__000001_DN157PQ,OPT,40 Oswald Road,,,Scunthorpe,Lincolnshire,DN15 7PQ,Tel: 01724 843152, - ,,,No ratings yet Rate it yourself - /Services/opticians/LeaveReview/DefaultView.aspx?id=OP_5EF_6059__000001_DN157PQ,0,0,
Sutherland Optical Associates,OP_5EF_11493__000001_DN156LA,OPT,123 Mary Street,,Scunthorpe,North Lincolnshire,,DN15 6LA,Tel: 01724 865248, - ,,,No ratings yet Rate it yourself - /Services/opticians/LeaveReview/DefaultView.aspx?id=OP_5EF_11493__000001_DN156LA,0,0,
Peebles & Wayte,OP_5EF_8936__000001_DN156NG,OPT,2 Robert Street,,Scunthorpe,North Lincolnshire,,DN15 6NG,Tel: 01724 843528, - ,,,No ratings yet Rate it yourself - /Services/opticians/LeaveReview/DefaultView.aspx?id=OP_5EF_8936__000001_DN156NG,0,0,
Boots-Scunthorpe - High St,OP_5EF_2181__000001_DN156LY,OPT,103 High Street,,,Scunthorpe,Lincolnshire,DN15 6LY,Tel: 01724 847 710, - ,,,No ratings yet Rate it yourself - /Services/opticians/LeaveReview/DefaultView.aspx?id=OP_5EF_2181__000001_DN156LY,0,0,
Michael Vickers,MVDN228RX,OPT,,89 Town Street,,"Lound, Retford",,DN22 8RX,Tel: 01777 818291, - ,,,No ratings yet Rate it yourself - /Services/opticians/LeaveReview/DefaultView.aspx?id=MVDN228RX,0,0,
Specsavers Opticians,OP_5EF_6742__000001_DN156TG,OPT,54 High Street,,Scunthorpe,North Lincolnshire,,DN15 6SX,Tel: 01724 271451, - ,,,4 ratings Rate it yourself - /Services/opticians/LeaveReview/DefaultView.aspx?id=OP_5EF_6742__000001_DN156TG,,,
Vision Express (UK) Ltd,OP_5EF_13991__000001_DN156SD,OPT,78 High Street,,Scunthorpe,North Lincolnshire,,DN15 6SD,Tel: 01724 276220, - ,,,No ratings yet Rate it yourself - /Services/opticians/LeaveReview/DefaultView.aspx?id=OP_5EF_13991__000001_DN156SD,0,0,
Vision Value,OPT-5EF021__000002_DN156SD,OPT,70 High Street,The Foundry,Scunthorpe,,,DN15 6SD,, - ,,,No ratings yet Rate it yourself - /Services/opticians/LeaveReview/DefaultView.aspx?id=OPT-5EF021__000002_DN156SD,0,0,
Tesco Opticians,OPT-5EF-019__000001_DN158GR,OPT,Gallagher Park,Doncaster Road,Scunthorpe,North Lincolnshire,,DN15 8GR,Tel: 0345 677 9664, - ,,,No ratings yet Rate it yourself - /Services/opticians/LeaveReview/DefaultView.aspx?id=OPT-5EF-019__000001_DN158GR,0,0,
Lunettes Opticians Ltd,OP_NG349DT_84705,OPT,,24 High Street,,Ruskington,Lincolnshire,NG34 9DW,Tel: 01526 834466, - ,,,No ratings yet Rate it yourself - /Services/opticians/LeaveReview/DefaultView.aspx?id=OP_NG349DT_84705,0,0,
Peebles & Hilton,OP_5H9_2611__000002_LN44SG,OPT,,16 Silver Street,,Coningsby,Lincolnshire,LN4 4SG,Tel: 01526 344556, - ,,,No ratings yet Rate it yourself - /Services/opticians/LeaveReview/DefaultView.aspx?id=OP_5H9_2611__000002_LN44SG,0,0,no
Stephen Hewitt eyecare,OP_5H9_13823__000001_LN119JG,OPT,21 Mercer Row,Louth,,.,,LN11 9JG,Tel: 01507 607276, - ,,,No ratings yet Rate it yourself - /Services/opticians/LeaveReview/DefaultView.aspx?id=OP_5H9_13823__000001_LN119JG,0,0,
Louth Vision Centre,OP_5H9_13828__000001_LN119NR,OPT,,Louth Vision Centre,4 Market Place,Louth,Lincolnshire,LN11 9NR,Tel: 01507 609499, - ,,,3 ratings Rate it yourself - /Services/opticians/LeaveReview/DefaultView.aspx?id=OP_5H9_13828__000001_LN119NR,,,
"Keen, King & Jones",OP_5AN_7360__000001_DN370LS,OPT,4 Kirkgate,Waltham,Grimsby,,,DN37 0LS,Tel: 01472 824643, - ,,,No ratings yet Rate it yourself - /Services/opticians/LeaveReview/DefaultView.aspx?id=OP_5AN_7360__000001_DN370LS,0,0,
Specsavers Opticians,OP_5AP_12095__000001_NG241EW,OPT,c/o Morrisons Superstore,Kings Road,Newark,,,NG24 1EW,Tel: 01636 611599, - ,,,No ratings yet Rate it yourself - /Services/opticians/LeaveReview/DefaultView.aspx?id=OP_5AP_12095__000001_NG241EW,0,0,
Opticare Midlands Limited,OP_5AP_9380__000001_NG241DH,OPT,3 Paxton Court,,Newark,,,NG24 1DH,Tel: 01636 679555, - ,,,No ratings yet Rate it yourself - /Services/opticians/LeaveReview/DefaultView.aspx?id=OP_5AP_9380__000001_NG241DH,0,0,
J:D Opticians,TP3XC,OPT,,17/19 Appleton Gate   ,,Newark,,NG24 1JR,Tel: 01636 611133, - ,,,No ratings yet Rate it yourself - /Services/opticians/LeaveReview/DefaultView.aspx?id=TP3XC,0,0,
Richards Opticians,OP_5AP_3771__000001_NG241PX,OPT,Harry's Eyewear,5-7 Barnby Gate,,Newark,Nottinghamshire,NG24 1PX,Tel: 01636 704656, - ,,,No ratings yet Rate it yourself - /Services/opticians/LeaveReview/DefaultView.aspx?id=OP_5AP_3771__000001_NG241PX,0,0,
London Eye Bespoke Eyewear,CO-0099,OPT,,9 Chain Lane,,Newark,,NG24 1AU,, - ,,,No ratings yet Rate it yourself - /Services/opticians/LeaveReview/DefaultView.aspx?id=CO-0099,0,0,
Scrivens Ltd,OP_5AP_5472__000002_NG241UD,OPT,10 The Arcade,,,Newark,Nottinghamshire,NG24 1UD,Tel: 01636 704503, - ,,,No ratings yet Rate it yourself - /Services/opticians/LeaveReview/DefaultView.aspx?id=OP_5AP_5472__000002_NG241UD,0,0,
Boots-Newark,OP_5AP_11578__000001_NG241EG,OPT,31-32 Market Place,,,Newark,Nottinghamshire,NG24 1EG,Tel: 01636 702057, - ,,,No ratings yet Rate it yourself - /Services/opticians/LeaveReview/DefaultView.aspx?id=OP_5AP_11578__000001_NG241EG,0,0,
Duffy Optometrists,OP_5AP_8716__000001_NG241JT,OPT,51 Stodman Street,,Newark,Nottinghamshire,,NG24 1AW,Tel: 01636 705677, - ,,,No ratings yet Rate it yourself - /Services/opticians/LeaveReview/DefaultView.aspx?id=OP_5AP_8716__000001_NG241JT,0,0,
Scartho Eyecare Limited,OPT TAN-082__000003_DN332LY,OPT,11 Waltham Road,Scartho,Grimsby,North East Lincolnshire,,DN33 2LY,Tel: 01472 877235, - ,,,1 rating Rate it yourself - /Services/opticians/LeaveReview/DefaultView.aspx?id=OPT TAN-082__000003_DN332LY,,,
Ulph & Kearns Ltd,OP_5AN_1981__000002_DN332EP,OPT,1 Scartho Court,Pinfold Lane,Scartho,,,DN33 2EW,Tel: 01472 870164, - ,,,No ratings yet Rate it yourself - /Services/opticians/LeaveReview/DefaultView.aspx?id=OP_5AN_1981__000002_DN332EP,0,0,
Bawtry Eye Academy,OPT_DN106LS_1,OPT,,2 Swan Street,Bawtry,Doncaster,South Yorkshire,DN10 6QJ,Tel: 01302 711282, - ,,,1 rating Rate it yourself - /Services/opticians/LeaveReview/DefaultView.aspx?id=OPT_DN106LS_1,,,yes
Jenny Hudson Opticians,OP_5EK_12972__000002_DN106JE,OPT,22 High Street,Bawtry,Doncaster,,,DN10 6JE,Tel: 01302 711655, - ,,,No ratings yet Rate it yourself - /Services/opticians/LeaveReview/DefaultView.aspx?id=OP_5EK_12972__000002_DN106JE,0,0,
Pinder's Optometrists,OP_5AP_8682__000002_NG229PR,OPT,33 Forest Road,New Ollerton,Newark,,,NG22 9PR,Tel: 01623 863384, - ,,,No ratings yet Rate it yourself - /Services/opticians/LeaveReview/DefaultView.aspx?id=OP_5AP_8682__000002_NG229PR,0,0,
Smith & Walker (Optometrists) Ltd,OP_5EF_8151__000001_DN159PU,OPT,1 High Street,,Winterton,North Lincolnshire,,DN15 9PU,Tel: 01724 733754, - ,,,No ratings yet Rate it yourself - /Services/opticians/LeaveReview/DefaultView.aspx?id=OP_5EF_8151__000001_DN159PU,0,0,
Smith & Walker (Optometrists) Ltd,OP_5AN_8150__000001_DN402AE,OPT,2 Kennedy Way,,,Immingham,,DN40 2AE,Tel: 01469 572702, - ,,,No ratings yet Rate it yourself - /Services/opticians/LeaveReview/DefaultView.aspx?id=OP_5AN_8150__000001_DN402AE,0,0,
Hunts of Sleaford,OP_5D3_900__000001_NG347SR,OPT,,11 Market Place,,Sleaford,Lincolnshire,NG34 7SR,Tel: 01529 302122, - ,,,No ratings yet Rate it yourself - /Services/opticians/LeaveReview/DefaultView.aspx?id=OP_5D3_900__000001_NG347SR,0,0,yes
E R Dixon Ltd,OP_5D3_910__000001_NG347PD,OPT,6 Southgate Shopping Precinct,Southgate,Sleaford,,,NG34 7PD,Tel: 01529 414212, - ,,,No ratings yet Rate it yourself - /Services/opticians/LeaveReview/DefaultView.aspx?id=OP_5D3_910__000001_NG347PD,0,0,yes
"Keen, King & Jones",OP_5AN_4059__000001_DN312BD,OPT,3 Lynton Parade,Cromwell Road,Grimsby,,,DN31 2BD,Tel: 01472 360900, - ,,,No ratings yet Rate it yourself - /Services/opticians/LeaveReview/DefaultView.aspx?id=OP_5AN_4059__000001_DN312BD,0,0,
Mackay & Rollett Limited,OP_5AN_13995__000002_DN312AB,OPT,14 Dudley Street,Grimsby,North East Lincolnshire,,,DN31 2AB,Tel: 01472 354040, - ,,,No ratings yet Rate it yourself - /Services/opticians/LeaveReview/DefaultView.aspx?id=OP_5AN_13995__000002_DN312AB,0,0,
Lunettes Opticians,OP_5D3_14934__000001_NG347RL,OPT,,70 Southgate,,Sleaford,Lincolnshire,NG34 7RL,Tel: 01529 414066, - ,,,No ratings yet Rate it yourself - /Services/opticians/LeaveReview/DefaultView.aspx?id=OP_5D3_14934__000001_NG347RL,0,0,no
Vision Express (UK) Ltd,OP_5AN_12319__000001_DN311TB,OPT,2 Newbiggin Walk,Freshney Place,Grimsby,,,DN31 1ED,Tel: 01472 344244, - ,,,No ratings yet Rate it yourself - /Services/opticians/LeaveReview/DefaultView.aspx?id=OP_5AN_12319__000001_DN311TB,0,0,
Specsavers Opticians,OP_5AN_12791__000001_DN311EY,OPT,31-33 Victoria St West,,,Grimsby,,DN31 1DL,Tel: 01472 242018, - ,,,1 rating Rate it yourself - /Services/opticians/LeaveReview/DefaultView.aspx?id=OP_5AN_12791__000001_DN311EY,,,
Optic Direct,OPT-TAN-020__000001_DN311LH,OPT,2 East Street,Mary Gate,,Grimsby,,DN31 1LH,Tel: 01472 267779, - ,,,No ratings yet Rate it yourself - /Services/opticians/LeaveReview/DefaultView.aspx?id=OPT-TAN-020__000001_DN311LH,0,0,
Boots-Grimsby - Friargate,OP_5AN_11689__000002_DN311ED,OPT,17 Friargate,,Freshney Place,Grimsby,,DN31 1QQ,Tel: 01472 342 209, - ,,,No ratings yet Rate it yourself - /Services/opticians/LeaveReview/DefaultView.aspx?id=OP_5AN_11689__000002_DN311ED,0,0,
Woolcott Opticians,OP_5ET_9365__000002_DN118JN,OPT,85 Scrooby Road,Bircotes,Doncaster,,,DN11 8JN,Tel: 01302 744300, - ,,,No ratings yet Rate it yourself - /Services/opticians/LeaveReview/DefaultView.aspx?id=OP_5ET_9365__000002_DN118JN,0,0,
Boots-Grimsby - Victoria St,OP_5AN_1566__000001_DN311UU,OPT,45 Victoria Street,,,Grimsby,Lincolnshire,DN31 1UU,Tel: 01472 242997, - ,,,No ratings yet Rate it yourself - /Services/opticians/LeaveReview/DefaultView.aspx?id=OP_5AN_1566__000001_DN311UU,0,0,
Tesco Opticians,OPT_5AN_019__000002_DN359QR,OPT,Hewitt Retail Park,Hewitt Avenue,Cleethorpes,North East Lincolnshire,,DN35 9QR,Tel: 0345 601 3479, - ,,,No ratings yet Rate it yourself - /Services/opticians/LeaveReview/DefaultView.aspx?id=OPT_5AN_019__000002_DN359QR,0,0,
Asda Vision,OPT_5AN 018__000002_DN329DL,OPT,Holles Street,,Grimsby,North East Lincolnshire,,DN32 9DL,Tel: 01472 243124, - ,,,No ratings yet Rate it yourself - /Services/opticians/LeaveReview/DefaultView.aspx?id=OPT_5AN 018__000002_DN329DL,0,0,
Eyesite Opticians Ltd,OP_5EF_4393__000002_DN185PD,OPT,42 High Street,,Barton-upon-Humber,North Lincolnshire,,DN18 5PD,Tel: 01652 635997, - ,,,No ratings yet Rate it yourself - /Services/opticians/LeaveReview/DefaultView.aspx?id=OP_5EF_4393__000002_DN185PD,0,0,
Smith & Walker (Optometrists) Ltd,OP_5EF_3196__000003_DN185PD,OPT,16 High Street,,Barton-upon-Humber,North Lincolnshire,,DN18 5PD,Tel: 01652 632315, - ,,,6 ratings Rate it yourself - /Services/opticians/LeaveReview/DefaultView.aspx?id=OP_5EF_3196__000003_DN185PD,,,
Specsavers Opticians,OP_5AN_14619__000001_DN353HL,OPT,36 St Peters Avenue,,Cleethorpes,,,DN35 8HL,Tel: 01472 608840, - ,,,No ratings yet Rate it yourself - /Services/opticians/LeaveReview/DefaultView.aspx?id=OP_5AN_14619__000001_DN353HL,0,0,
Stephens & Drew Opticians,OP_5AN_13993__000001_DN358JZ,OPT,9-11 Cross Street,Cleethorpes,North East Lincolnshire,Cleethorpes,,DN35 8JZ,Tel: 01472 691636, - ,,,No ratings yet Rate it yourself - /Services/opticians/LeaveReview/DefaultView.aspx?id=OP_5AN_13993__000001_DN358JZ,0,0,
Minster Optical Limited t/a Andrew Spybey & Associates,TP80E,OPT,,Willoughby House,,Nottinghamshire,,NG25 0HQ,, - ,,,No ratings yet Rate it yourself - /Services/opticians/LeaveReview/DefaultView.aspx?id=TP80E,0,0,
Pinder's Optometrists,OP_5AP_877__000003_NG250AA,OPT,20 Queen Street,,Southwell,,,NG25 0AA,Tel: 01636 812286, - ,,,No ratings yet Rate it yourself - /Services/opticians/LeaveReview/DefaultView.aspx?id=OP_5AP_877__000003_NG250AA,0,0,
Bell Brothers (Opticians) Ltd,OP_5EK_10465__000001_DN110PJ,OPT,9 Nelson Road,Rossington,,Doncaster,,DN11 0PE,Tel: 01302 868638, - ,,,No ratings yet Rate it yourself - /Services/opticians/LeaveReview/DefaultView.aspx?id=OP_5EK_10465__000001_DN110PJ,0,0,
Abbey Eyewear,OP_5EK_13597__000001_DN119QP,OPT,3 Castle Gate,Tickhill,Doncaster,,,DN11 9QP,Tel: 01302 750250, - ,,,No ratings yet Rate it yourself - /Services/opticians/LeaveReview/DefaultView.aspx?id=OP_5EK_13597__000001_DN119QP,0,0,
Arthur Leach Opticians,OP_5EK_967__000001_DN33AE,OPT,8 The Parade,Church Street,Armthorpe,Doncaster,,DN3 3AE,Tel: 01302 830168, - ,,,No ratings yet Rate it yourself - /Services/opticians/LeaveReview/DefaultView.aspx?id=OP_5EK_967__000001_DN33AE,0,0,
Spilsby Opticians,OP_5H9_8478__000001_PE235EF,OPT,6 Church Street,,Spilsby,,,PE23 5EF,Tel: 01790 753948, - ,,,No ratings yet Rate it yourself - /Services/opticians/LeaveReview/DefaultView.aspx?id=OP_5H9_8478__000001_PE235EF,0,0,no
Bell Brothers (Opticians) Ltd,OP_5EK_9712__000003_DN85DE,OPT,23 Finkle Street,Thorne,,Doncaster,South Yorkshire,DN8 5DE,Tel: 01405 812209, - ,,,No ratings yet Rate it yourself - /Services/opticians/LeaveReview/DefaultView.aspx?id=OP_5EK_9712__000003_DN85DE,0,0,
Parkhurst Opticians Ltd,OP_5EK_7517__000001_DN85DG,OPT,8 Finkle Street,Thorne,Doncaster,,,DN8 5DE,Tel: 01405 740095, - ,,,No ratings yet Rate it yourself - /Services/opticians/LeaveReview/DefaultView.aspx?id=OP_5EK_7517__000001_DN85DG,0,0,
Vision Care at Home,CO-5051-1,OPT,,Unit 14 Heather Court,Shawood Business Park,Doncaster,Yorkshire,DN2 5YL,Tel: 01302 859 308, - ,,,No ratings yet Rate it yourself - /Services/opticians/LeaveReview/DefaultView.aspx?id=CO-5051-1,0,0,
DI Blow Opticians,OP_5AP_13006__000002_NG210JP,OPT,"2 Sherwood Parade, Kirklington Road",Rainworth,Mansfield,,,NG21 0JP,Tel: 01623 797055, - ,,,No ratings yet Rate it yourself - /Services/opticians/LeaveReview/DefaultView.aspx?id=OP_5AP_13006__000002_NG210JP,0,0,