Organisation Name,NACS Code,Organisation Type,Address1,Address2,Address3,Address4,Address5,PostCode,Telephone Number,Opening time,Value  (Opening time),Banding Classification  (Opening time),NHS.UK users rating,Value  (NHS.UK users rating),Banding Classification  (NHS.UK users rating),Car parking (Is there car parking at this organisation?)
Whitakers Opticians Ltd,OP_5J6_11442__000001_HX62AE,OPT,,34 - 36 Wharf Street,,Sowerby Bridge,West Yorkshire,HX6 2AE,Tel: 01422 831030, - ,,,No ratings yet Rate it yourself - /Services/opticians/LeaveReview/DefaultView.aspx?id=OP_5J6_11442__000001_HX62AE,0,0,yes
Supervision Optics,270516HX13JP,OPT,,202 King Cross Road,,Halifax,West Yorkshire,HX1 3JP,Tel: 01422 323211, - ,,,1 rating Rate it yourself - /Services/opticians/LeaveReview/DefaultView.aspx?id=270516HX13JP,,,yes
King Cross Opticians,OP_HX13JP_29903,OPT,,220 King Cross Road,,Halifax,West Yorkshire,HX1 3JP,Tel: 01422 353000, - ,,,No ratings yet Rate it yourself - /Services/opticians/LeaveReview/DefaultView.aspx?id=OP_HX13JP_29903,0,0,
Andrew Lomas Optometrist Ltd,OP_5J6_8982__000001_HX50BW,OPT,31 Southgate,,Elland,,,HX5 0BW,Tel: 01422 372755, - ,,,No ratings yet Rate it yourself - /Services/opticians/LeaveReview/DefaultView.aspx?id=OP_5J6_8982__000001_HX50BW,0,0,
Whitakers Opticians Ltd,OP_5J6_11093__000001_HX50EP,OPT,,79 Southgate,,Elland,West Yorkshire,HX5 0EP,Tel: 01422 372008, - ,,,No ratings yet Rate it yourself - /Services/opticians/LeaveReview/DefaultView.aspx?id=OP_5J6_11093__000001_HX50EP,0,0,yes
NUR Vision Ltd,OPT_HD33XA_1,OPT,,Salendine Shopping Centre,144 Moor Nook Road,Huddersfield,,HD3 3XA,Tel: 01484 652670, - ,,,No ratings yet Rate it yourself - /Services/opticians/LeaveReview/DefaultView.aspx?id=OPT_HD33XA_1,0,0,
Mackereth Opticians,OP_5J6_8393__000001_HX12SE,OPT,,6 Regent Street,,Halifax,West Yorkshire,HX1 2SE,Tel: 01422 352883, - ,,,No ratings yet Rate it yourself - /Services/opticians/LeaveReview/DefaultView.aspx?id=OP_5J6_8393__000001_HX12SE,0,0,no
opticare Eye Care Specialist Ltd,270516HX14NJ,OPT,,276 Queens Road,,Halifax,,HX1 4NJ,Tel: 01422 364453, - ,,,No ratings yet Rate it yourself - /Services/opticians/LeaveReview/DefaultView.aspx?id=270516HX14NJ,0,0,
Boots-Halifax - Market St,OP_5J6_1088__000002_HX11PB,OPT,7-11 Market Street,,,Halifax,West Yorkshire,HX1 1PB,Tel: 01422352009, - ,,,3 ratings Rate it yourself - /Services/opticians/LeaveReview/DefaultView.aspx?id=OP_5J6_1088__000002_HX11PB,,,
I Care Opticians,OPT_HX11PB_1,OPT,i care opticians,36 Market Street,,Halifax,,HX1 1PB,Tel: 01422 385254, - ,,,No ratings yet Rate it yourself - /Services/opticians/LeaveReview/DefaultView.aspx?id=OPT_HX11PB_1,0,0,
Specsavers Opticians,QDT00:280__000002_HX11TQ,OPT,3-5 The Square,Woolshops Shopping Centre,,Halifax,,HX1 1RJ,Tel: 01422 255055, - ,,,No ratings yet Rate it yourself - /Services/opticians/LeaveReview/DefaultView.aspx?id=QDT00:280__000002_HX11TQ,0,0,
Vision Express (UK) Ltd,OP_5J6_3092__000001_HX11RU,OPT,6 Woolshops,,Halifax,Halifax,,HX1 1RU,Tel: 01422 331018, - ,,,No ratings yet Rate it yourself - /Services/opticians/LeaveReview/DefaultView.aspx?id=OP_5J6_3092__000001_HX11RU,0,0,
Hirst Opticians,OP_5J6_10501__000001_HX26AL,OPT,52 Keighley Road,Ovenden,Halifax,,,HX2 6AL,Tel: 01422 367348, - ,,,No ratings yet Rate it yourself - /Services/opticians/LeaveReview/DefaultView.aspx?id=OP_5J6_10501__000001_HX26AL,0,0,
Eye Department,OP_5LJ_769__000002_HD33EA,OPT,Royal Infirmary,Acre Street,Huddersfield,,,HD3 3EA,Tel: 01484 342000, - ,,,1 rating Rate it yourself - /Services/opticians/LeaveReview/DefaultView.aspx?id=OP_5LJ_769__000002_HD33EA,,,
Selbie Opticians,OP_5LJ_14671__000002_HD34HZ,OPT,65 Market Street,Milnsbridge,Huddersfield,,,HD3 4HZ,Tel: 01484 659119, - ,,,No ratings yet Rate it yourself - /Services/opticians/LeaveReview/DefaultView.aspx?id=OP_5LJ_14671__000002_HD34HZ,0,0,
Aldreds Opticians,OP_5LK_6551__000002_HD75AN,OPT,8 Carr Lane,Slaithwaite,Huddersfield,,,HD7 5AN,Tel: 01484 843023, - ,,,No ratings yet Rate it yourself - /Services/opticians/LeaveReview/DefaultView.aspx?id=OP_5LK_6551__000002_HD75AN,0,0,
Mark Andrew Hurst,HX2 8AL__000003_HX28AL,OPT,52 Keighley Road,Ovenden,Halifax,,,HX2 8AL,Tel: 01422 367348, - ,,,No ratings yet Rate it yourself - /Services/opticians/LeaveReview/DefaultView.aspx?id=HX2 8AL__000003_HX28AL,0,0,
Thornton & Wright Opticians,OP_5J6_3319__000001_HX38LT,OPT,Co-Operative Shopping Parade,Denholme Gate Road - Hipperholme,,Halifax,,HX3 8LT,Tel: 01422 201519, - ,,,No ratings yet Rate it yourself - /Services/opticians/LeaveReview/DefaultView.aspx?id=OP_5J6_3319__000001_HX38LT,0,0,
Focus Opticians,HD1 5HS__000001_HD15HS,OPT,56a Blacker Road,Birkby,Huddersfield,West Yorkshire,,HD1 5HS,Tel: 01484 534800, - ,,,No ratings yet Rate it yourself - /Services/opticians/LeaveReview/DefaultView.aspx?id=HD1 5HS__000001_HD15HS,0,0,
Donovan Smith Optometrist,OP_5J6_9787__000001_HD61JR,OPT,7 Bethel Street,,Brighouse,,,HD6 1JR,Tel: 01484 713291, - ,,,No ratings yet Rate it yourself - /Services/opticians/LeaveReview/DefaultView.aspx?id=OP_5J6_9787__000001_HD61JR,0,0,
Moorhouse Opticians (Northern) Ltd,OP_5J6_3354__000001_HD61DN,OPT,Park Street,,Brighouse,,,HD6 1JL,Tel: 01484 718050, - ,,,No ratings yet Rate it yourself - /Services/opticians/LeaveReview/DefaultView.aspx?id=OP_5J6_3354__000001_HD61DN,0,0,
Specsavers,OP_5J6_8425__000003_HD61AQ,OPT,55-57 Commercial Street,,,Brighouse,Yorkshire(West Riding),HD6 1AF,Tel: 01484 711222, - ,,,No ratings yet Rate it yourself - /Services/opticians/LeaveReview/DefaultView.aspx?id=OP_5J6_8425__000003_HD61AQ,0,0,
Brighouse Opticians Audiologists,E0I1F,OPT,11 Chapel Court,Park Street,Brighouse,Huddersfield,,HD6 1JH,Tel: 01484 718050, - ,,,No ratings yet Rate it yourself - /Services/opticians/LeaveReview/DefaultView.aspx?id=E0I1F,0,0,
Bradley & Smith,OP_5LJ_2388__000001_HD14EN,OPT,17 Greenhead Road,Marsh,Huddersfield,,,HD1 4EN,Tel: 01484 423119, - ,,,No ratings yet Rate it yourself - /Services/opticians/LeaveReview/DefaultView.aspx?id=OP_5LJ_2388__000001_HD14EN,0,0,
Specsavers,OP_5LJ_5938__000001_HD12ET,OPT,18 Market Street,18 Market Street,Huddersfield,Huddersfield,,HD1 2ET,Tel: 01484 544566, - ,,,No ratings yet Rate it yourself - /Services/opticians/LeaveReview/DefaultView.aspx?id=OP_5LJ_5938__000001_HD12ET,0,0,
Optical Express Limited,OPT_HD12HL_1,OPT,,N U House 3rd Floor,43 Market Street,Huddersfield,,HD1 2HL,Tel: 08455 558264, - ,,,No ratings yet Rate it yourself - /Services/opticians/LeaveReview/DefaultView.aspx?id=OPT_HD12HL_1,0,0,
E Beaumont Ltd,OP_5LJ_1212__000001_HD12AR,OPT,,16-18 Cloth Hall Street,,Huddersfield,,HD1 2EG,Tel: 01484 531084, - ,,,No ratings yet Rate it yourself - /Services/opticians/LeaveReview/DefaultView.aspx?id=OP_5LJ_1212__000001_HD12AR,0,0,
Optical Express,,OPT,,NU House,,Huddersfield ,,HD1 2LF,, - ,,,N/A - Data not available,,,
Scrivens,OP_5LJ_10650__000001_HD12DX,OPT,15 Cloth Hall Street,,,Huddersfield,,HD1 2DX,Tel: 01484 532176, - ,,,No ratings yet Rate it yourself - /Services/opticians/LeaveReview/DefaultView.aspx?id=OP_5LJ_10650__000001_HD12DX,0,0,
Vision Express (UK) Ltd,OP_5LJ_8913__000001_HD12AZ,OPT,,17 New Street,,Huddersfield,,HD1 2AZ,Tel: 01484 452442, - ,,,No ratings yet Rate it yourself - /Services/opticians/LeaveReview/DefaultView.aspx?id=OP_5LJ_8913__000001_HD12AZ,0,0,
Boots-Huddersfield - King St,OP_5LJ_2903__000002_HD12QE,OPT,22-24 King Street,,,Huddersfield,West Yorkshire,HD1 2QE,Tel: 01484 519229, - ,,,1 rating Rate it yourself - /Services/opticians/LeaveReview/DefaultView.aspx?id=OP_5LJ_2903__000002_HD12QE,,,
The Eye Clinic (Huddersfield),OPT_HD12TW_1,OPT,, 79 New Street,,Huddersfield,,HD1 2TW,, - ,,,1 rating Rate it yourself - /Services/opticians/LeaveReview/DefaultView.aspx?id=OPT_HD12TW_1,,,
Valli Opticians,OP_5LJ_10970__000001_HD13TG,OPT,24 Meltham Road,Lockwood,,Huddersfield,West Yorkshire,HD1 3TJ,Tel: 01484 533730, - ,,,No ratings yet Rate it yourself - /Services/opticians/LeaveReview/DefaultView.aspx?id=OP_5LJ_10970__000001_HD13TG,0,0,
University Valli Opticians,P3Y3Y,OPT,,"Ground Floor, Joseph Priestley East Building, University of Huddersfield, Queensgate",,Huddersfield,,HD1 3DH,, - ,,,No ratings yet Rate it yourself - /Services/opticians/LeaveReview/DefaultView.aspx?id=P3Y3Y,0,0,
Marten House,OP_5LJ_7282__000001_HD16SD,OPT,Fern Street,St andrews Road,Huddersfield,,,HD1 6SD,Tel: 01484 512211, - ,,,No ratings yet Rate it yourself - /Services/opticians/LeaveReview/DefaultView.aspx?id=OP_5LJ_7282__000001_HD16SD,0,0,
Souten & Agyemang,QDT-00:0182__000001_HD47HE,OPT,345 Meltham Road,Netherton,Huddersfield,West Yorkshire,,HD4 7EH,Tel: 01484 664433, - ,,,No ratings yet Rate it yourself - /Services/opticians/LeaveReview/DefaultView.aspx?id=QDT-00:0182__000001_HD47HE,0,0,yes
Allegro Optical,T6F9J,OPT,,30 Peel Street,,Marsden,,HD7 6BW,, - ,,,No ratings yet Rate it yourself - /Services/opticians/LeaveReview/DefaultView.aspx?id=T6F9J,0,0,
Clarus Opticians,OPT_HD58AA_1,OPT,,319 Old Wakefield Road,,Huddersfield,,HD5 8AA,, - ,,,No ratings yet Rate it yourself - /Services/opticians/LeaveReview/DefaultView.aspx?id=OPT_HD58AA_1,0,0,
Valli Opticians,OP_5J6_4094__000001_HX78AH,OPT,14 Albert Street,,Hebden Bridge,Hebden Bridge,,HX7 8AH,Tel: 01422 842084, - ,,,No ratings yet Rate it yourself - /Services/opticians/LeaveReview/DefaultView.aspx?id=OP_5J6_4094__000001_HX78AH,0,0,
Victoria Gore Optometrist,OP_5CG_5030__000002_BD132PA,OPT,72 - 74 High Street,Queensbury,Bradford,,,BD13 2PA,Tel: 01274 815861, - ,,,No ratings yet Rate it yourself - /Services/opticians/LeaveReview/DefaultView.aspx?id=OP_5CG_5030__000002_BD132PA,0,0,
Valli Opticians,QDT-00:133__000001_HX75LL,OPT,,1 Bridgegate,,Hebden Bridge,West Yorkshire,HX7 8EX,Tel: 01422 842084, - ,,,No ratings yet Rate it yourself - /Services/opticians/LeaveReview/DefaultView.aspx?id=QDT-00:133__000001_HX75LL,0,0,
Mark Hurst Opticians,HX7 8UQ__000001_HX78UQ,OPT,37 West End,Hebden Bridge,Halifax,West Yorkshire,,HX7 8UQ,Tel: 01422 843456, - ,,,1 rating Rate it yourself - /Services/opticians/LeaveReview/DefaultView.aspx?id=HX7 8UQ__000001_HX78UQ,,,
Allegro Optical,OPT_HD95NX_1,OPT,,1-3 Station Street,Meltham,Holmfirth,Yorkshire(West Riding),HD9 5NX,Tel: 01484 907090, - ,,,1 rating Rate it yourself - /Services/opticians/LeaveReview/DefaultView.aspx?id=OPT_HD95NX_1,,,
Valli Opticians,OP_5LK_2513__000001_HD73AF,OPT,29 Huddersfield Road,Meltham,,Huddersfield,,HD9 4AF,Tel: 01484 851381, - ,,,3 ratings Rate it yourself - /Services/opticians/LeaveReview/DefaultView.aspx?id=OP_5LK_2513__000001_HD73AF,,,
Wyke Opticians,OP_5CG_7482__000001_BD129JD,OPT,55 Towngate,Wyke,Bradford,Bradford ,,BD12 9JD,Tel: 01274 678701, - ,,,3 ratings Rate it yourself - /Services/opticians/LeaveReview/DefaultView.aspx?id=OP_5CG_7482__000001_BD129JD,,,
Valli Opticians Almondbury,HD5 8LR__000002_HD58LR,OPT,3 Benomley Road,Almondbury,Huddersfield,Huddersfield,,HD5 8LR,Tel: 01484 517768, - ,,,No ratings yet Rate it yourself - /Services/opticians/LeaveReview/DefaultView.aspx?id=HD5 8LR__000002_HD58LR,0,0,
Valli Opticians,OP_5LK_2514__000002_HD72AA,OPT,30 Westgate,Honley,,Huddersfield,,HD9 6AA,Tel: 01484 667406, - ,,,No ratings yet Rate it yourself - /Services/opticians/LeaveReview/DefaultView.aspx?id=OP_5LK_2514__000002_HD72AA,0,0,
Dr Stella Griffiths Ltd,OP 5LJ 10908__000002_HD58PZ,OPT,628 Wakefield Road,Waterloo,,Huddersfield,,HD5 8PZ,Tel: 01484 453833, - ,,,1 rating Rate it yourself - /Services/opticians/LeaveReview/DefaultView.aspx?id=OP 5LJ 10908__000002_HD58PZ,,,
Michael R Foster,OP_5CG_14045__000001_BD61QN,OPT,22 Fair Road,Wibsey,Bradford,,,BD6 1QN,Tel: 01274 604639, - ,,,No ratings yet Rate it yourself - /Services/opticians/LeaveReview/DefaultView.aspx?id=OP_5CG_14045__000001_BD61QN,0,0,
Eye Clinic Opticians Ltd,OPT_BD74EE_1,OPT,,738 Great Horton Road,,Bradford,Yorkshire(West Riding),BD7 4EE,Tel: 01274 772787, - ,,,No ratings yet Rate it yourself - /Services/opticians/LeaveReview/DefaultView.aspx?id=OPT_BD74EE_1,0,0,
Smith & Hughes Opticians,OP_5J7_10175__000001_BD193HS,OPT,37 Northgate,,Cleckheaton,,,BD19 3HS,Tel: 01274 873837, - ,,,No ratings yet Rate it yourself - /Services/opticians/LeaveReview/DefaultView.aspx?id=OP_5J7_10175__000001_BD193HS,0,0,
Openshaw Opticians,OP_5J7_9334__000001_BD195DN,OPT,Unit 4,16 Cheapside,,Cleckheaton,Yorkshire(West Riding),BD19 5AF,Tel: 01274 878214, - ,,,3 ratings Rate it yourself - /Services/opticians/LeaveReview/DefaultView.aspx?id=OP_5J7_9334__000001_BD195DN,,,yes
Cleckheaton Specsavers,M6D5T,OPT,,4/4B Central Parade,,Cleckheaton,Yorkshire,BD19 3RU,Tel: 01274 033147, - ,,,No ratings yet Rate it yourself - /Services/opticians/LeaveReview/DefaultView.aspx?id=M6D5T,0,0,
Optivu Eyecare Bradford,T8E3K,OPT,469 Great Horton Road,469 Great Horton Road,Bradford,Bradford,,BD7 3DL,Tel: 01274 574297, - ,,,No ratings yet Rate it yourself - /Services/opticians/LeaveReview/DefaultView.aspx?id=T8E3K,0,0,
Premier Vision Opticians,BD5_8HP_29042019,OPT,Inside Morrisons Supermarket,110 Mayo Avenue,,Bradford,,BD5 8HP,Tel: 01274 733 232, - ,,,No ratings yet Rate it yourself - /Services/opticians/LeaveReview/DefaultView.aspx?id=BD5_8HP_29042019,0,0,
K M Cockerill,OP_5J7_1243__000002_WF148AN,OPT,170 Huddersfield Road,,Mirfield,,,WF14 8AN,Tel: 01924 492061, - ,,,No ratings yet Rate it yourself - /Services/opticians/LeaveReview/DefaultView.aspx?id=OP_5J7_1243__000002_WF148AN,0,0,
Hanson Opticians,QDT206__000001_WF148AA,OPT,,164 Huddersfield Road,Mirfield,Mirfield,,WF14 8AN,Tel: 01924 491550, - ,,,6 ratings Rate it yourself - /Services/opticians/LeaveReview/DefaultView.aspx?id=QDT206__000001_WF148AA,,,
Specsales Eyecare,OPT_BD58DJ_1,OPT,,846 Manchester Road,,Bradford,,BD5 8DJ,, - ,,,No ratings yet Rate it yourself - /Services/opticians/LeaveReview/DefaultView.aspx?id=OPT_BD58DJ_1,0,0,
K S Opticians,OP_5CG_2359__000001_BD72JL,OPT,35 Beckside Road,Lidget Green,Bradford,,,BD7 2JL,Tel: 01274 522764, - ,,,1 rating Rate it yourself - /Services/opticians/LeaveReview/DefaultView.aspx?id=OP_5CG_2359__000001_BD72JL,,,
Christopher R Limbert,OP_5CG_9133__000001_BD58AB,OPT,T/A J R Morton (Bradford Ltd),24-26 New Cross Street,Bradford,,,BD5 8AB,Tel: 01274 394497, - ,,,No ratings yet Rate it yourself - /Services/opticians/LeaveReview/DefaultView.aspx?id=OP_5CG_9133__000001_BD58AB,0,0,
S W Allen Ltd,OP_5J6_6334__000001_OL145AB,OPT,19 Water Street,,Todmorden,,,OL14 5AB,Tel: 01706 815551, - ,,,No ratings yet Rate it yourself - /Services/opticians/LeaveReview/DefaultView.aspx?id=OP_5J6_6334__000001_OL145AB,0,0,
Patricia Hooson ,OP_5J5_14210__000001_OL159DB,OPT,46 Victoria Street,Littleborough,,Rochdale,,OL15 9DB,Tel: 01706 379783, - ,,,No ratings yet Rate it yourself - /Services/opticians/LeaveReview/DefaultView.aspx?id=OP_5J5_14210__000001_OL159DB,0,0,
Optikal,OP_BD57QH_29545,OPT,,718 Manchester Road,,Bradford,West Yorkshire,BD5 7QH,Tel: 01274 615030, - ,,,No ratings yet Rate it yourself - /Services/opticians/LeaveReview/DefaultView.aspx?id=OP_BD57QH_29545,0,0,
Henderson Opticians Ltd,HD97EQ__000001_HD97EQ,OPT,104 School Street,,Holmfirth,,,HD9 7EQ,Tel: 01484 686060, - ,,,No ratings yet Rate it yourself - /Services/opticians/LeaveReview/DefaultView.aspx?id=HD97EQ__000001_HD97EQ,0,0,
Neil Kaye Optometrists,OP_5LK_4603__000001_HD71DN,OPT,,1 Victoria Street,,Holmfirth,,HD9 2DN,Tel: 01484 683152, - ,,,1 rating Rate it yourself - /Services/opticians/LeaveReview/DefaultView.aspx?id=OP_5LK_4603__000001_HD71DN,,,
Premier Vision,OP_5J7_10379__000001_WF160HX,OPT,Morrisons Supermarket,Unit 1,17 Union Street,Heckmondwike,,WF16 0HL,Tel: 01924 409660, - ,,,No ratings yet Rate it yourself - /Services/opticians/LeaveReview/DefaultView.aspx?id=OP_5J7_10379__000001_WF160HX,0,0,
HD Opticare,E9X0Z,OPT,,"Asda, Rooley Lane",,Bradford,,BD4 7SR,, - ,,,5 ratings Rate it yourself - /Services/opticians/LeaveReview/DefaultView.aspx?id=E9X0Z,,,
Premier Vision,TP90X,OPT,Unit 4,Victoria Centre,Thornton Road,Bradford,West Yorkshire,BD8 9BN,Tel: 01274 499550, - ,,,No ratings yet Rate it yourself - /Services/opticians/LeaveReview/DefaultView.aspx?id=TP90X,0,0,
Specsavers Opticians,OP_5CF_14049__000002_BD89BN,OPT,"Unit 12, Victoria Shopping Centre",Thornton Road,Bradford,,,BD8 9BN,Tel: 01274 480030, - ,,,No ratings yet Rate it yourself - /Services/opticians/LeaveReview/DefaultView.aspx?id=OP_5CF_14049__000002_BD89BN,0,0,
Phipps Opticians,OP_5J7_11208__000001_WF160HW,OPT,63 Market Place,,Heckmondwike,,,WF16 0EZ,Tel: 01924 409334, - ,,,No ratings yet Rate it yourself - /Services/opticians/LeaveReview/DefaultView.aspx?id=OP_5J7_11208__000001_WF160HW,0,0,
Armitage Allot & Partners,OP_5J7_179__000001_WF160JU,OPT,14 Market Street,,Heckmondwike,,,WF16 0JU,Tel: 01924 403617, - ,,,2 ratings Rate it yourself - /Services/opticians/LeaveReview/DefaultView.aspx?id=OP_5J7_179__000001_WF160JU,,,
University of Bradford,OP_5CF_1417__000001_BD71DP,OPT,Unit 36 - 38 Science Park,"Forster Building, Listerhills Science Park",Bradford,,,BD7 1HR,Tel: 01274 234649, - ,,,No ratings yet Rate it yourself - /Services/opticians/LeaveReview/DefaultView.aspx?id=OP_5CF_1417__000001_BD71DP,0,0,
Tunnacliffe & Lambert Ltd,OP_5CG_12140__000001_BD46HD,OPT,100 Tong Street,,Bradford,,,BD4 6HD,Tel: 01274 682497, - ,,,No ratings yet Rate it yourself - /Services/opticians/LeaveReview/DefaultView.aspx?id=OP_5CG_12140__000001_BD46HD,0,0,
Tong Optical Services,BD4 6LY__000001_BD46LY,OPT,TONG OPTICIANS,299 Tong Street,,Bradford,,BD4 9QS,Tel: 01274 687091, - ,,,No ratings yet Rate it yourself - /Services/opticians/LeaveReview/DefaultView.aspx?id=BD4 6LY__000001_BD46LY,0,0,
Eyedeal Optical (Yorkshire) Ltd,OP_5CF_4568__000001_BD95ER,OPT,45-47 Duckworth Lane,45 Duckworth Lane,Bradford,Bradford,,BD9 5ET,Tel: 01274 488825, - ,,,No ratings yet Rate it yourself - /Services/opticians/LeaveReview/DefaultView.aspx?id=OP_5CF_4568__000001_BD95ER,0,0,
Crossroads Optical Centre,OP_5CF_14050__000002_BD95HB,OPT,54 Duckworth Lane,Bradford,West Yorkshire,,,BD9 5HB,Tel: 01274 544520, - ,,,No ratings yet Rate it yourself - /Services/opticians/LeaveReview/DefaultView.aspx?id=OP_5CF_14050__000002_BD95HB,0,0,
Dr Stewart Mitchell (Eyecare) LLP ,OP_5CF_14042__000001_BD12SH,OPT,Sidney Fraser,81 Godwin Street,West Yorkshire,Bradford,West Yorkshire,BD1 2SH,Tel: 01274 723362, - ,,,1 rating Rate it yourself - /Services/opticians/LeaveReview/DefaultView.aspx?id=OP_5CF_14042__000001_BD12SH,,,
Premier Vision,OPT_BD11RU_1,OPT,,25 - 27 Tyrrel Street,,Bradford,,BD1 1RU,Tel: 01274 731313, - ,,,No ratings yet Rate it yourself - /Services/opticians/LeaveReview/DefaultView.aspx?id=OPT_BD11RU_1,0,0,
Lloyd & Robinson Opticians,OP_5CF_5101__000002_BD12QR,OPT,,64 Westgate,,Bradford,,BD1 2QR,Tel: 01274 720631, - ,,,1 rating Rate it yourself - /Services/opticians/LeaveReview/DefaultView.aspx?id=OP_5CF_5101__000002_BD12QR,,,
Maxivision,OP_5CF_10291__000001_BD12QR,OPT,40 Westgate,,Bradford,,,BD1 2QR,Tel: 01274 742724, - ,,,No ratings yet Rate it yourself - /Services/opticians/LeaveReview/DefaultView.aspx?id=OP_5CF_10291__000001_BD12QR,0,0,
City Eyewear,OP_5CF_14040__000001_BD11SW,OPT,24 Ivegate,Bradford,West Yorkshire,,,BD1 1SW,Tel: 01274 729393, - ,,,No ratings yet Rate it yourself - /Services/opticians/LeaveReview/DefaultView.aspx?id=OP_5CF_14040__000001_BD11SW,0,0,
Sarah Farrar Opticians Ltd,OPT_BD150HX_1,OPT,,160 Main Street,,Wilsden,Yorkshire,BD15 0HX,Tel: 01535 274963, - ,,,2 ratings Rate it yourself - /Services/opticians/LeaveReview/DefaultView.aspx?id=OPT_BD150HX_1,,,no
Optivu Eyecare Bradford,W8P3B,OPT,,15 John Street,,Bradford,,BD1 3JS,Tel: 01274 727232, - ,,,No ratings yet Rate it yourself - /Services/opticians/LeaveReview/DefaultView.aspx?id=W8P3B,0,0,
I Wear Opticians (North) Ltd,BD1 1PP__000001_BD11PP,OPT,133 Godwin Street,,Bradford,West Yorkshire,,BD1 1PP,Tel: 01274 391203, - ,,,No ratings yet Rate it yourself - /Services/opticians/LeaveReview/DefaultView.aspx?id=BD1 1PP__000001_BD11PP,0,0,
Specsavers Optical Superstore,OP_5CF_2796__000001_BD13HA,OPT,20 Broadway,,Bradford,Bradford,,BD1 1EY,Tel: 01274 730052, - ,,,No ratings yet Rate it yourself - /Services/opticians/LeaveReview/DefaultView.aspx?id=OP_5CF_2796__000001_BD13HA,0,0,
Dental & Optical Services,OP_5CF_14041__000001_BD13SH,OPT,5 Rawson Road,Bradford,,West Yorkshire,,BD1 3SH,Tel: 01274 723311, - ,,,No ratings yet Rate it yourself - /Services/opticians/LeaveReview/DefaultView.aspx?id=OP_5CF_14041__000001_BD13SH,0,0,
Boots Opticians Broadway Centre,OP_5CF_2938__000001_BD13LE,OPT,Broadway Centre,25 Charles Street,,Bradford,West Yorkshire,BD1 1US,Tel: 01274 305876, - ,,,No ratings yet Rate it yourself - /Services/opticians/LeaveReview/DefaultView.aspx?id=OP_5CF_2938__000001_BD13LE,0,0,
Vision Express (UK) Ltd,BD11US2811,OPT,,43 Charles Street Mall,Broadway Centre,Bradford,West Yorkshire,BD1 1US,Tel: 01274 521299, - ,,,1 rating Rate it yourself - /Services/opticians/LeaveReview/DefaultView.aspx?id=BD11US2811,,,
Spectacular Optics,BRA171__000001_BD94QX,OPT,Oaklane Opticians,68 Oak Lane,Bradford,West Yorkshire,,BD9 4QX,Tel: 01274 491130, - ,,,No ratings yet Rate it yourself - /Services/opticians/LeaveReview/DefaultView.aspx?id=BRA171__000001_BD94QX,0,0,yes
Dewsbury Eyecare,OPT_WF134HT_1,OPT,Dewsbury Eyecare,Optometrists and Opticians,Healds road surgery,Dewsbury,West Yorkshire,WF13 4HT,Tel: 01924 570500, - ,,,No ratings yet Rate it yourself - /Services/opticians/LeaveReview/DefaultView.aspx?id=OPT_WF134HT_1,0,0,
Yates & Suddell,OP_5JY_4206__000001_OL163NW,OPT,,109 Dale Street,Rochdale,Milnrow,Lancashire,OL16 3NW,Tel: 01706 642203, - ,,,No ratings yet Rate it yourself - /Services/opticians/LeaveReview/DefaultView.aspx?id=OP_5JY_4206__000001_OL163NW,0,0,
Eye Pharmacy,QDT212__000001_WF133RJ,OPT,Unit 6d,Ravensthorpe Retail Park,Dewsbury,West Yorkshire,,WF13 3RJ,Tel: 01924 466188, - ,,,No ratings yet Rate it yourself - /Services/opticians/LeaveReview/DefaultView.aspx?id=QDT212__000001_WF133RJ,0,0,
Eyecare Outlet,181120160853,OPT,Eyecare Outlet,19 Oak Lane,,Bradford,,BD9 4PU,Tel: 01274 921129, - ,,,1 rating Rate it yourself - /Services/opticians/LeaveReview/DefaultView.aspx?id=181120160853,,,
Mr K M Latif,OP_5CF_2423__000001_BD39TY,OPT,810 Leeds Road,,Bradford,,,BD3 9TY,Tel: 01274 664162, - ,,,No ratings yet Rate it yourself - /Services/opticians/LeaveReview/DefaultView.aspx?id=OP_5CF_2423__000001_BD39TY,0,0,
Eyecare Matters,OPT_WF179EW_1,OPT,,15 Low Lane,Birstall,Batley,,WF17 9EW,Tel: 01924 473813, - ,,,No ratings yet Rate it yourself - /Services/opticians/LeaveReview/DefaultView.aspx?id=OPT_WF179EW_1,0,0,
20/20 Saddleworth Limited,OP_5J5_14337__000001_OL36AY,OPT,61 High Street,Uppermill,Oldham,,,OL3 6AP,Tel: 01457 872020, - ,,,No ratings yet Rate it yourself - /Services/opticians/LeaveReview/DefaultView.aspx?id=OP_5J5_14337__000001_OL36AY,0,0,
Vision Centre (BFD) LTD,OPT_BD39ER_1,OPT,,1 Silkstone Road,,Bradford,,BD3 9ER,Tel: 01274 981917, - ,,,No ratings yet Rate it yourself - /Services/opticians/LeaveReview/DefaultView.aspx?id=OPT_BD39ER_1,0,0,
Robertsons Opticians,OPT_BD30JF_1,OPT,,195-197 Otley Road,,Bradford,,BD3 0JF,Tel: 01274 639245, - ,,,No ratings yet Rate it yourself - /Services/opticians/LeaveReview/DefaultView.aspx?id=OPT_BD30JF_1,0,0,
Opticare,QDT215__000002_WF132HQ,OPT,,5 Oxford Street,,Batley,,WF17 7PZ,Tel: 01924 4555777, - ,,,1 rating Rate it yourself - /Services/opticians/LeaveReview/DefaultView.aspx?id=QDT215__000002_WF132HQ,,,
Insight Optical,OP_5CF_9165__000002_BD38QJ,OPT,883 Barkerend Road,883 Barkerend Road,,Bradford,,BD3 8QJ,Tel: 01274 663218, - ,,,No ratings yet Rate it yourself - /Services/opticians/LeaveReview/DefaultView.aspx?id=OP_5CF_9165__000002_BD38QJ,0,0,
Crossroads Optical Centre,OP_5AW_2673__000001_BD229BA,OPT,Sunderland House,Halifax Road,Keighley,,,BD22 9BA,Tel: 01535 645863, - ,,,No ratings yet Rate it yourself - /Services/opticians/LeaveReview/DefaultView.aspx?id=OP_5AW_2673__000001_BD229BA,0,0,