Organisation Name,NACS Code,Organisation Type,Address1,Address2,Address3,Address4,Address5,PostCode,Telephone Number,Opening time,Value  (Opening time),Banding Classification  (Opening time),NHS.UK users rating,Value  (NHS.UK users rating),Banding Classification  (NHS.UK users rating),Car parking (Is there car parking at this organisation?)
Vision Express,OP_HP198BU_46733,OPT,,"Tesco Express, Broadfields Retail Park",,Aylesbury,Buckinghamshire,HP19 8BU,Tel: 0129 685 0228, - ,,,No ratings yet Rate it yourself - /Services/opticians/LeaveReview/DefaultView.aspx?id=OP_HP198BU_46733,0,0,
Fairford Eyes Ltd,OP_5DP_219__000004_HP197HL,OPT,52 Wedgewood Street,Fairford Leys,Aylesbury,Buckinghamshire,,HP19 7HL,Tel: 01296 399775, - ,,,No ratings yet Rate it yourself - /Services/opticians/LeaveReview/DefaultView.aspx?id=OP_5DP_219__000004_HP197HL,0,0,
J Coad Ltd,OP_5DP_12091__000001_HP202HU,OPT,Portman House,9 George Street,,Aylesbury,Buckinghamshire,HP20 2HU,Tel: 01296 486228, - ,,,No ratings yet Rate it yourself - /Services/opticians/LeaveReview/DefaultView.aspx?id=OP_5DP_12091__000001_HP202HU,0,0,no
F & S Opticians,OP_5DP_9903__000002_HP201RS,OPT,40a Cambridge Street,,Aylesbury,,,HP20 1RS,Tel: 01296 435677, - ,,,No ratings yet Rate it yourself - /Services/opticians/LeaveReview/DefaultView.aspx?id=OP_5DP_9903__000002_HP201RS,0,0,
Nu-Sight Opticians,OP_5DP_4409__000001_HP201RS,OPT,30 Cambridge Street,,,Aylesbury,Buckinghamshire,HP20 1RS,Tel: 01296 398941, - ,,,1 rating Rate it yourself - /Services/opticians/LeaveReview/DefaultView.aspx?id=OP_5DP_4409__000001_HP201RS,,,
Specsavers Opticians,OP_5DP_14310__000001_HP201SH,OPT,13-15 High Street,Aylesbury,Buckinghamshire,,,HP20 1SH,Tel: 01296 469 700, - ,,,No ratings yet Rate it yourself - /Services/opticians/LeaveReview/DefaultView.aspx?id=OP_5DP_14310__000001_HP201SH,0,0,
Aylesbury V.E. Limited,,OPT,,Friars Square Shopping Centre,,Aylesbury,,HP20 2SP,Tel: 01296 338 560, - ,,,N/A - Data not available,,,
Boots-Aylesbury - Hale Leys,OP_5DP_21__000001_HP201SG,OPT,,4 Hale Leys Shopping Centre,High Street,Aylesbury,Buckinghamshire,HP20 1ST,Tel: 01296 426938, - ,,,No ratings yet Rate it yourself - /Services/opticians/LeaveReview/DefaultView.aspx?id=OP_5DP_21__000001_HP201SG,0,0,
Boots-Princes Risborough,OP_5DP_236__000001_HP270AT,OPT,23 Duke Street,,,Princes Risborough,Buckinghamshire,HP27 0AT,Tel: 01844 344374, - ,,,No ratings yet Rate it yourself - /Services/opticians/LeaveReview/DefaultView.aspx?id=OP_5DP_236__000001_HP270AT,0,0,
Chilton Watson Ltd,OP_5DP_267__000001_HP170AE,OPT,51 High Street,,,Princes Risborough,Buckinghamshire,HP27 0AE,Tel: 01844 345674, - ,,,No ratings yet Rate it yourself - /Services/opticians/LeaveReview/DefaultView.aspx?id=OP_5DP_267__000001_HP170AE,0,0,
Brian Clark Opticians,OP_5GW_8971__000001_HP234AF,OPT,110 High Street,,Tring,,,HP23 4AF,Tel: 01442 823034, - ,,,No ratings yet Rate it yourself - /Services/opticians/LeaveReview/DefaultView.aspx?id=OP_5GW_8971__000001_HP234AF,0,0,
Thame Specsavers Limited,O9Q0Q,OPT,,109 High Street,,Thame,,OX9 3DZ,Tel: 01844 394765, - ,,,2 ratings Rate it yourself - /Services/opticians/LeaveReview/DefaultView.aspx?id=O9Q0Q,,,
Robert Stanley Opticians,OP_5DP_14311__000004_OX92BL,OPT,22 Cornmarket,,Thame,Oxon,,OX9 2BL,Tel: 01844 261096, - ,,,No ratings yet Rate it yourself - /Services/opticians/LeaveReview/DefaultView.aspx?id=OP_5DP_14311__000004_OX92BL,0,0,
Brian Clark,OP_5DP_3224__000001_MK183HB,OPT,42 High Street,Winslow,Buckingham,,,MK18 3HB,Tel: 01296 712043, - ,,,No ratings yet Rate it yourself - /Services/opticians/LeaveReview/DefaultView.aspx?id=OP_5DP_3224__000001_MK183HB,0,0,
Susan Collier Ltd,OP_5G4_14307__000001_HP160NZ,OPT,The Geans,3 Wycombe Road,Prestwood,Buckinghamshire,,HP16 0NZ,Tel: 01494 866270, - ,,,No ratings yet Rate it yourself - /Services/opticians/LeaveReview/DefaultView.aspx?id=OP_5G4_14307__000001_HP160NZ,0,0,
Juma Opticians,OP_5P2_18__000002_LU71DN,OPT,3 High Street,,Leighton Buzzard,Bedfordshire,,LU7 1DN,, - ,,,No ratings yet Rate it yourself - /Services/opticians/LeaveReview/DefaultView.aspx?id=OP_5P2_18__000002_LU71DN,0,0,
Brian Clark Opticians,OP_5GE_2973__000001_LU77EA,OPT,38 High Street,,Leighton Buzzard,Beds,,LU7 7EA,Tel: 01525 372238, - ,,,No ratings yet Rate it yourself - /Services/opticians/LeaveReview/DefaultView.aspx?id=OP_5GE_2973__000001_LU77EA,0,0,
Specsavers Opticians,OP_5GE___000001_LU71DH,OPT,18 Waterborne Walk,,Leighton Buzzard,Beds,,LU7 1DH,Tel: 01525 219030, - ,,,No ratings yet Rate it yourself - /Services/opticians/LeaveReview/DefaultView.aspx?id=OP_5GE___000001_LU71DH,0,0,
Allders Opticians,OP_5GE_11683__000002_LU77EU,OPT,1 Market Square,,Leighton Buzzard,Beds,,LU7 1EU,Tel: 01525 374191, - ,,,No ratings yet Rate it yourself - /Services/opticians/LeaveReview/DefaultView.aspx?id=OP_5GE_11683__000002_LU77EU,0,0,
D King Opticians ,OP_5GE_9067__000001_LU77EN,OPT,,2 North Street,,Leighton Buzzard,,LU7 1EN,Tel: 01525 850312, - ,,,No ratings yet Rate it yourself - /Services/opticians/LeaveReview/DefaultView.aspx?id=OP_5GE_9067__000001_LU77EN,0,0,
Chiltern Opticians,OP_5G4_14306__000001_HP160AN,OPT,75 High Street,,Great Missenden,,,HP16 0AL,Tel: 01494 868496, - ,,,No ratings yet Rate it yourself - /Services/opticians/LeaveReview/DefaultView.aspx?id=OP_5G4_14306__000001_HP160AN,0,0,
Leigh Lewis Optometrists,OL01167875QD__000001_HP144TH,OPT,247 Main Road,,Walters Ash,Buckinghamshire,,HP14 4TH,Tel: 01494 564600, - ,,,No ratings yet Rate it yourself - /Services/opticians/LeaveReview/DefaultView.aspx?id=OL01167875QD__000001_HP144TH,0,0,
Adams Opticians,OP_5GW_10912__000001_HP41AD,OPT,193 High Street,,Berkhamsted,,,HP4 1AD,Tel: 01442 865852, - ,,,No ratings yet Rate it yourself - /Services/opticians/LeaveReview/DefaultView.aspx?id=OP_5GW_10912__000001_HP41AD,0,0,
David Paul,OP_5GW_7933__000003_HP41AG,OPT,236 High Street,,,Berkhamsted,,HP4 1AG,Tel: 01442 879303, - ,,,3 ratings Rate it yourself - /Services/opticians/LeaveReview/DefaultView.aspx?id=OP_5GW_7933__000003_HP41AG,,,
Boots-Berkhamstead,OP_5GW_9591__000002_HP41AG,OPT,,242 High Street,,Berkhamsted,,HP4 1AG,Tel: 01442 865911, - ,,,No ratings yet Rate it yourself - /Services/opticians/LeaveReview/DefaultView.aspx?id=OP_5GW_9591__000002_HP41AG,0,0,
Brian D Suttie (Chesham) Ltd,OP_5G4_3082__000001_HP53DX,OPT,44 Broad Street,,Chesham,,,HP5 3DX,Tel: 01494 784141, - ,,,1 rating Rate it yourself - /Services/opticians/LeaveReview/DefaultView.aspx?id=OP_5G4_3082__000001_HP53DX,,,
Boots-Chesham,OLCO32345QD__000003_HP51EP,OPT,18 High Street,,,Chesham,Buckinghamshire,HP5 1EP,Tel: 01494 793498, - ,,,No ratings yet Rate it yourself - /Services/opticians/LeaveReview/DefaultView.aspx?id=OLCO32345QD__000003_HP51EP,0,0,
Turner and Browning Opticians,OP_5G4_188__000002_HP51EP,OPT,4 High Street,,Chesham,,,HP5 1EP,Tel: 01494 782957, - ,,,No ratings yet Rate it yourself - /Services/opticians/LeaveReview/DefaultView.aspx?id=OP_5G4_188__000002_HP51EP,0,0,
Ultimate Eyewear Company,OP_5G4_14972__000001_HP51BG,OPT,25a The High Street,,Chesham,,,HP5 1BG,Tel: 01494 794466, - ,,,1 rating Rate it yourself - /Services/opticians/LeaveReview/DefaultView.aspx?id=OP_5G4_14972__000001_HP51BG,,,
Specsavers Opticians,OP_5QD_0115899__000002_HP51BG,OPT,9 High Street,,Chesham,Buckinghamshire,,HP5 1BG,Tel: 01494 777190, - ,,,No ratings yet Rate it yourself - /Services/opticians/LeaveReview/DefaultView.aspx?id=OP_5QD_0115899__000002_HP51BG,0,0,
Boots-Bletchley,OP_5CQ_6564__000001_MK22HE,OPT,4 The Concourse,Brunel Centre,,Bletchley,,MK2 2HE,Tel: 01908 270247, - ,,,No ratings yet Rate it yourself - /Services/opticians/LeaveReview/DefaultView.aspx?id=OP_5CQ_6564__000001_MK22HE,0,0,
Specsavers Opticians,OP_5CQ_7450__000001_MK22RU,OPT,110 Queensway,Bletchley,Milton Keynes,,,MK2 2RU,Tel: 01908 365533, - ,,,2 ratings Rate it yourself - /Services/opticians/LeaveReview/DefaultView.aspx?id=OP_5CQ_7450__000001_MK22RU,,,
The Practice Opticians,OP_5G5_14974__000001_HP157BS,OPT,26 Eastern Dene,Hazlemere,,High Wycombe,Buckinghamshire,HP15 7BS,Tel: 01494 716708, - ,,,No ratings yet Rate it yourself - /Services/opticians/LeaveReview/DefaultView.aspx?id=OP_5G5_14974__000001_HP157BS,0,0,
D W Roberts Optometrists,OP_5CQ_8648__000001_MK22DR,OPT,63 Queensway,Bletchley,Milton Keynes,,,MK2 2DR,Tel: 01908 373131, - ,,,No ratings yet Rate it yourself - /Services/opticians/LeaveReview/DefaultView.aspx?id=OP_5CQ_8648__000001_MK22DR,0,0,
Clearsight Opticians,OP_5CQ_7471__000002_MK44DD,OPT,11 Barnsdale Drive,Westcroft,Milton Keynes,Milton Keynes,,MK4 4DD,Tel: 01908 504740, - ,,,10 ratings Rate it yourself - /Services/opticians/LeaveReview/DefaultView.aspx?id=OP_5CQ_7471__000002_MK44DD,,,
The Contact Lens Clinic,OP_5CQ_14311__000002_MK22EH,OPT,233 Queensway,,Bletchley,,,MK2 2EH,Tel: 01908 366882, - ,,,No ratings yet Rate it yourself - /Services/opticians/LeaveReview/DefaultView.aspx?id=OP_5CQ_14311__000002_MK22EH,0,0,
T J Lodge,OP_5CQ_2684__000001_MK22BA,OPT,58-60 Aylesbury Street,,Fenny Stratford,,,MK2 2BA,Tel: 01908 648565, - ,,,No ratings yet Rate it yourself - /Services/opticians/LeaveReview/DefaultView.aspx?id=OP_5CQ_2684__000001_MK22BA,0,0,
Asda Opticians,OPT_MK1 1SR,OPT,,BLETCHAM WAY,BLETCHLEY,MILTON KEYNES,,MK1 1SR,Tel: 01908 362 520, - ,,,1 rating Rate it yourself - /Services/opticians/LeaveReview/DefaultView.aspx?id=OPT_MK1 1SR,,,
A R Salter,OP_5G5_5759__000001_HP112EL,OPT,65 Bridge Street,,High Wycombe,,,HP11 2EL,Tel: 01494 527130, - ,,,No ratings yet Rate it yourself - /Services/opticians/LeaveReview/DefaultView.aspx?id=OP_5G5_5759__000001_HP112EL,0,0,
M&S Opticians (High Wycombe),N9V1C,OPT,,"M&S, 1 Eden Place",The Eden Centre,High Wycombe,,HP11 2DH,Tel: 01494 321 717, - ,,,No ratings yet Rate it yourself - /Services/opticians/LeaveReview/DefaultView.aspx?id=N9V1C,0,0,
Redgate Opticians & Audiologists,TP8JG,OPT,,3-4 Queens Square,,High Wycombe,Buckinghamshire,HP11 2BP,Tel: 01494 258 690, - ,,,2 ratings Rate it yourself - /Services/opticians/LeaveReview/DefaultView.aspx?id=TP8JG,,,
Scrivens Opticians,OP_5G5_96__000002_HP112DF,OPT,,18 Queen Square,,High Wycombe,Buckinghamshire,HP11 2DF,Tel: 01494 526058, - ,,,No ratings yet Rate it yourself - /Services/opticians/LeaveReview/DefaultView.aspx?id=OP_5G5_96__000002_HP112DF,0,0,
High Wycombe VE Ltd,,OPT,,"Eden Shopping Centre, Newland Street",High Wycombe,Buckinghamshire,,HP11 2BY,Tel: 01494 473399, - ,,,N/A - Data not available,,,
Specsavers Opticians,OP_5G5_12596__000001_HP112DG,OPT,27/31 White Hart Street,,,High Wycombe,Buckinghamshire,HP11 2HL,Tel: 01494 520304, - ,,,No ratings yet Rate it yourself - /Services/opticians/LeaveReview/DefaultView.aspx?id=OP_5G5_12596__000001_HP112DG,0,0,
Boots-High Wycombe - Eden Walk (in Boots UK),OP_5G5_6341__000002_HP112HR,OPT,27 Eden Walk,,Eden Centre,High Wycombe,Buckinghamshire,HP11 2AU,Tel: 01494 459610, - ,,,2 ratings Rate it yourself - /Services/opticians/LeaveReview/DefaultView.aspx?id=OP_5G5_6341__000002_HP112HR,,,
Chilton Watson Ltd,OP_5G4_14308__000003_HP65DR,OPT,85/87 Sycamore Road,Amersham,,Amersham,,HP6 5EJ,Tel: 01494 721795, - ,,,1 rating Rate it yourself - /Services/opticians/LeaveReview/DefaultView.aspx?id=OP_5G4_14308__000003_HP65DR,,,
Brown & Wenman Opticians,OP_5GE_980__000001_LU61SA,OPT,,18 Albion Street,,Dunstable,Bedfordshire,LU6 1SA,Tel: 01582 663770, - ,,,No ratings yet Rate it yourself - /Services/opticians/LeaveReview/DefaultView.aspx?id=OP_5GE_980__000001_LU61SA,0,0,yes
Boots Opticians,OP_5G4_1431__000001_HP65EQ,OPT,,69 Sycamore Road,,Amersham,Buckinghamshire,HP6 5EQ,Tel: 01494 728753, - ,,,2 ratings Rate it yourself - /Services/opticians/LeaveReview/DefaultView.aspx?id=OP_5G4_1431__000001_HP65EQ,,,
Specsavers (Amersham),,OPT,,51 Sycamore Road,,Amersham,,HP6 5EQ,Tel: 01494 418752, - ,,,N/A - Data not available,,,
Specsavers (Amersham),,OPT,,51 Sycamore Road,,Amersham,,HP6 5EQ,Tel: 01494 418752, - ,,,N/A - Data not available,,,
David Williams ,HP11 1BA_22222,OPT,,7 Queen Victoria Road,,High Wycombe,,HP11 1BA,Tel: 01494 443448, - ,,,1 rating Rate it yourself - /Services/opticians/LeaveReview/DefaultView.aspx?id=HP11 1BA_22222,,,
Hill Vision,OPT_HP65BX_1,OPT,CrossEyes,53 Hill Avenue,,Amersham,Buckinghamshire,HP6 5BX,Tel: 01494 258586, - ,,,No ratings yet Rate it yourself - /Services/opticians/LeaveReview/DefaultView.aspx?id=OPT_HP65BX_1,0,0,
Grant & Glass Opticians,OP_5GE_11812__000001_LU63SN,OPT,,5a Queensway,,Dunstable,,LU5 4DW,Tel: 01582 608449, - ,,,No ratings yet Rate it yourself - /Services/opticians/LeaveReview/DefaultView.aspx?id=OP_5GE_11812__000001_LU63SN,0,0,
Allders Opticians,OP_5GE_10409__000001_LU61LA,OPT,42 High Street North,,Dunstable,Beds,,LU6 1LA,Tel: 01582 664815, - ,,,No ratings yet Rate it yourself - /Services/opticians/LeaveReview/DefaultView.aspx?id=OP_5GE_10409__000001_LU61LA,0,0,
Specsavers Opticians,OP_5GE_11767__000003_LU54RH,OPT,17-19  Broadwalk,Quadrant,Dunstable,Beds,,LU5 4RH,Tel: 01582 475404, - ,,,No ratings yet Rate it yourself - /Services/opticians/LeaveReview/DefaultView.aspx?id=OP_5GE_11767__000003_LU54RH,0,0,
Boots-Dunstable,OP_5GE_11942__000004_LU54RH,OPT,42 Broadwalk North,,,Dunstable,Bedfordshire,LU5 4RH,Tel: 01582 663777, - ,,,No ratings yet Rate it yourself - /Services/opticians/LeaveReview/DefaultView.aspx?id=OP_5GE_11942__000004_LU54RH,0,0,
S H Harrold (1937) Ltd,OP_5DP_2786__000001_MK181EL,OPT,3 Bridge Street,,,Buckingham,Buckinghamshire,MK18 1EL,Tel: 01280 813496, - ,,,No ratings yet Rate it yourself - /Services/opticians/LeaveReview/DefaultView.aspx?id=OP_5DP_2786__000001_MK181EL,0,0,
Vision Express,OLOL/C030435QD__000004_MK181RS,OPT,,7 Meadow Walk,,Buckingham,Buckinghamshire,MK18 1RS,Tel: 01280 822204, - ,,,No ratings yet Rate it yourself - /Services/opticians/LeaveReview/DefaultView.aspx?id=OLOL/C030435QD__000004_MK181RS,0,0,
Specsavers  Buckingham,S0D4U,OPT,,11 Market Square,,Buckingham,Buckinghamshire,MK18 1NW,Tel: 01280 733081, - ,,,No ratings yet Rate it yourself - /Services/opticians/LeaveReview/DefaultView.aspx?id=S0D4U,0,0,
Specsavers Buckingham,S0D4U,OPT,,11 Market Square,,Buckingham,Buckinghamshire,MK18 1NW,Tel: 01280 733081, - ,,,No ratings yet Rate it yourself - /Services/opticians/LeaveReview/DefaultView.aspx?id=S0D4U,0,0,
Boots-Buckingham,OP_5DP_8514__000001_MK181NW,OPT,13 Market Square,,,Buckingham,Buckinghamshire,MK18 1NW,Tel: 01280 812166, - ,,,No ratings yet Rate it yourself - /Services/opticians/LeaveReview/DefaultView.aspx?id=OP_5DP_8514__000001_MK181NW,0,0,
One Vision Professional Eyecare,0126643_12082015,OPT,,"37 High Street, Amersham",,Buckinghamshire,,HP7 0DP,Tel: 01494 721421, - ,,,No ratings yet Rate it yourself - /Services/opticians/LeaveReview/DefaultView.aspx?id=0126643_12082015,0,0,
Dunstable Eye Centre,OP5P222__000002_LU63SN,OPT,,5a Queensway,,Dunstable,Bedfordshire,LU5 4DW,Tel: 01582 608449, - ,,,3 ratings Rate it yourself - /Services/opticians/LeaveReview/DefaultView.aspx?id=OP5P222__000002_LU63SN,,,
Brown & White Opticians,OP_5GE_8934__000002_LU55ES,OPT,1 Bedford Square,Houghton Regis,,Dunstable,Bedfordshire,LU5 5ES,Tel: 01582 865888, - ,,,No ratings yet Rate it yourself - /Services/opticians/LeaveReview/DefaultView.aspx?id=OP_5GE_8934__000002_LU55ES,0,0,
Asda Opticians,OPT_HP124NU,OPT,,Holmers Farm Way,,High Wycombe,,HP12 4NU,Tel: 01494 899098, - ,,,No ratings yet Rate it yourself - /Services/opticians/LeaveReview/DefaultView.aspx?id=OPT_HP124NU,0,0,
Boots-Bicester,OP_5DT_1929__000003_OX67HY,OPT,,Unit 6 Crown Walk,,Bicester,Oxfordshire,OX26 6HY,Tel: 01869 320027, - ,,,1 rating Rate it yourself - /Services/opticians/LeaveReview/DefaultView.aspx?id=OP_5DT_1929__000003_OX67HY,,,
Scrivens ,OP_5DT_9615__000001_OX266JF,OPT,Scrivens Opticians and Hearing Care,21 Sheep Street,,Bicester,Oxfordshire,OX26 6JF,Tel: 01869 253577, - ,,,No ratings yet Rate it yourself - /Services/opticians/LeaveReview/DefaultView.aspx?id=OP_5DT_9615__000001_OX266JF,0,0,
Specsavers Opticians,OP_5DT_11808__000001_OX67HY,OPT,,26 Sheep Street,,Bicester,Oxfordshire,OX26 6JF,Tel: 01869 321422, - ,,,No ratings yet Rate it yourself - /Services/opticians/LeaveReview/DefaultView.aspx?id=OP_5DT_11808__000001_OX67HY,0,0,yes
Vision Express,VISIONEXPRESSBICESTER1,OPT,,47 Sheep Street,,Bicester,,OX26 6JJ,Tel: 01869 327035, - ,,,No ratings yet Rate it yourself - /Services/opticians/LeaveReview/DefaultView.aspx?id=VISIONEXPRESSBICESTER1,0,0,
Robert Stanley Opticians,ROBERTSTANLEYOPTICIANS1,OPT,,Unit EY4 Pioneer Square,Bure Place,Bicester,Oxfordshire,OX26 6FA,Tel: 01869 360557, - ,,,No ratings yet Rate it yourself - /Services/opticians/LeaveReview/DefaultView.aspx?id=ROBERTSTANLEYOPTICIANS1,0,0,
Dove & Conway Opticians,SM 009 / 4060 / 5QE,OPT,,100 Sheep Street,,Bicester,Oxfordshire,OX26 6LP,Tel: 01869 242740, - ,,,No ratings yet Rate it yourself - /Services/opticians/LeaveReview/DefaultView.aspx?id=SM 009 / 4060 / 5QE,0,0,
Posh Eyes,D-12688 ,OPT,Westbury House,52 French Laurence Way,,Oxford,Oxfordshire,OX44 7YF,Tel: 01865400384, - ,,,No ratings yet Rate it yourself - /Services/opticians/LeaveReview/DefaultView.aspx?id=D-12688,0,0,yes
Thies Optometrists,OP_5GW_8916__000002_HP12QF,OPT,25 Stoneycroft,,Hemel Hempstead,,,HP1 2QF,Tel: 01442 264897, - ,,,No ratings yet Rate it yourself - /Services/opticians/LeaveReview/DefaultView.aspx?id=OP_5GW_8916__000002_HP12QF,0,0,
T J Lodge,OLCO25455CQ__000001_MK178RQ,OPT,9a High Street,Woburn Sands,Milton Keynes,Buckinghamshire,,MK17 8RQ,Tel: 01908 281133, - ,,,No ratings yet Rate it yourself - /Services/opticians/LeaveReview/DefaultView.aspx?id=OLCO25455CQ__000001_MK178RQ,0,0,
Punch Opticians,OP_5GE__000002_LU56BY,OPT,18 High Street,,Toddington,Beds,,LU5 6BY,Tel: 01525 875099, - ,,,2 ratings Rate it yourself - /Services/opticians/LeaveReview/DefaultView.aspx?id=OP_5GE__000002_LU56BY,,,
Tesco Opticians,OP_5P2_98__000001_LU54JU,OPT,,Skimpot Road,,Dunstable,,LU5 4JU,Tel: 0345 601 3479, - ,,,No ratings yet Rate it yourself - /Services/opticians/LeaveReview/DefaultView.aspx?id=OP_5P2_98__000001_LU54JU,0,0,
Vision Express (UK) Ltd,OP_5CQ_2901__000001_MK93ES,OPT,18 Midsummer Arcade,,Milton Keynes,Buckinghamshire,,MK9 3ES,Tel: 01908 672 267, - ,,,No ratings yet Rate it yourself - /Services/opticians/LeaveReview/DefaultView.aspx?id=OP_5CQ_2901__000001_MK93ES,0,0,
Boots-Milton Keynes - Midsummer Arcade,OP_5CQ_1888__000002_MK93BB,OPT,30 Midsummer Arcade,,,Central Milton Keynes,Buckinghamshire,MK9 3BB,Tel: 01908 234757, - ,,,No ratings yet Rate it yourself - /Services/opticians/LeaveReview/DefaultView.aspx?id=OP_5CQ_1888__000002_MK93BB,0,0,
Specsavers Ltd,OP_5CQ_13331__000001_MK93AG,OPT,35-37 Silbury Arcade,,Central Milton Keynes,Buckinghamshire,,MK9 3AG,Tel: 01908 662 116, - ,,,No ratings yet Rate it yourself - /Services/opticians/LeaveReview/DefaultView.aspx?id=OP_5CQ_13331__000001_MK93AG,0,0,
Boots-Milton Keynes - Crown Walk,OP_5CQ_7002__000003_MK93AH,OPT,18 Crown Walk,,,Milton Keynes,Buckinghamshire,MK9 3AH,Tel: 01908 606618, - ,,,No ratings yet Rate it yourself - /Services/opticians/LeaveReview/DefaultView.aspx?id=OP_5CQ_7002__000003_MK93AH,0,0,
Brian D Suttie Chalfont,L8Z0V,OPT,,14 Nightingales Corner,Little Chalfont,Amersham,Buckinghamshire,HP7 9PZ,Tel: 01494 762338, - ,,,No ratings yet Rate it yourself - /Services/opticians/LeaveReview/DefaultView.aspx?id=L8Z0V,0,0,
Melson Wingate Ltd(Scrivens),OP_5CQ_11119__000001_MK93BA,OPT,172 Midsummer Arcade,,,Milton Keynes,Northamptonshire,MK9 3BA,Tel: 01908 606520, - ,,,No ratings yet Rate it yourself - /Services/opticians/LeaveReview/DefaultView.aspx?id=OP_5CQ_11119__000001_MK93BA,0,0,
Boots-Milton Keynes - Winchester Circle,OP_5CQ_13332__000001_MK100BA,OPT,32 Winchester Circle,Kingston Centre,,Milton Keynes,Buckinghamshire,MK10 0BA,Tel: 01908 281 221, - ,,,No ratings yet Rate it yourself - /Services/opticians/LeaveReview/DefaultView.aspx?id=OP_5CQ_13332__000001_MK100BA,0,0,
Tesco Opticians,OP_5CQ_14312__000002_MK100AH,OPT,1 Winchester Circle,,Kingston Centre,Milton Keynes,,MK10 0AH,Tel: 0345 601 3479, - ,,,No ratings yet Rate it yourself - /Services/opticians/LeaveReview/DefaultView.aspx?id=OP_5CQ_14312__000002_MK100AH,0,0,
Thies Optometrists,OP_5GW_9617__000001_HP11EF,OPT,24 Bridge Street,,Hemel Hempstead,,,HP1 1EF,Tel: 01442 253858, - ,,,No ratings yet Rate it yourself - /Services/opticians/LeaveReview/DefaultView.aspx?id=OP_5GW_9617__000001_HP11EF,0,0,
Hemel Opticians,OP_5GW_3024__000002_HP11BB,OPT,143 Marlowes,Hemel Hempstead,Hertfordshire,,,HP1 1BB,Tel: 01442 240607, - ,,,No ratings yet Rate it yourself - /Services/opticians/LeaveReview/DefaultView.aspx?id=OP_5GW_3024__000002_HP11BB,0,0,
Boots-Hemel Hempstead - Marlowes (in BUK),OP_5GW_1780__000004_HP11BH,OPT,149 Marlowes,,,Hemel Hempstead,Hertfordshire,HP1 1BB,Tel: 01442 231774, - ,,,1 rating Rate it yourself - /Services/opticians/LeaveReview/DefaultView.aspx?id=OP_5GW_1780__000004_HP11BH,,,
Specsavers Opticians,OP_5GW_8295__000001_HP11DX,OPT,,252-254 Marlowes,,Hemel Hempstead,Hertfordshire,HP1 1BJ,Tel: 01442 212141, - ,,,2 ratings Rate it yourself - /Services/opticians/LeaveReview/DefaultView.aspx?id=OP_5GW_8295__000001_HP11DX,,,
Vision Express (UK) Ltd,OP_5GW_5968__000001_HP11DZ,OPT,Unit 34 The Marlowes Shopping Centre,Hemel Hempstead,Hertfordshire,,,HP1 1DZ,Tel: 01442 266535, - ,,,No ratings yet Rate it yourself - /Services/opticians/LeaveReview/DefaultView.aspx?id=OP_5GW_5968__000001_HP11DZ,0,0,
David Pressman Opticians,10072010__000002_HP11DX,OPT,Unit 52,Marlowes Centre,Hemel Hempstead,Hertfordshire,,HP1 1DX,Tel: 01442 255969, - ,,,No ratings yet Rate it yourself - /Services/opticians/LeaveReview/DefaultView.aspx?id=10072010__000002_HP11DX,0,0,
Costco Wholesale UK Ltd,CO-1833-13,OPT,,Mandeville Drive,Kingston,Milton Keynes,,MK10 0DB,Tel: 01908 285 035, - ,,,No ratings yet Rate it yourself - /Services/opticians/LeaveReview/DefaultView.aspx?id=CO-1833-13,0,0,
Ashton Opticians,OL124685G5__000001_HP109LS,OPT,1 Acorn House,12-16 Straight Bit,Flackwell Heath,High Wycombe,Buckinghamshire,HP10 9LS,Tel: 01628 530420, - ,,,1 rating Rate it yourself - /Services/opticians/LeaveReview/DefaultView.aspx?id=OL124685G5__000001_HP109LS,,,
Lesley A Arkin Optometrist,OP_5CQ_9939__000001_MK111BY,OPT,7 Cofferidge Close,Stony Stratford,Milton Keynes,,,MK11 1BY,Tel: 01908 567672, - ,,,No ratings yet Rate it yourself - /Services/opticians/LeaveReview/DefaultView.aspx?id=OP_5CQ_9939__000001_MK111BY,0,0,
D W Roberts Optometrists,OP_5CQ_435__000001_MK111AF,OPT,16 High Street,Stony Stratford,,Buckinghamshire,,MK11 1AF,Tel: 01908 562355, - ,,,No ratings yet Rate it yourself - /Services/opticians/LeaveReview/DefaultView.aspx?id=OP_5CQ_435__000001_MK111AF,0,0,
D W Roberts Optometrists,OP_5CQ_8647__000002_MK125DG,OPT,17 The Square,Wolverton,Milton Keynes,,,MK12 5DG,Tel: 01908 313338, - ,,,2 ratings Rate it yourself - /Services/opticians/LeaveReview/DefaultView.aspx?id=OP_5CQ_8647__000002_MK125DG,,,
T J Lodge,OP_5CQ_2956__000001_MK125DQ,OPT,13 The Square,Wolverton,Milton Keynes,,,MK12 5DQ,Tel: 01908 312130, - ,,,No ratings yet Rate it yourself - /Services/opticians/LeaveReview/DefaultView.aspx?id=OP_5CQ_2956__000001_MK125DQ,0,0,
S H Harrold (1937) Ltd,OP_5G4_3077__000001_HP91HQ,OPT,26 Gregories Road,,Beaconsfield,,,HP9 1HQ,Tel: 01494 672193, - ,,,No ratings yet Rate it yourself - /Services/opticians/LeaveReview/DefaultView.aspx?id=OP_5G4_3077__000001_HP91HQ,0,0,
Boots-Beaconsfield,OP_5G4_13334__000001_HP91HH,OPT,25 Gregories Road,,,Beaconsfield,Buckinghamshire,HP9 1HH,Tel: 01494 673627, - ,,,No ratings yet Rate it yourself - /Services/opticians/LeaveReview/DefaultView.aspx?id=OP_5G4_13334__000001_HP91HH,0,0,
I Kara,OP_5GC_12948__000001_LU33BH,OPT,8 The Parade,Sundon Park,,Luton,,LU3 3BH,Tel: 01582 571731, - ,,,No ratings yet Rate it yourself - /Services/opticians/LeaveReview/DefaultView.aspx?id=OP_5GC_12948__000001_LU33BH,0,0,