Organisation Name,NACS Code,Organisation Type,Address1,Address2,Address3,Address4,Address5,PostCode,Telephone Number,Opening time,Value  (Opening time),Banding Classification  (Opening time),NHS.UK users rating,Value  (NHS.UK users rating),Banding Classification  (NHS.UK users rating),Car parking (Is there car parking at this organisation?)
Vision Express (Harrrow),OP_5K6_11425__000003_HA11HS,OPT,Unit 6 St.George's Shopping Centre,St Anns Road,Harrow,,,HA1 1HS,Tel: 020 8427 3311, - ,,,1 rating Rate it yourself - /Services/opticians/LeaveReview/DefaultView.aspx?id=OP_5K6_11425__000003_HA11HS,,,
Boots Opticians,OP_5K6_12060__000002_HA11HS,OPT,30 St. Anns Road,,,Harrow,,HA1 1LA,Tel: 0208 427 4113, - ,,,98 ratings Rate it yourself - /Services/opticians/LeaveReview/DefaultView.aspx?id=OP_5K6_12060__000002_HA11HS,,,
Boots-Harrow - St Anns Rd,OP_5K6_1130__000001_HA11LA,OPT,30 St Anns Road,,,Harrow,Middlesex,HA1 1LA,Tel: 0208 427 4113, - ,,,2 ratings Rate it yourself - /Services/opticians/LeaveReview/DefaultView.aspx?id=OP_5K6_1130__000001_HA11LA,,,
St Ann's Optical Centre,OP_5K6_10180__000001_HA11LE,OPT,58 Greenhill Way,Harrow,Middlesex,,,HA1 1LE,Tel: 020 8863 5575, - ,,,1 rating Rate it yourself - /Services/opticians/LeaveReview/DefaultView.aspx?id=OP_5K6_10180__000001_HA11LE,,,
Specsavers Opticians (Harrow Visionplus Ltd),OP_5K6_13138__000002_HA12TA,OPT,289 Station Road,,Harrow,,,HA1 2TA,Tel: 020 8424 0244, - ,,,5 ratings Rate it yourself - /Services/opticians/LeaveReview/DefaultView.aspx?id=OP_5K6_13138__000002_HA12TA,,,
Brush & Fowler Opticians,OP_5K6_3376__000001_HA12JN,OPT,3 Manor Parade,Sheepcote Road,Harrow,,,HA1 2JN,Tel: 0208 427 0279, - ,,,No ratings yet Rate it yourself - /Services/opticians/LeaveReview/DefaultView.aspx?id=OP_5K6_3376__000001_HA12JN,0,0,
Family Eyecare Ltd,OP_5K6_627__000002_HA28DU,OPT,246 Northolt Road,,Harrow,,,HA2 8DU,Tel: 020 8423 5818, - ,,,1 rating Rate it yourself - /Services/opticians/LeaveReview/DefaultView.aspx?id=OP_5K6_627__000002_HA28DU,,,
Cravitz Opticians,OP_5K5_11249__000001_HA30AZ,OPT,119 Kenton Road,Kenton,Harrow,,,HA3 0AZ,Tel: 020 8907 7860, - ,,,2 ratings Rate it yourself - /Services/opticians/LeaveReview/DefaultView.aspx?id=OP_5K5_11249__000001_HA30AZ,,,
Parker & Hammond Opticians ,OP_5K6_9349__000001_HA28EE,OPT,302 Northolt Road,,South Harrow,,,HA2 8EE,Tel: 020 8422 1269, - ,,,No ratings yet Rate it yourself - /Services/opticians/LeaveReview/DefaultView.aspx?id=OP_5K6_9349__000001_HA28EE,0,0,
Specsavers (South Harrow Visionplus Ltd),OP5K6__000002_HA28EE,OPT,308 Northolt Road,South Harrow,Harrow,Middlesex,,HA2 8EE,Tel: 020 8869 0301, - ,,,3 ratings Rate it yourself - /Services/opticians/LeaveReview/DefaultView.aspx?id=OP5K6__000002_HA28EE,,,
Rai Optometrists Ltd,OP_5K6_6218__000002_HA27SY,OPT,8 Broadway Parade,Pinner Road,Harrow,,,HA2 7SY,Tel: 020 8427 9202, - ,,,No ratings yet Rate it yourself - /Services/opticians/LeaveReview/DefaultView.aspx?id=OP_5K6_6218__000002_HA27SY,0,0,
Hillier Opticians ,OP_5K6_7317__000001_HA26ED,OPT,19 Broadwalk,Pinner Road,Harrow,,,HA2 6ED,Tel: 020 8863 1541, - ,,,No ratings yet Rate it yourself - /Services/opticians/LeaveReview/DefaultView.aspx?id=OP_5K6_7317__000001_HA26ED,0,0,
Mr R K Shah,01-13945,OPT,,58 Southfield Park,,Harrow,,HA2 6HE,Tel: 07956172861, - ,,,No ratings yet Rate it yourself - /Services/opticians/LeaveReview/DefaultView.aspx?id=01-13945,0,0,
Barnett Opticians,OP_5K6_14961__000001_HA55EN,OPT,367 Rayners Lane,,,Pinner,Middlesex,HA5 5EN,Tel: 020 8868 3003, - ,,,No ratings yet Rate it yourself - /Services/opticians/LeaveReview/DefaultView.aspx?id=OP_5K6_14961__000001_HA55EN,0,0,
New Vision,OP_5K6_4098__000001_HA29SE,OPT,431 Alexandra Avenue,,Harrow,,,HA2 9SE,Tel: 0208 429 3641, - ,,,6 ratings Rate it yourself - /Services/opticians/LeaveReview/DefaultView.aspx?id=OP_5K6_4098__000001_HA29SE,,,
Visioncare Eye -Clinic ,OP_5K6_543__000002_HA37AF,OPT,Visioncare Medical Eye Centre,62-64 High Street,Wealdstone,Harrow,Middlesex,HA3 7AF,Tel: 020 8863 5333, - ,,,No ratings yet Rate it yourself - /Services/opticians/LeaveReview/DefaultView.aspx?id=OP_5K6_543__000002_HA37AF,0,0,
Visionsavers Opticians,OP_5K6_14943__000001_HA35DQ,OPT,53 High Street,Wealdstone,Harrow,,,HA3 5DQ,Tel: 020 8861 6006, - ,,,No ratings yet Rate it yourself - /Services/opticians/LeaveReview/DefaultView.aspx?id=OP_5K6_14943__000001_HA35DQ,0,0,
OLDFIELDS OPTICIANS,01-20756_UB54RR_0714,OPT,OLDFIELDS OPTICIANS,27A OLDFIELDS CIRCUS,,NORTHOLT,,UB5 4RR,Tel: 02084224466, - ,,,No ratings yet Rate it yourself - /Services/opticians/LeaveReview/DefaultView.aspx?id=01-20756_UB54RR_0714,0,0,yes
The Vision Clinic,R9J0E,OPT,,327 Kenton Road,,"Kenton, Harrow",,HA3 0XS,Tel: 020 8907 5270, - ,,,No ratings yet Rate it yourself - /Services/opticians/LeaveReview/DefaultView.aspx?id=R9J0E,0,0,
icare optician T/a myicare,OP_5LC_610__000001_HA30RN,OPT,23 Trevelyan Cresent,Kenton,,Harrow,Middlesex,HA3 0RN,Tel: 0208 907 7787, - ,,,No ratings yet Rate it yourself - /Services/opticians/LeaveReview/DefaultView.aspx?id=OP_5LC_610__000001_HA30RN,0,0,
Opticalise Ophthalmic Opticians,00001__000003_HA30PS,OPT,241 - 243 Preston Road,Harrow,Middlesex,,,HA3 0PS,Tel: 020 8908 4888, - ,,,No ratings yet Rate it yourself - /Services/opticians/LeaveReview/DefaultView.aspx?id=00001__000003_HA30PS,0,0,
Eye 2 Eye Opticians Harrow,HARR5K6__000002_HA38SA,OPT,6 Warwick Parade,"Belmont Ciircle , Kenton Lane",Harrow,Middlesex,,HA3 8SA,Tel: 020 8907 8128, - ,,,30 ratings Rate it yourself - /Services/opticians/LeaveReview/DefaultView.aspx?id=HARR5K6__000002_HA38SA,,,
Adams Opticians (Harrow Weald),OP_5K6_9378__000002_HA36EL,OPT,411 High Road,Harrow Weald,Harrow,,,HA3 6EL,Tel: 0208 427 3201, - ,,,No ratings yet Rate it yourself - /Services/opticians/LeaveReview/DefaultView.aspx?id=OP_5K6_9378__000002_HA36EL,0,0,
InView Opticians,OP_5K6_13916__000001_HA38RF,OPT,15 Belmont Circle,Harrow,Middlesex,HARROW,Middlesex,HA3 8RF,Tel: 020 8907 3454, - ,,,15 ratings Rate it yourself - /Services/opticians/LeaveReview/DefaultView.aspx?id=OP_5K6_13916__000001_HA38RF,,,
Icare Opticians,TP8VL,OPT,,6 Barters Walk,,Pinner,,HA5 5LU,, - ,,,No ratings yet Rate it yourself - /Services/opticians/LeaveReview/DefaultView.aspx?id=TP8VL,0,0,
Insight Opticians (Seemera Ltd t/a),OP_5K6_2521__000001_HA53JE,OPT,6 Bridge Street,Pinner,Middlesex,,,HA5 3JE,Tel: 020 8866 5399, - ,,,No ratings yet Rate it yourself - /Services/opticians/LeaveReview/DefaultView.aspx?id=OP_5K6_2521__000001_HA53JE,0,0,
G&G Pinner Optometrists,OP_5K6_14929__000001_HA53JD,OPT,3 Red Lion Parade,Bridge Street,Pinner,Pinner,Middlesex,HA5 3JD,Tel: 020 8866 2620, - ,,,No ratings yet Rate it yourself - /Services/opticians/LeaveReview/DefaultView.aspx?id=OP_5K6_14929__000001_HA53JD,0,0,yes
DomEyeCare Ltd,1609141104,OPT,,70 Lowlands Road,,Pinner,,HA5 1TU,Tel: 0208 868 8475, - ,,,No ratings yet Rate it yourself - /Services/opticians/LeaveReview/DefaultView.aspx?id=1609141104,0,0,
Specsavers Opticians,TP9FY,OPT,,36 Bridge Street,,Pinner,,HA5 3JF,, - ,,,No ratings yet Rate it yourself - /Services/opticians/LeaveReview/DefaultView.aspx?id=TP9FY,0,0,
Boots-Pinner,OP_5K6_12949__000002_HA53JF,OPT,28 Bridge Stree,,,Pinner,Middlesex,HA5 3JF,Tel: 020 8866 5106, - ,,,No ratings yet Rate it yourself - /Services/opticians/LeaveReview/DefaultView.aspx?id=OP_5K6_12949__000002_HA53JF,0,0,
Eyesey Eyecare,5K6- 3034__000006_HA53JF,OPT,,50 Bridge Street,,Pinner,Middlesex,HA5 3JF,Tel: 020 8429 0101, - ,,,No ratings yet Rate it yourself - /Services/opticians/LeaveReview/DefaultView.aspx?id=5K6- 3034__000006_HA53JF,0,0,
Boots-Greenford,UB6 0UW_19217,OPT,,1000 Greenford Road,,Greenford,Middlesex,UB6 0UW,Tel: 0208 575 2152, - ,,,No ratings yet Rate it yourself - /Services/opticians/LeaveReview/DefaultView.aspx?id=UB6 0UW_19217,0,0,
Optomlink Limited,OP_5GD_2767__000001_HA72LZ,OPT,97 St andrews Drive,,,Stanmore,Middlesex,HA7 2LZ,Tel: 020 8357 7925, - ,,,No ratings yet Rate it yourself - /Services/opticians/LeaveReview/DefaultView.aspx?id=OP_5GD_2767__000001_HA72LZ,0,0,
Eyecraft Optometrist Ltd,OP_5K5_213__000001_HA04TL,OPT,26 Ealing Road,,Wembley,,,HA0 4TL,Tel: 020 8902 9908, - ,,,No ratings yet Rate it yourself - /Services/opticians/LeaveReview/DefaultView.aspx?id=OP_5K5_213__000001_HA04TL,0,0,
Crispe Opticians,OP_5AT_12413__000002_HA51QZ,OPT,207 Field End Road,Eastcote,Pinner,Middlesex,,HA5 1QZ,Tel: 020 8866 3998, - ,,,No ratings yet Rate it yourself - /Services/opticians/LeaveReview/DefaultView.aspx?id=OP_5AT_12413__000002_HA51QZ,0,0,
Boots-Wembley,OP_5K5_3809__000001_HA97AG,OPT,449 High Road,,,Wembley,Middlesex,HA9 7AF,Tel: 0208 9022721, - ,,,1 rating Rate it yourself - /Services/opticians/LeaveReview/DefaultView.aspx?id=OP_5K5_3809__000001_HA97AG,,,
Realeyes The Eye Clinic,01-1853,OPT,,"Unit 7, Wembley Central Square",,Wembley,,HA9 7AJ,Tel: 020 3909 9181, - ,,,No ratings yet Rate it yourself - /Services/opticians/LeaveReview/DefaultView.aspx?id=01-1853,0,0,
Leith Opticians,OP_5AT_4339__000002_HA51QR,OPT,175 Field End Road,Eastcote,Pinner,Middlesex,,HA5 1QR,Tel: 020 8868 2277, - ,,,No ratings yet Rate it yourself - /Services/opticians/LeaveReview/DefaultView.aspx?id=OP_5AT_4339__000002_HA51QR,0,0,
Betterspecs Wembley Ltd,OP_5K5_14718__000001_HA97AY,OPT,475 - 477 High Road,Wembley,Middlesex,,,HA9 7AY,Tel: 020 8900 0677, - ,,,No ratings yet Rate it yourself - /Services/opticians/LeaveReview/DefaultView.aspx?id=OP_5K5_14718__000001_HA97AY,0,0,
Specsavers Opticians (Wembley Visionplus Ltd T/A),OP_5K5_1786__000002_HA97BH,OPT,476 High Road,Wembley,Middlesex,,,HA9 7AS,Tel: 020 8900 1433, - ,,,2 ratings Rate it yourself - /Services/opticians/LeaveReview/DefaultView.aspx?id=OP_5K5_1786__000002_HA97BH,,,
Mandeville Opticians,140920161008,OPT,,6 Mandeville Road,,Northolt,Middlesex,UB5 5BJ,Tel: 020 8841 2626, - ,,,No ratings yet Rate it yourself - /Services/opticians/LeaveReview/DefaultView.aspx?id=140920161008,0,0,
First Contact Opticians,OP_5AT_3927__000001_HA51RJ,OPT,126 Field End Road,Eastcote,Pinner,Middlesex,,HA5 1RJ,Tel: 020 8866 4911, - ,,,1 rating Rate it yourself - /Services/opticians/LeaveReview/DefaultView.aspx?id=OP_5AT_3927__000001_HA51RJ,,,
Paul Simon Opticians,OP_5K5_5997__000001_HA96AA,OPT,383 High Road,,Wembley,,,HA9 6AA,Tel: 020 8902 0271, - ,,,No ratings yet Rate it yourself - /Services/opticians/LeaveReview/DefaultView.aspx?id=OP_5K5_5997__000001_HA96AA,0,0,
Day Lewis Opticians ,OP_5K6_2305__000002_HA55LU,OPT,6 Barters Walk,,Pinner,,,HA5 4LU,Tel: 0208 868 2597, - ,,,No ratings yet Rate it yourself - /Services/opticians/LeaveReview/DefaultView.aspx?id=OP_5K6_2305__000002_HA55LU,0,0,
The Eyecare Studio (Lucrative Business Ltd T/A),OP_5K6_9376__000001_HA54JR,OPT,439 Uxbridge Road,Pinner,Middlesex,,,HA5 4JR,Tel: 020 8421 2277, - ,,,No ratings yet Rate it yourself - /Services/opticians/LeaveReview/DefaultView.aspx?id=OP_5K6_9376__000001_HA54JR,0,0,
Wiseman and Ashley Optical Centre,OP_5K5_14712__000001_NW99EL,OPT,561 Kingsbury Road,561 Kingsbury High Road,London,Kingsbury,,NW9 9EL,Tel: 020 8204 4348, - ,,,5 ratings Rate it yourself - /Services/opticians/LeaveReview/DefaultView.aspx?id=OP_5K5_14712__000001_NW99EL,,,
Hatch End Eyecare,01-22088,OPT,Hatch End Eyecare,394 Uxbridge Road,,Pinner,,HA5 4HP,Tel: 020 8428 0025, - ,,,2 ratings Rate it yourself - /Services/opticians/LeaveReview/DefaultView.aspx?id=01-22088,,,yes
Blink Eye Care,OP_5P2_3373__000001_HA63AT,OPT,4 Wigton Gardens,Stanmore,,Middlesex,Middlesex,HA7 1BG,Tel: 0208 816 8549, - ,,,No ratings yet Rate it yourself - /Services/opticians/LeaveReview/DefaultView.aspx?id=OP_5P2_3373__000001_HA63AT,0,0,
Vision Eyecare,OP_5HX_14390__000002_UB67BN,OPT,94 Bilton Road,Perivale,Greenford,,,UB6 7BN,Tel: 020 8998 2121, - ,,,4 ratings Rate it yourself - /Services/opticians/LeaveReview/DefaultView.aspx?id=OP_5HX_14390__000002_UB67BN,,,
Stanfields Opticians,OP_5K5_7296__000001_NW99HJ,OPT,572 Kingsbury Road,Kingsbury,London,,,NW9 9HJ,Tel: 020 8204 7124, - ,,,No ratings yet Rate it yourself - /Services/opticians/LeaveReview/DefaultView.aspx?id=OP_5K5_7296__000001_NW99HJ,0,0,
Home Health Clinic,HOMEHEALTHCLINIC1,OPT,,"2 Thorndyke Court, Westfield Park",,Pinner,Middlesex,HA5 4JG,Tel: 020 8428 4068, - ,,,No ratings yet Rate it yourself - /Services/opticians/LeaveReview/DefaultView.aspx?id=HOMEHEALTHCLINIC1,0,0,
Optipharm Opticians,TP9K5,OPT,,29 Bridge Road,Wembley Park,Middlesex,,HA9 9AB,Tel: 020 8904 7488, - ,,,No ratings yet Rate it yourself - /Services/opticians/LeaveReview/DefaultView.aspx?id=TP9K5,0,0,
Eye Professionals Ltd,OP_HA72SA_85045,OPT,,40 Lansdowne Road,Stanmore,London,,HA7 2SA,Tel: 0800 8815207, - ,,,No ratings yet Rate it yourself - /Services/opticians/LeaveReview/DefaultView.aspx?id=OP_HA72SA_85045,0,0,
Kingsbury Opticians,OP_5K5_11069__000001_NW99HE,OPT,528 Kingsbury Road,Kingsbury,London,,,NW9 9HE,Tel: 020 8204 8758, - ,,,No ratings yet Rate it yourself - /Services/opticians/LeaveReview/DefaultView.aspx?id=OP_5K5_11069__000001_NW99HE,0,0,
Asda Optician,OPT_HA9 9EX,OPT,,FORTY ROAD,,WEMBLEY,,HA9 9EX,Tel: 0208 7826320, - ,,,No ratings yet Rate it yourself - /Services/opticians/LeaveReview/DefaultView.aspx?id=OPT_HA9 9EX,0,0,
VISION ONE 2 ONE OPTICIANS,OL01160915K6__000002_HA86RW,OPT,19 Station Parade,Whitchurch Lane,Edgware,Middx,,HA8 6RW,, - ,,,No ratings yet Rate it yourself - /Services/opticians/LeaveReview/DefaultView.aspx?id=OL01160915K6__000002_HA86RW,0,0,
Dave Opticians,OP_5K6_22__000001_HA74AW,OPT,2 Church Road,,Stanmore,,,HA7 4AW,Tel: 020 8954 7707, - ,,,4 ratings Rate it yourself - /Services/opticians/LeaveReview/DefaultView.aspx?id=OP_5K6_22__000001_HA74AW,,,
Costco Wholesale UK Limited,O7A7A,OPT,,30 Second Way,,Wembley,,HA9 0YJ,, - ,,,No ratings yet Rate it yourself - /Services/opticians/LeaveReview/DefaultView.aspx?id=O7A7A,0,0,
Costco Wholesale UK Limited,O7A7A,OPT,,30 Second Way,,Wembley,,HA9 0YJ,, - ,,,No ratings yet Rate it yourself - /Services/opticians/LeaveReview/DefaultView.aspx?id=O7A7A,0,0,
Adams Opticians (Stanmore),OP_5K6_74__000001_HA73DP,OPT,3 Church Road,.,Stanmore,Middx,,HA7 4AR,Tel: 020 8954 2133, - ,,,1 rating Rate it yourself - /Services/opticians/LeaveReview/DefaultView.aspx?id=OP_5K6_74__000001_HA73DP,,,
Boots-Stanmore,-805K6__000001_HA74DJ,OPT,47 The Broadway,,,Stanmore,Middlesex,HA7 4DJ,Tel: 0208 954 4513, - ,,,No ratings yet Rate it yourself - /Services/opticians/LeaveReview/DefaultView.aspx?id=-805K6__000001_HA74DJ,0,0,
John Horwitz,01-73135K6__000001_HA73DY,OPT,4 Halsbury Close,,Stanmore Hill,Middlesex,,HA7 3DY,Tel: 020 8954 4499, - ,,,No ratings yet Rate it yourself - /Services/opticians/LeaveReview/DefaultView.aspx?id=01-73135K6__000001_HA73DY,0,0,
Specsavers Opticians,OP_5HX_14720__000001_UB69PU,OPT,20 The Broadway,Greenford,Middlesex,,,UB6 9PU,Tel: 020 8832 8940, - ,,,No ratings yet Rate it yourself - /Services/opticians/LeaveReview/DefaultView.aspx?id=OP_5HX_14720__000001_UB69PU,0,0,
Boots-Greenford,OP_5HX_665__000002_UB69PN,OPT,35 The Broadway,,,Greenford,Middlesex,UB6 9PN,Tel: 0208 578 1234, - ,,,No ratings yet Rate it yourself - /Services/opticians/LeaveReview/DefaultView.aspx?id=OP_5HX_665__000002_UB69PN,0,0,
Medical Eye Centre,OP_5HX_2081__000001_UB69QD,OPT,9 Ruislip Road,Greenford,Middlesex,,,UB6 9QD,Tel: 020 8578 3721, - ,,,No ratings yet Rate it yourself - /Services/opticians/LeaveReview/DefaultView.aspx?id=OP_5HX_2081__000001_UB69QD,0,0,
S H Harrold,OP_5AT_6308__000001_HA61LU,OPT,85 Joel Street,Ryefield Parade,Northwood Hills,Middlesex,,HA6 1LU,Tel: 01923 823027, - ,,,1 rating Rate it yourself - /Services/opticians/LeaveReview/DefaultView.aspx?id=OP_5AT_6308__000001_HA61LU,,,
Eye Design Opticians,OP_5AT_8112__000001_HA48LJ,OPT,170 High Street,Ruislip,Middlesex,,,HA4 8LJ,Tel: 01895 621135, - ,,,No ratings yet Rate it yourself - /Services/opticians/LeaveReview/DefaultView.aspx?id=OP_5AT_8112__000001_HA48LJ,0,0,
Oak Optometrists,OP_5K6_14957__000002_HA85EP,OPT,61 Burnt Oak Broadway,Edgware,Middlesex,,,HA8 5EP,Tel: 020 8951 4004, - ,,,No ratings yet Rate it yourself - /Services/opticians/LeaveReview/DefaultView.aspx?id=OP_5K6_14957__000002_HA85EP,0,0,
Specsavers Opticians,OP_5AT_14107__000001_HA48LL,OPT,134 High Street,,Ruislip,Middlesex,,HA4 8LL,Tel: 01895 679750, - ,,,No ratings yet Rate it yourself - /Services/opticians/LeaveReview/DefaultView.aspx?id=OP_5AT_14107__000001_HA48LL,0,0,
A.I. Jones Ltd,OP_5A9_13578__000001_HA80BB,OPT,132 Burnt Oak Broadway,,,Edgware,Middlesex,HA8 0BB,Tel: 020 8952 1102, - ,,,1 rating Rate it yourself - /Services/opticians/LeaveReview/DefaultView.aspx?id=OP_5A9_13578__000001_HA80BB,,,
Vision Express (UK) Ltd,OP_5AT_6219__000002_HA48LS,OPT,112 High Street,Ruislip,Middlesex,,,HA4 8LS,Tel: 01895 677461, - ,,,No ratings yet Rate it yourself - /Services/opticians/LeaveReview/DefaultView.aspx?id=OP_5AT_6219__000002_HA48LS,0,0,
K H Kennell,OP_5HX_13899__000001_NW107HR,OPT,8 Norbreck Parade,,London,,,NW10 7HR,Tel: 020 8997 7170, - ,,,No ratings yet Rate it yourself - /Services/opticians/LeaveReview/DefaultView.aspx?id=OP_5HX_13899__000001_NW107HR,0,0,
Asda Opticians,OPT_NW9 0AS,OPT,,EDGEWARE ROAD,COLINDALE,HARROW,,NW9 0AS,Tel: 0208 358 2513, - ,,,No ratings yet Rate it yourself - /Services/opticians/LeaveReview/DefaultView.aspx?id=OPT_NW9 0AS,0,0,
Boots-Ruislip,OP_5AT_676__000001_HA47AU,OPT,33 High Street,,,Ruislip,Middlesex,HA4 7AU,Tel: 01895 634 234, - ,,,1 rating Rate it yourself - /Services/opticians/LeaveReview/DefaultView.aspx?id=OP_5AT_676__000001_HA47AU,,,
Vaid Optometrists,OP_5A9_10905__000001_HA87AA,OPT,132 Station Road,Edgware,Middlesex,,,HA8 7AA,Tel: 020 8381 2641, - ,,,No ratings yet Rate it yourself - /Services/opticians/LeaveReview/DefaultView.aspx?id=OP_5A9_10905__000001_HA87AA,0,0,
Boots-Colindale,OP_5A9_13592__000001_NW96LE,OPT,The Hyde,Edgware Road,,Colindale,,NW9 5EB,Tel: 0208 205 9280, - ,,,2 ratings Rate it yourself - /Services/opticians/LeaveReview/DefaultView.aspx?id=OP_5A9_13592__000001_NW96LE,,,
Vision Express (uk) Ltd,VISION EXPRESS (UK) LTD_HA8 7BD,OPT,,"Unit 6b, Broadwalk Shopping Centre",,"Edgware, Middlesex,",,HA8 7BD,, - ,,,No ratings yet Rate it yourself - /Services/opticians/LeaveReview/DefaultView.aspx?id=VISION EXPRESS (UK) LTD_HA8 7BD,0,0,
Specsavers Opticians,OP_5A9_13676__000004_HA87BD,OPT,3 Broadwalk Shopping Centre,Station Road,Edgware,,,HA8 7BD,Tel: 020 8952 2262, - ,,,No ratings yet Rate it yourself - /Services/opticians/LeaveReview/DefaultView.aspx?id=OP_5A9_13676__000004_HA87BD,0,0,
Home Eyecare Limited,OP_EN191PH_34835,OPT,Falcon House,40 Green Lane,,Edgware,Middlesex,HA8 7PT,Tel: 0208 5906666, - ,,,No ratings yet Rate it yourself - /Services/opticians/LeaveReview/DefaultView.aspx?id=OP_EN191PH_34835,0,0,
Opticiancall (Home Visiting Opticians),OP_HA61HJ_85747,OPT,,24 Knoll Crescent,,Northwood,Middlesex,HA6 1HJ,Tel: 0800 999 3937, - ,,,No ratings yet Rate it yourself - /Services/opticians/LeaveReview/DefaultView.aspx?id=OP_HA61HJ_85747,0,0,
TESCO OPTICIANS,5K5/ 3036__000002_NW100TL,OPT,TESCO WEMBLEY BRENT PARK,GREAT CENTRAL WAY,,LONDON,,NW10 0TL,Tel: 0345 601 3479, - ,,,No ratings yet Rate it yourself - /Services/opticians/LeaveReview/DefaultView.aspx?id=5K5/ 3036__000002_NW100TL,0,0,
Mansons Eyecare,OP_5AT_11107__000001_UB49NS,OPT,"14 Jollys Lane, Willow District Centre",Yeading,Hayes,Middlesex,,UB4 9NS,Tel: 0208 845 5757, - ,,,1 rating Rate it yourself - /Services/opticians/LeaveReview/DefaultView.aspx?id=OP_5AT_11107__000001_UB49NS,,,
Opticall Limited,OP_W52QP_46953,OPT,,7 Acantha Court,15A Montpelier Road,Ealing,,W5 2QP,Tel: 0208 9984228, - ,,,No ratings yet Rate it yourself - /Services/opticians/LeaveReview/DefaultView.aspx?id=OP_W52QP_46953,0,0,
Susan Leighter,OP_5A9_13664__000001_HA88JE,OPT,41 Fairview Way,Edgware,Middlesex,,,HA8 8JE,Tel: 020 8958 2211, - ,,,No ratings yet Rate it yourself - /Services/opticians/LeaveReview/DefaultView.aspx?id=OP_5A9_13664__000001_HA88JE,0,0,
Norman Hart Opticians,OP_5K5_13098__000002_NW100AA,OPT,6 Neasden Parade,250 Neasden Lane,London,,,NW10 0AA,Tel: 020 8450 8153, - ,,,2 ratings Rate it yourself - /Services/opticians/LeaveReview/DefaultView.aspx?id=OP_5K5_13098__000002_NW100AA,,,
Adams Opticians,OP_5GV_12388__000001_WD197AD,OPT,1 St andrews Road,,Watford,,,WD19 7AD,Tel: 020 8428 5152, - ,,,No ratings yet Rate it yourself - /Services/opticians/LeaveReview/DefaultView.aspx?id=OP_5GV_12388__000001_WD197AD,0,0,
Eye 2 Eye Opticians Bushey,OPT_WD231GE_1,OPT,,84 High Road Bushey,,Heath Bushey,,WD23 1GE,Tel: 020 3925 3925, - ,,,18 ratings Rate it yourself - /Services/opticians/LeaveReview/DefaultView.aspx?id=OPT_WD231GE_1,,,
Eye 2 Eye Opticians Bushey,CO-3211,OPT,,84 High Road Bushey,,Heath Bushey ,,WD23 1GE,, - ,,,No ratings yet Rate it yourself - /Services/opticians/LeaveReview/DefaultView.aspx?id=CO-3211,0,0,
Lamertons,OP_5AT_12378__000001_HA63AD,OPT,65 Green Lane,Northwood,Middlesex,,,HA6 3AD,Tel: 01923 822066, - ,,,No ratings yet Rate it yourself - /Services/opticians/LeaveReview/DefaultView.aspx?id=OP_5AT_12378__000001_HA63AD,0,0,
Asda Opticians,OP_5HX_14719__000002_NW107LW,OPT,2-20 Western Road,Park Royal Industrial Estate,,London,,NW10 7LW,Tel: 020 8951 9112, - ,,,No ratings yet Rate it yourself - /Services/opticians/LeaveReview/DefaultView.aspx?id=OP_5HX_14719__000002_NW107LW,0,0,
Hanwell Eyecare Centre,OP_5HX_14066__000002_W71DR,OPT,20 Church Road,Hanwell,London,,,W7 1DR,Tel: 020 8840 8595, - ,,,No ratings yet Rate it yourself - /Services/opticians/LeaveReview/DefaultView.aspx?id=OP_5HX_14066__000002_W71DR,0,0,
Keena Rakkado,OP_SL39EA_34404,OPT,,18 The Broadway,,West Ealing,,W13 0SR,Tel: 0208 567 2320, - ,,,No ratings yet Rate it yourself - /Services/opticians/LeaveReview/DefaultView.aspx?id=OP_SL39EA_34404,0,0,
Keena Rakkado,OP_5HX_1621__000002_W130SR,OPT,18 The Broadway,West Ealing,,London,Greater London,W13 0SR,Tel: 020 8567 2320, - ,,,2 ratings Rate it yourself - /Services/opticians/LeaveReview/DefaultView.aspx?id=OP_5HX_1621__000002_W130SR,,,
Specsavers Opticians,OP_5HX_509__000001_W52XA,OPT,6 New Broadway,Ealing,London,,,W5 2XA,Tel: 020 8840 2977, - ,,,No ratings yet Rate it yourself - /Services/opticians/LeaveReview/DefaultView.aspx?id=OP_5HX_509__000001_W52XA,0,0,
AVK I-Care,D-13231,OPT,,15a Swakeleys Road,,Ickenham,,UB10 8DF,Tel: 01895347121, - ,,,No ratings yet Rate it yourself - /Services/opticians/LeaveReview/DefaultView.aspx?id=D-13231,0,0,
The Eye Zone,L2D5V,OPT,25 New Broadway,Ealing,London,London,,W5 5AW,Tel: 020 8567 2020, - ,,,No ratings yet Rate it yourself - /Services/opticians/LeaveReview/DefaultView.aspx?id=L2D5V,0,0,
Boots-Ealing,OP_5HX_4747__000002_W55AW,OPT,1A New Broadway,,Ealing,London,,W5 5AW,Tel: 0208 567 1235, - ,,,No ratings yet Rate it yourself - /Services/opticians/LeaveReview/DefaultView.aspx?id=OP_5HX_4747__000002_W55AW,0,0,
Dollond & Aitchison,OP_5HX_1875__000003_W55AW,OPT,1a New Broadway,Ealing,London,,,W5 5AW,Tel: 020 8567 1235, - ,,,No ratings yet Rate it yourself - /Services/opticians/LeaveReview/DefaultView.aspx?id=OP_5HX_1875__000003_W55AW,0,0,
Specsavers Opticians,OP_5HX_3353__000001_W139BP,OPT,81 The Broadway,West Ealing,London,,,W13 9BP,Tel: 020 8840 8744, - ,,,No ratings yet Rate it yourself - /Services/opticians/LeaveReview/DefaultView.aspx?id=OP_5HX_3353__000001_W139BP,0,0,
M&S Opticians,,OPT,,69-79 The Broadway,,"Ealing, London",,W5 5JW,Tel: 0208 0169602, - ,,,N/A - Data not available,,,
Vision Express,OP_5HX_11734__000003_W55JY,OPT,82 Ealing Broadway Centre,The Broadway,Ealing,London,,W5 5JY,Tel: 020 8840 1880, - ,,,No ratings yet Rate it yourself - /Services/opticians/LeaveReview/DefaultView.aspx?id=OP_5HX_11734__000003_W55JY,0,0,
David Clulow,OP_5HX_6485__000004_W55JY,OPT,47 Ealing Broadway Centre,The Broadway,Ealing,,,W5 5JY,Tel: 020 8579 7274, - ,,,No ratings yet Rate it yourself - /Services/opticians/LeaveReview/DefaultView.aspx?id=OP_5HX_6485__000004_W55JY,0,0,