Organisation Name,NACS Code,Organisation Type,Address1,Address2,Address3,Address4,Address5,PostCode,Telephone Number,Opening time,Value  (Opening time),Banding Classification  (Opening time),NHS.UK users rating,Value  (NHS.UK users rating),Banding Classification  (NHS.UK users rating),Car parking (Is there car parking at this organisation?)
Euro Optica,OP_5A9_13678__000001_NW11,OPT,80 Golders Green,Golders Green,London,,,NW11 8LN,Tel: 020 8458 2888, - ,,,No ratings yet Rate it yourself - /Services/opticians/LeaveReview/DefaultView.aspx?id=OP_5A9_13678__000001_NW11,0,0,
Boots-Golders Green,OP_5A9_1698__000002_NW118EL,OPT,55 Golders Green Road,,Golders Green,London,,NW11 8EL,Tel: 0208 455 8418, - ,,,No ratings yet Rate it yourself - /Services/opticians/LeaveReview/DefaultView.aspx?id=OP_5A9_1698__000002_NW118EL,0,0,
SPECSAVERS OPTICIANS,OP-5A9-13607__000001_NW118EE,OPT,29 Golders Green Road,Golders Green,London,,,NW11 8EE,Tel: 020 8209 9840, - ,,,No ratings yet Rate it yourself - /Services/opticians/LeaveReview/DefaultView.aspx?id=OP-5A9-13607__000001_NW118EE,0,0,
Globe Opticians,OP_5A9_1689__000002_NW117RR,OPT,618 Finchley Road,,Golders Green,,,NW11 7RR,Tel: 0208 458 3035, - ,,,1 rating Rate it yourself - /Services/opticians/LeaveReview/DefaultView.aspx?id=OP_5A9_1689__000002_NW117RR,,,
Simon Hoff,OP_5A9_13613__000001_NW119NN,OPT,18 Russell Parade,Golders Green Road,London,,,NW11 9NN,Tel: 020 8458 9992, - ,,,No ratings yet Rate it yourself - /Services/opticians/LeaveReview/DefaultView.aspx?id=OP_5A9_13613__000001_NW119NN,0,0,
Kusoom Vadgama,OP_5A9_13668__000001_NW116XL,OPT,808 Finchley Road,Temple Fortune,London,,,NW11 6XL,Tel: 020 8458 3802, - ,,,No ratings yet Rate it yourself - /Services/opticians/LeaveReview/DefaultView.aspx?id=OP_5A9_13668__000001_NW116XL,0,0,
EYELEVEL OPTOMETRISTS,OP 1689__000002_NW110QS,OPT,24 Temple Fortune Parade,Finchley Road,London,,,NW11 0QS,Tel: 020 8209 1231, - ,,,1 rating Rate it yourself - /Services/opticians/LeaveReview/DefaultView.aspx?id=OP 1689__000002_NW110QS,,,
Melissa Conway Ltd,OP_5A9_1485__000002_NW110AA,OPT,1193 Finchley Road,,London,,,NW11 0AA,Tel: 020 8201 9292, - ,,,1 rating Rate it yourself - /Services/opticians/LeaveReview/DefaultView.aspx?id=OP_5A9_1485__000002_NW110AA,,,
R. R. Weiniger,OP_5A9_13670__000001_NW110JB,OPT,69 Cranbourne Gardens,London,,,,NW11 0JB,Tel: 020 8455 1893, - ,,,No ratings yet Rate it yourself - /Services/opticians/LeaveReview/DefaultView.aspx?id=OP_5A9_13670__000001_NW110JB,0,0,
Home Opti-Care Ltd,OP_5PX_0000__000001_NW42QH,OPT,64 Danescroft,Brent Street,Hendon,London,,NW4 2QH,Tel: 0208 202 1364, - ,,,No ratings yet Rate it yourself - /Services/opticians/LeaveReview/DefaultView.aspx?id=OP_5PX_0000__000001_NW42QH,0,0,
Simon Gavzey,OP_5A9_13594__000001_HA89TP,OPT,Gavzey Opticians,48 The Market Place,,Hampstead Garden Suburb,,NW11 6JP,Tel: 020 8731 9999, - ,,,No ratings yet Rate it yourself - /Services/opticians/LeaveReview/DefaultView.aspx?id=OP_5A9_13594__000001_HA89TP,0,0,
Judith Stechler,OP_5A9_13614__000001_N33DS,OPT,13 Chessington Avenue,Finchley,London,,,N3 3DS,Tel: 020 8346 5600, - ,,,No ratings yet Rate it yourself - /Services/opticians/LeaveReview/DefaultView.aspx?id=OP_5A9_13614__000001_N33DS,0,0,
Boots-Brent Cross,OP_5A9_6916__000003_NW43FB,OPT,Brent Cross Centre,,,Brent Cross,,NW4 3FB,Tel: 020 8202 7530, - ,,,2 ratings Rate it yourself - /Services/opticians/LeaveReview/DefaultView.aspx?id=OP_5A9_6916__000003_NW43FB,,,
Vision Express Ltd,OP_5A9_13669__000002_NW43FB,OPT,Brent Cross Shopping Centre,Prince Charles Drive,Hendon,,,NW4 3FB,Tel: 020 8202 6715, - ,,,No ratings yet Rate it yourself - /Services/opticians/LeaveReview/DefaultView.aspx?id=OP_5A9_13669__000002_NW43FB,0,0,
Ben Mirkin Ltd,OP_5A9_3502__000001_NW43FG,OPT,Unit V2 Brent Cross Shopping Centre,Prince Charles Drive,London,,,NW4 3FG,Tel: 020 8202 3771, - ,,,No ratings yet Rate it yourself - /Services/opticians/LeaveReview/DefaultView.aspx?id=OP_5A9_3502__000001_NW43FG,0,0,
Hendon Opticians & Contact Lens Centre,0206141422,OPT,"Hendon Opticians, Hendon",127 Brent Street,,Hendon,,NW4 2DX,Tel: 02082025555, - ,,,3 ratings Rate it yourself - /Services/opticians/LeaveReview/DefaultView.aspx?id=0206141422,,,
Central Opticians,OP_5A9_13606__000001_NW43UT,OPT,11 Vivian Avenue,Hendon,,London,,NW4 3UT,Tel: 0208 202 5165, - ,,,No ratings yet Rate it yourself - /Services/opticians/LeaveReview/DefaultView.aspx?id=OP_5A9_13606__000001_NW43UT,0,0,
Eye Emporium Ltd,000025K5__000004_NW23HT,OPT,173b Cricklewood Broadway,,Cricklewood,London,,NW2 3HT,Tel: 020 8452 2273, - ,,,No ratings yet Rate it yourself - /Services/opticians/LeaveReview/DefaultView.aspx?id=000025K5__000004_NW23HT,0,0,
Vision Express Hampstead,OP_5K7_7003__000001_NW31DL,OPT,54 Heath Street,,London,,,NW3 1DL,Tel: 020 7431 0031, - ,,,No ratings yet Rate it yourself - /Services/opticians/LeaveReview/DefaultView.aspx?id=OP_5K7_7003__000001_NW31DL,0,0,
Glasses 2 Go,GLASSES2GO_NW2_3EP,OPT,,62 Cricklewood Broadway,,London,,NW2 3EP,, - ,,,2 ratings Rate it yourself - /Services/opticians/LeaveReview/DefaultView.aspx?id=GLASSES2GO_NW2_3EP,,,
Miltons Eyecare,OP_5K7_12749__000001_NW36TE,OPT,38 Heath Street,,London,,,NW3 6TE,Tel: 020 7794 4477, - ,,,1 rating Rate it yourself - /Services/opticians/LeaveReview/DefaultView.aspx?id=OP_5K7_12749__000001_NW36TE,,,
Dolland and Aitchison,OP_5K7_10607__000002_NW36TE,OPT,26 Heath Street,,Hampstead,London,,NW3 6TE,Tel: 0207 7946101, - ,,,No ratings yet Rate it yourself - /Services/opticians/LeaveReview/DefaultView.aspx?id=OP_5K7_10607__000002_NW36TE,0,0,
Central Vision Optics Limited,OP-5A9-13606__000001_N31DP,OPT,327 Regents Park Road,Finchley,,London,,N3 1DP,Tel: 020 8343 1122, - ,,,No ratings yet Rate it yourself - /Services/opticians/LeaveReview/DefaultView.aspx?id=OP-5A9-13606__000001_N31DP,0,0,
David Clulow,OP_5K7_6461__000001_NW31QX,OPT,73 Hampstead High Street,,London,,,NW3 1QX,Tel: 020 7435 8445, - ,,,No ratings yet Rate it yourself - /Services/opticians/LeaveReview/DefaultView.aspx?id=OP_5K7_6461__000001_NW31QX,0,0,
The Eye Cube,OP_5K7_7002__000002_NW61LJ,OPT,256 West End Lane,,London,,,NW6 1LJ,Tel: 020 7433 1333, - ,,,No ratings yet Rate it yourself - /Services/opticians/LeaveReview/DefaultView.aspx?id=OP_5K7_7002__000002_NW61LJ,0,0,
Optikal,OP_5A9_689__000001_N32LJ,OPT,352 Regents Park Road,,London,,,N3 2LJ,Tel: 020 8371 0023, - ,,,No ratings yet Rate it yourself - /Services/opticians/LeaveReview/DefaultView.aspx?id=OP_5A9_689__000001_N32LJ,0,0,
Panoptica,OP_5A9_10056__000001_N29PN,OPT,56 High Road,East Finchley,London,,,N2 9PN,Tel: 020 8883 6693, - ,,,No ratings yet Rate it yourself - /Services/opticians/LeaveReview/DefaultView.aspx?id=OP_5A9_10056__000001_N29PN,0,0,
David Hillel,HILLEL123,OPT,,119 High Road,East Finchley,London,,N2 8AG,Tel: 020 8444 2233, - ,,,2 ratings Rate it yourself - /Services/opticians/LeaveReview/DefaultView.aspx?id=HILLEL123,,,
Stewart Duncan,OP_5A9_4396__000002_N29ED,OPT,126 High Road,East Finchley,London,London,,N2 9ED,Tel: 020 8883 2020, - ,,,2 ratings Rate it yourself - /Services/opticians/LeaveReview/DefaultView.aspx?id=OP_5A9_4396__000002_N29ED,,,
Arthur Morrice,OP_5K7_136__000001_NW31ND,OPT,62 Rosslyn Hill,Hampstead,London,,,NW3 1ND,Tel: 020 7794 4112, - ,,,No ratings yet Rate it yourself - /Services/opticians/LeaveReview/DefaultView.aspx?id=OP_5K7_136__000001_NW31ND,0,0,
Insight West Hampstead Opticians,OP_5K7_7494__000001_NW61XN,OPT,247 West End Lane,,London,,,NW6 1XN,Tel: 020 7435 1485, - ,,,No ratings yet Rate it yourself - /Services/opticians/LeaveReview/DefaultView.aspx?id=OP_5K7_7494__000001_NW61XN,0,0,
Finchley Eyecare,OP_5A9_6337__000001_N32BU,OPT,90 Ballards Lane,Finchley,London,,,N3 2DL,Tel: 020 8343 0780, - ,,,No ratings yet Rate it yourself - /Services/opticians/LeaveReview/DefaultView.aspx?id=OP_5A9_6337__000001_N32BU,0,0,
Icon the Opticians (DOM),5LA_OPT_25__000008_NW32QB,OPT,23 Southend Road,,London,,,NW3 2QB,Tel: 0207 435 5888, - ,,,No ratings yet Rate it yourself - /Services/opticians/LeaveReview/DefaultView.aspx?id=5LA_OPT_25__000008_NW32QB,0,0,
Icon the Opticians,OP_5K7_6005__000001_NW32QB,OPT,57 Southend Road,,London,,,NW3 2QB,Tel: 020 7435 5888, - ,,,No ratings yet Rate it yourself - /Services/opticians/LeaveReview/DefaultView.aspx?id=OP_5K7_6005__000001_NW32QB,0,0,
Kingsley Opticians,OP_5A9_5525__000003_N31XP,OPT,71 Ballards Lane,Finchley,,London,,N3 1XT,Tel: 020 8346 9636, - ,,,No ratings yet Rate it yourself - /Services/opticians/LeaveReview/DefaultView.aspx?id=OP_5A9_5525__000003_N31XP,0,0,
Optique 20:20 ,OP_5K7_6008__000002_NW36LU,OPT,"Unit 1a, The O2 Centre, 255 Finchley Road",,London,,,NW3 6LU,Tel: 020 7431 6902, - ,,,1 rating Rate it yourself - /Services/opticians/LeaveReview/DefaultView.aspx?id=OP_5K7_6008__000002_NW36LU,,,
Eyegen Opticians (DOM),OP_5LC_622__000001_NW62DB,OPT,298 Kilburn High Road,,,London,,NW6 2DB,Tel: 0207 625 8925, - ,,,No ratings yet Rate it yourself - /Services/opticians/LeaveReview/DefaultView.aspx?id=OP_5LC_622__000001_NW62DB,0,0,
Eyegen Opticians,OP_5K7_5007__000001_NW62DP,OPT,,298 Kilburn Road,,London,,NW6 2DB,Tel: 0207 625 8925, - ,,,No ratings yet Rate it yourself - /Services/opticians/LeaveReview/DefaultView.aspx?id=OP_5K7_5007__000001_NW62DP,0,0,
Spec Savers Swiss Cottage,SPECSAVERS_NW3_6LB,OPT,,171 Finchley Road,,London,,NW3 6LB,Tel: 02076449990, - ,,,No ratings yet Rate it yourself - /Services/opticians/LeaveReview/DefaultView.aspx?id=SPECSAVERS_NW3_6LB,0,0,
P Leaning Optometrist,OP_5K7_5010__000003_N65JT,OPT,40 Highgate High Street,,,London,,N6 5JG,Tel: 020 8340 6228, - ,,,No ratings yet Rate it yourself - /Services/opticians/LeaveReview/DefaultView.aspx?id=OP_5K7_5010__000003_N65JT,0,0,
Optique 20-20 Optometrists,OP_5K7_7180__000001_NW32AJ,OPT,194 Haverstock Hill,,London,,,NW3 2AJ,Tel: 020 7794 2020, - ,,,1 rating Rate it yourself - /Services/opticians/LeaveReview/DefaultView.aspx?id=OP_5K7_7180__000001_NW32AJ,,,
K J Popat,OP_5K5_4272__000001_NW102TE,OPT,11 High Road,Willesden,London,,,NW10 2TE,Tel: 020 8451 0754, - ,,,No ratings yet Rate it yourself - /Services/opticians/LeaveReview/DefaultView.aspx?id=OP_5K5_4272__000001_NW102TE,0,0,
Malcom Coates,OP_5K7_1239__000001_NW35EP,OPT,11 New College Parade,,London,,,NW3 5EP,Tel: 020 7586 3866, - ,,,No ratings yet Rate it yourself - /Services/opticians/LeaveReview/DefaultView.aspx?id=OP_5K7_1239__000001_NW35EP,0,0,
Eye Place,OP_5K7_8167__000001_NW34QT,OPT,153 Haverstock Hill,153 Haverstock Hill,London,London,,NW3 4QT,Tel: 020 7722 5446, - ,,,No ratings yet Rate it yourself - /Services/opticians/LeaveReview/DefaultView.aspx?id=OP_5K7_8167__000001_NW34QT,0,0,
Vision Express,OP_5K7_5012__000004_NW36JP,OPT,4 Harbern Parade,,London,,,NW3 6JP,Tel: 020 7449 2693, - ,,,No ratings yet Rate it yourself - /Services/opticians/LeaveReview/DefaultView.aspx?id=OP_5K7_5012__000004_NW36JP,0,0,
Personal Eyez Ltd,Q7F4K,OPT,,2 Harben Parade,,London,,NW3 6JP,Tel: 020 7722 2991, - ,,,No ratings yet Rate it yourself - /Services/opticians/LeaveReview/DefaultView.aspx?id=Q7F4K,0,0,
Eye Emporium Ltd T/A Open Eye Opticians,OP_5K5_14720__000001_NW102PU,OPT,64 High Road,Willesden,London,,,NW10 2PU,Tel: 020 8830 2727, - ,,,No ratings yet Rate it yourself - /Services/opticians/LeaveReview/DefaultView.aspx?id=OP_5K5_14720__000001_NW102PU,0,0,
Robert Linsky Optometrists Ltd,OP_5C9_4689__000001_N103HP,OPT,11 Fortis Green Road,Muswell Hill,London,London,,N10 3HP,Tel: 020 8883 6879, - ,,,5 ratings Rate it yourself - /Services/opticians/LeaveReview/DefaultView.aspx?id=OP_5C9_4689__000001_N103HP,,,
Robert Linsky,F4Y3L,OPT,,11 Fortis Green Road,,"Muswell Hill, London",Greater London,N10 3HP,Tel: 0208 8836879, - ,,,No ratings yet Rate it yourself - /Services/opticians/LeaveReview/DefaultView.aspx?id=F4Y3L,0,0,
Perspective Optometrists,OP_5K7_5011__000001_NW34GT,OPT,8 Englands Street,,London,,,NW3 4GT,Tel: 020 7586 5508, - ,,,1 rating Rate it yourself - /Services/opticians/LeaveReview/DefaultView.aspx?id=OP_5K7_5011__000001_NW34GT,,,
Boots-Kilburn,OP_5K7_7995__000001_NW64JD,OPT,132 High Road,,Kilburn,London,,NW6 4JD,Tel: 0207 624 5166, - ,,,1 rating Rate it yourself - /Services/opticians/LeaveReview/DefaultView.aspx?id=OP_5K7_7995__000001_NW64JD,,,
Observatory - The Opticians,OP_5C9_1741__000001_N103RT,OPT,64 Muswell Hill Broadway,Muswell Hill,,London,,N10 3RT,Tel: 020 8444 0143, - ,,,No ratings yet Rate it yourself - /Services/opticians/LeaveReview/DefaultView.aspx?id=OP_5C9_1741__000001_N103RT,0,0,
Aristone Opticians,OP_5K5_1709__000001_NW67HR,OPT,137 Kilburn High Road,,London,,,NW6 7HR,Tel: 020 7372 1525, - ,,,No ratings yet Rate it yourself - /Services/opticians/LeaveReview/DefaultView.aspx?id=OP_5K5_1709__000001_NW67HR,0,0,
Norman Hart Opticians,OP_5K5_13098__000002_NW100AA,OPT,6 Neasden Parade,250 Neasden Lane,London,,,NW10 0AA,Tel: 020 8450 8153, - ,,,2 ratings Rate it yourself - /Services/opticians/LeaveReview/DefaultView.aspx?id=OP_5K5_13098__000002_NW100AA,,,
Specsavers Opticians,OP_5K7_1678__000001_NW64HY,OPT,116 Kilburn High Road,Kilburn,London,,,NW6 4HY,Tel: 020 7328 5655, - ,,,1 rating Rate it yourself - /Services/opticians/LeaveReview/DefaultView.aspx?id=OP_5K7_1678__000001_NW64HY,,,
Eye Emporium Ltd,OP_5K5_3180__000002_NW102PB,OPT,184 High Road,Willesden,London,,,NW10 2PB,Tel: 020 8459 7689, - ,,,No ratings yet Rate it yourself - /Services/opticians/LeaveReview/DefaultView.aspx?id=OP_5K5_3180__000002_NW102PB,0,0,
H. R. Breakspear,OP_5C9_1310__000001_N101BX,OPT,343 Muswell Hill Broadway,Muswell Hill,London,,,N10 1BX,Tel: 020 8883 2183, - ,,,2 ratings Rate it yourself - /Services/opticians/LeaveReview/DefaultView.aspx?id=OP_5C9_1310__000001_N101BX,,,
Specsavers Opticians,C/OL2438-5C9__000003_N101DJ,OPT,404 Muswell Hill Broadway,Muswell Hill,London,,,N10 1DJ,, - ,,,No ratings yet Rate it yourself - /Services/opticians/LeaveReview/DefaultView.aspx?id=C/OL2438-5C9__000003_N101DJ,0,0,
Boots-London - Muswell Hill,OP_5C9_2574__000001_N101BS,OPT,450 Muswell Hill Broadway,,,London,,N10 1BS,Tel: 0208 883 1216, - ,,,2 ratings Rate it yourself - /Services/opticians/LeaveReview/DefaultView.aspx?id=OP_5C9_2574__000001_N101BS,,,
I S Cohen,OP_5K7_6006__000003_NW64HJ,OPT,46 Kilburn High Road,,London,,,NW6 4HJ,Tel: 020 7624 9277, - ,,,No ratings yet Rate it yourself - /Services/opticians/LeaveReview/DefaultView.aspx?id=OP_5K7_6006__000003_NW64HJ,0,0,
Queens Crescent Eye Care,OP_5K7_596__000001_NW54DY,OPT,,58 Queens Crescent,Kentish Town,London,,NW5 4EE,Tel: 020 7485 3389, - ,,,No ratings yet Rate it yourself - /Services/opticians/LeaveReview/DefaultView.aspx?id=OP_5K7_596__000001_NW54DY,0,0,
Socialeyes Optics Ltd,OP_5A9_13604__000001_N120EL,OPT,4 Nether Street,North Finchley,London,,,N12 0EL,Tel: 020 8445 9661, - ,,,No ratings yet Rate it yourself - /Services/opticians/LeaveReview/DefaultView.aspx?id=OP_5A9_13604__000001_N120EL,0,0,
Safarian and Simon Opticians,TP9FW,OPT,,53 Abbey Road,,London,,NW8 0AD,, - ,,,1 rating Rate it yourself - /Services/opticians/LeaveReview/DefaultView.aspx?id=TP9FW,,,
Boots-North Finchley,OP_5A9_7229__000001_N129QD,OPT,734 High Road,,North Finchley,London,,N12 9QD,Tel: 0208 343 7721, - ,,,No ratings yet Rate it yourself - /Services/opticians/LeaveReview/DefaultView.aspx?id=OP_5A9_7229__000001_N129QD,0,0,
Tesco Opticians,OP-5A9-13605__000001_N120SH,OPT,North Circular Road,North Finchley,,London,,N12 0SH,Tel: 0345 677 9171, - ,,,No ratings yet Rate it yourself - /Services/opticians/LeaveReview/DefaultView.aspx?id=OP-5A9-13605__000001_N120SH,0,0,
Sidfiz Optique,04BR,OPT,Sid Fiz Optique,46 Salusbury Road,,London,,NW6 6NN,Tel: 02076256694, - ,,,No ratings yet Rate it yourself - /Services/opticians/LeaveReview/DefaultView.aspx?id=04BR,0,0,
Sidfiz Optic,OPT_NW66NN_1,OPT,,46 Salusbury Road,,London,,NW6 6NN,, - ,,,No ratings yet Rate it yourself - /Services/opticians/LeaveReview/DefaultView.aspx?id=OPT_NW66NN_1,0,0,
Sidfiz Optic,OPT_NW66NN_2,OPT,,46 Salusbury Road,,London,,NW6 6NN,, - ,,,No ratings yet Rate it yourself - /Services/opticians/LeaveReview/DefaultView.aspx?id=OPT_NW66NN_2,0,0,
Alexander Opticians,OP_5K7_7005__000001_NW33DR,OPT,14b Elsworthy Terrace,,London,,,NW3 3DR,Tel: 020 7586 6579, - ,,,1 rating Rate it yourself - /Services/opticians/LeaveReview/DefaultView.aspx?id=OP_5K7_7005__000001_NW33DR,,,
Douglas & Tobin,OP_5K8_2993__000001_N193QS,OPT,3 St. Johns Way,,London,,,N19 3QS,Tel: 020 7272 1506, - ,,,No ratings yet Rate it yourself - /Services/opticians/LeaveReview/DefaultView.aspx?id=OP_5K8_2993__000001_N193QS,0,0,
Scrivens Opticians,OP_5A9_7641__000002_N128PR,OPT,752 High Road,North Finchley,London,London,,N12 9QG,Tel: 020 8445 5881, - ,,,No ratings yet Rate it yourself - /Services/opticians/LeaveReview/DefaultView.aspx?id=OP_5A9_7641__000002_N128PR,0,0,
Ellerman Optician,OP_5LC_13381__000001_W91QJ,OPT,227 Maida Vale,,London,,,W9 1QJ,Tel: 020 7624 6380, - ,,,No ratings yet Rate it yourself - /Services/opticians/LeaveReview/DefaultView.aspx?id=OP_5LC_13381__000001_W91QJ,0,0,
Boots-Colindale,OP_5A9_13592__000001_NW96LE,OPT,The Hyde,Edgware Road,,Colindale,,NW9 5EB,Tel: 0208 205 9280, - ,,,2 ratings Rate it yourself - /Services/opticians/LeaveReview/DefaultView.aspx?id=OP_5A9_13592__000001_NW96LE,,,
TESCO OPTICIANS,5K5/ 3036__000002_NW100TL,OPT,TESCO WEMBLEY BRENT PARK,GREAT CENTRAL WAY,,LONDON,,NW10 0TL,Tel: 0345 601 3479, - ,,,No ratings yet Rate it yourself - /Services/opticians/LeaveReview/DefaultView.aspx?id=5K5/ 3036__000002_NW100TL,0,0,
Specsavers Opticians,5A9_OPT01__000002_N129QU,OPT,796 High Road,North Finchley,London,,,N12 9QU,Tel: 020 8492 9750, - ,,,2 ratings Rate it yourself - /Services/opticians/LeaveReview/DefaultView.aspx?id=5A9_OPT01__000002_N129QU,,,
Ashdown & Collins,OP_5K5_14713__000001_NW103JP,OPT,118 Chamberlayne Road,Kensal Rise,London,,,NW10 3JP,Tel: 020 8969 0881, - ,,,No ratings yet Rate it yourself - /Services/opticians/LeaveReview/DefaultView.aspx?id=OP_5K5_14713__000001_NW103JP,0,0,
Nicholas K Taylor,OP_5K7_6007__000001_NW52TH,OPT,308 Kentish Town,,London,,,NW5 2TH,Tel: 020 7485 2153, - ,,,No ratings yet Rate it yourself - /Services/opticians/LeaveReview/DefaultView.aspx?id=OP_5K7_6007__000001_NW52TH,0,0,
Kensal Eyes Opticians,OP_5K5_4919__000001_NW103NR,OPT,1 Bridge House,Chamberlayne Road,London,,,NW10 3NR,Tel: 020 8969 4109, - ,,,No ratings yet Rate it yourself - /Services/opticians/LeaveReview/DefaultView.aspx?id=OP_5K5_4919__000001_NW103NR,0,0,
Asda Opticians,OPT_NW9 0AS,OPT,,EDGEWARE ROAD,COLINDALE,HARROW,,NW9 0AS,Tel: 0208 358 2513, - ,,,No ratings yet Rate it yourself - /Services/opticians/LeaveReview/DefaultView.aspx?id=OPT_NW9 0AS,0,0,
Scrivens Opticians,OP_5K7_7423__000001_NW52JS,OPT,271 Kentish Town Road,271 Kentish Town Road,London,London,,NW5 2JS,Tel: 020 7485 2886, - ,,,46 ratings Rate it yourself - /Services/opticians/LeaveReview/DefaultView.aspx?id=OP_5K7_7423__000001_NW52JS,,,
Betterspecs Opticians,OP_5K7_8885__000002_NW52AE,OPT,210 Kentish Town Road,Camden,London,,,NW5 2AD,Tel: 020 7482 3859, - ,,,4 ratings Rate it yourself - /Services/opticians/LeaveReview/DefaultView.aspx?id=OP_5K7_8885__000002_NW52AE,,,
A View Opticians,OP_5C9_9782__000001_N88AA,OPT,6 Crouch End Hill,Hornsey,London,,,N8 8AA,Tel: 020 8340 3447, - ,,,1 rating Rate it yourself - /Services/opticians/LeaveReview/DefaultView.aspx?id=OP_5C9_9782__000001_N88AA,,,
Specsavers Optcians,COL24435C9__000003_N88DU,OPT,33 The Broadway,Crouch End,London,,,N8 8DU,, - ,,,No ratings yet Rate it yourself - /Services/opticians/LeaveReview/DefaultView.aspx?id=COL24435C9__000003_N88DU,0,0,
C H Lim Ophthalmic Opticians,OP_5C9_398__000001_N88PR,OPT,16 Topsfield Parade,Tottenham Lane,London,,,N8 8PR,Tel: 020 8348 8615, - ,,,8 ratings Rate it yourself - /Services/opticians/LeaveReview/DefaultView.aspx?id=OP_5C9_398__000001_N88PR,,,
Schuller Opticians,OP_5LC_9331__000002_NW87NH,OPT,33 St. Johns Wood High Street,,London,,,NW8 7NH,Tel: 020 7722 8242, - ,,,1 rating Rate it yourself - /Services/opticians/LeaveReview/DefaultView.aspx?id=OP_5LC_9331__000002_NW87NH,,,
David Clulow Opticians,F85A113__000001_N89SU,OPT,40 The Broadway,Crouch End,London,,,N8 9SU,Tel: 020 8340 2325, - ,,,No ratings yet Rate it yourself - /Services/opticians/LeaveReview/DefaultView.aspx?id=F85A113__000001_N89SU,0,0,
Safarian & Simon,OP_5LC_13404__000001_NW87NH,OPT,62 St John's Wood High Street,St. John's Wood,,London,Greater London,NW8 7SH,Tel: 0207 722 1917, - ,,,3 ratings Rate it yourself - /Services/opticians/LeaveReview/DefaultView.aspx?id=OP_5LC_13404__000001_NW87NH,,,
K. J. Davies Opticians,P6D1Q,OPT,12 Priory Road,12 Priory Road,London,"Hornsey, London",,N8 7RD,Tel: 020 8341 4545, - ,,,No ratings yet Rate it yourself - /Services/opticians/LeaveReview/DefaultView.aspx?id=P6D1Q,0,0,
Boots-Mill Hill,OP_5A9_7236__000001_NW73LL,OPT,14 The Broadway,,Mill Hill,London,,NW7 3LL,Tel: 0208 201 1817, - ,,,No ratings yet Rate it yourself - /Services/opticians/LeaveReview/DefaultView.aspx?id=OP_5A9_7236__000001_NW73LL,0,0,
Scrivens Opticians,OP_5A9_12214__000002_NW73DA,OPT,47 The Broadway,Mill Hill,London,London,,NW7 3DA,Tel: 020 8906 0626, - ,,,No ratings yet Rate it yourself - /Services/opticians/LeaveReview/DefaultView.aspx?id=OP_5A9_12214__000002_NW73DA,0,0,
Asda Optician,OPT_HA9 9EX,OPT,,FORTY ROAD,,WEMBLEY,,HA9 9EX,Tel: 0208 7826320, - ,,,No ratings yet Rate it yourself - /Services/opticians/LeaveReview/DefaultView.aspx?id=OPT_HA9 9EX,0,0,
Kingsbury Opticians,OP_5K5_11069__000001_NW99HE,OPT,528 Kingsbury Road,Kingsbury,London,,,NW9 9HE,Tel: 020 8204 8758, - ,,,No ratings yet Rate it yourself - /Services/opticians/LeaveReview/DefaultView.aspx?id=OP_5K5_11069__000001_NW99HE,0,0,
Realeyes - The Eye Clinic,OPT_W93QH_1,OPT,Realeyes - The Eye Clinic,568 Harrow Road,,London,,W9 3QH,Tel: 020 3897 0200, - ,,,No ratings yet Rate it yourself - /Services/opticians/LeaveReview/DefaultView.aspx?id=OPT_W93QH_1,0,0,
Eyecloud Opticians,OP_5K5_6725__000002_NW104NS,OPT,75 High Street,Harlesden,,London,,NW10 4NS,Tel: 020 8961 0077, - ,,,1 rating Rate it yourself - /Services/opticians/LeaveReview/DefaultView.aspx?id=OP_5K5_6725__000002_NW104NS,,,
Costco Wholesale UK Limited,O7A7A,OPT,,30 Second Way,,Wembley,,HA9 0YJ,, - ,,,No ratings yet Rate it yourself - /Services/opticians/LeaveReview/DefaultView.aspx?id=O7A7A,0,0,
Costco Wholesale UK Limited,O7A7A,OPT,,30 Second Way,,Wembley,,HA9 0YJ,, - ,,,No ratings yet Rate it yourself - /Services/opticians/LeaveReview/DefaultView.aspx?id=O7A7A,0,0,
A.I. Jones Ltd,OP_5A9_13578__000001_HA80BB,OPT,132 Burnt Oak Broadway,,,Edgware,Middlesex,HA8 0BB,Tel: 020 8952 1102, - ,,,1 rating Rate it yourself - /Services/opticians/LeaveReview/DefaultView.aspx?id=OP_5A9_13578__000001_HA80BB,,,
Oak Optometrists,OP_5K6_14957__000002_HA85EP,OPT,61 Burnt Oak Broadway,Edgware,Middlesex,,,HA8 5EP,Tel: 020 8951 4004, - ,,,No ratings yet Rate it yourself - /Services/opticians/LeaveReview/DefaultView.aspx?id=OP_5K6_14957__000002_HA85EP,0,0,
Specsavers Opticians (Harlesden Visionplus),5K5_NW10 4LT,OPT,,"Bank Buildings, Unit 8, High Street ",,Harlesden,,NW10 4LT,, - ,,,No ratings yet Rate it yourself - /Services/opticians/LeaveReview/DefaultView.aspx?id=5K5_NW10 4LT,0,0,
Chakshu London,TP9AW,OPT,,97 Parkway,,London,,NW1 7PP,Tel: 0203 981 2907, - ,,,No ratings yet Rate it yourself - /Services/opticians/LeaveReview/DefaultView.aspx?id=TP9AW,0,0,
Stanfields Opticians,OP_5K5_7296__000001_NW99HJ,OPT,572 Kingsbury Road,Kingsbury,London,,,NW9 9HJ,Tel: 020 8204 7124, - ,,,No ratings yet Rate it yourself - /Services/opticians/LeaveReview/DefaultView.aspx?id=OP_5K5_7296__000001_NW99HJ,0,0,
Ronald Brown Opticians,OP_5LC_7422__000001_W93NF,OPT,393 Harrow Road,,London,,,W9 3NF,Tel: 020 8969 2564, - ,,,No ratings yet Rate it yourself - /Services/opticians/LeaveReview/DefaultView.aspx?id=OP_5LC_7422__000001_W93NF,0,0,