Organisation Name,NACS Code,Organisation Type,Address1,Address2,Address3,Address4,Address5,PostCode,Telephone Number,Opening time,Value  (Opening time),Banding Classification  (Opening time),NHS.UK users rating,Value  (NHS.UK users rating),Banding Classification  (NHS.UK users rating),Car parking (Is there car parking at this organisation?)
Bliinx Eyecare Studios,GU35 9LU__000001_GU359LU,OPT,Ganders Business Park,Kingsley,Bordon,Hampshire,,GU35 9LU,Tel: 01420 478899, - ,,,No ratings yet Rate it yourself - /Services/opticians/LeaveReview/DefaultView.aspx?id=GU35 9LU__000001_GU359LU,0,0,
Chandlers Opticians,OP_5DF_866__000002_GU350TN,OPT,5 Forest Centre,,Bordon,,,GU35 0TN,Tel: 01420 477444, - ,,,No ratings yet Rate it yourself - /Services/opticians/LeaveReview/DefaultView.aspx?id=OP_5DF_866__000002_GU350TN,0,0,
Liphook Eyecare,OP_5DF_7292__000001_GU307DW,OPT,Liphook Eye Care,31 Station Road,Liphook,Hampshire,,GU30 7DW,Tel: 01428 725158, - ,,,No ratings yet Rate it yourself - /Services/opticians/LeaveReview/DefaultView.aspx?id=OP_5DF_7292__000001_GU307DW,0,0,
Zaman Opticians Limited,OPT_GU266HJ_1,OPT,,"Edinburgh House,",Crossways Road,Grayshott,Surrey,GU26 6HJ,Tel: 01428 609707, - ,,,1 rating Rate it yourself - /Services/opticians/LeaveReview/DefaultView.aspx?id=OPT_GU266HJ_1,,,
Matheson Optometrists,OP_5DF_1789__000002_GU266HF,OPT,3-4 Victoria Terraces,"Crossways Road, Grayshott",Hindhead,,,GU26 6HJ,Tel: 01428 606069, - ,,,No ratings yet Rate it yourself - /Services/opticians/LeaveReview/DefaultView.aspx?id=OP_5DF_1789__000002_GU266HF,0,0,
Boots Opticians,OPT_GU341BN_1,OPT,,30 High Street,,Hampshire,,GU34 1BN,Tel: 0142084396, - ,,,No ratings yet Rate it yourself - /Services/opticians/LeaveReview/DefaultView.aspx?id=OPT_GU341BN_1,0,0,
Rawlings Opticians,OP_5DF_4855__000001_GU341AW,OPT,36 High Street,,Alton,Hampshire,,GU34 1BD,Tel: 01420 84230, - ,,,No ratings yet Rate it yourself - /Services/opticians/LeaveReview/DefaultView.aspx?id=OP_5DF_4855__000001_GU341AW,0,0,
Specsavers Alton,564738__000002_GU341AW,OPT,,58 High Street,,Alton,,GU34 1ET,Tel: 01420 593600, - ,,,No ratings yet Rate it yourself - /Services/opticians/LeaveReview/DefaultView.aspx?id=564738__000002_GU341AW,0,0,
Alton Eyecare,GU34 1HA__000001_GU341HA,OPT,23 Market Street,,Alton,Hants,,GU34 1HA,Tel: 01420 542363, - ,,,No ratings yet Rate it yourself - /Services/opticians/LeaveReview/DefaultView.aspx?id=GU34 1HA__000001_GU341HA,0,0,
Leightons Opticians & Hearing Care,OP_5DF_1179__000001_GU341EN,OPT,,90 High Street,,Alton,Hampshire,GU34 1EN,Tel: 01420 83070, - ,,,No ratings yet Rate it yourself - /Services/opticians/LeaveReview/DefaultView.aspx?id=OP_5DF_1179__000001_GU341EN,0,0,
Leightons Opticians & Hearing Care,OP_5L5_12053__000001_GU271BZ,OPT,,37 Wey Hill,,Haslemere,Surrey,GU27 1BZ,Tel: 01428 643 975, - ,,,No ratings yet Rate it yourself - /Services/opticians/LeaveReview/DefaultView.aspx?id=OP_5L5_12053__000001_GU271BZ,0,0,
Leightons Opticians & Hearing Care,OP_5L5_7999__000001_GU97PH,OPT,,46 Downing Street,,Farnham,Surrey,GU9 7PH,Tel: 01252 711 369, - ,,,No ratings yet Rate it yourself - /Services/opticians/LeaveReview/DefaultView.aspx?id=OP_5L5_7999__000001_GU97PH,0,0,
Bartlett & Austin,OP_5L5_14605__000001_GU97DN,OPT,9 West Street,Farnham,,Surrey,,GU9 7DN,Tel: 01252 715 728, - ,,,No ratings yet Rate it yourself - /Services/opticians/LeaveReview/DefaultView.aspx?id=OP_5L5_14605__000001_GU97DN,0,0,
C.E. Hall Opticians,OP_5L5_14612__000003_GU97HH,OPT,111 West Street,,,Farnham,Surrey,GU9 7HH,Tel: 01252 713 785, - ,,,No ratings yet Rate it yourself - /Services/opticians/LeaveReview/DefaultView.aspx?id=OP_5L5_14612__000003_GU97HH,0,0,
Specsavers,OP_5L5_14615__000004_GU97HH,OPT,119 West Street,Farnham,Surrey,,,GU9 7HH,Tel: 01252 727 737, - ,,,No ratings yet Rate it yourself - /Services/opticians/LeaveReview/DefaultView.aspx?id=OP_5L5_14615__000004_GU97HH,0,0,
The Optical Studio,OP_5L5_14611__000001_GU97LL,OPT,,19 Lion and Lamb Yard,Farnham,Surrey,,GU9 7LL,Tel: 01252 717 717, - ,,,No ratings yet Rate it yourself - /Services/opticians/LeaveReview/DefaultView.aspx?id=OP_5L5_14611__000001_GU97LL,0,0,
Boots-Farnham,OP_5L5_3466__000002_GU97NW,OPT,30 The Borough,,,Farnham,Surrey,GU9 7NW,Tel: 01252 715 540, - ,,,No ratings yet Rate it yourself - /Services/opticians/LeaveReview/DefaultView.aspx?id=OP_5L5_3466__000002_GU97NW,0,0,
Optisave,OP_5L5_14614__000001_GU97TX,OPT,13 Woolmead,Farnham,Surrey,,,GU9 7TX,Tel: 01252 717 655, - ,,,No ratings yet Rate it yourself - /Services/opticians/LeaveReview/DefaultView.aspx?id=OP_5L5_14614__000001_GU97TX,0,0,
Chandlers Eyecare,M4G1X,OPT,2 Charter Walk,West Street,,Haslemere,Surrey,GU27 2AD,Tel: 01428 652 512, - ,,,No ratings yet Rate it yourself - /Services/opticians/LeaveReview/DefaultView.aspx?id=M4G1X,0,0,
Batemans  Opticians Ltd,OP_5L5_5818__000002_GU272LA,OPT,68 High Street,,,Haslemere,Surrey,GU27 2LA,Tel: 01428 642 224, - ,,,No ratings yet Rate it yourself - /Services/opticians/LeaveReview/DefaultView.aspx?id=OP_5L5_5818__000002_GU272LA,0,0,
Venturi Optics Limited,OPT_GU272JB_1,OPT,,5 Petworth Road,,Haslemere,,GU27 2JB,, - ,,,No ratings yet Rate it yourself - /Services/opticians/LeaveReview/DefaultView.aspx?id=OPT_GU272JB_1,0,0,
Venturi Optics Limited,3928,OPT,,5 Petworth Road,,Haslemere,,GU27 2JB,, - ,,,No ratings yet Rate it yourself - /Services/opticians/LeaveReview/DefaultView.aspx?id=3928,0,0,
Matheson Optometrists,OP_5DF_14849__000001_GU345HG,OPT,47 Winchester Road,Four Marks,Alton,,,GU34 5HG,Tel: 01420 560082, - ,,,No ratings yet Rate it yourself - /Services/opticians/LeaveReview/DefaultView.aspx?id=OP_5DF_14849__000001_GU345HG,0,0,
Morgan-Owen & Coates Optometrist,OP_5FD_9132__000001_GU323EL,OPT,37 Lavant Street,,Petersfield,Hampshire,,GU32 3EL,Tel: 01730 264258, - ,,,No ratings yet Rate it yourself - /Services/opticians/LeaveReview/DefaultView.aspx?id=OP_5FD_9132__000001_GU323EL,0,0,
Vision Express,GU32 3JA__000001_GU323JA,OPT,,14 Rams Walk,,Petersfield,Hampshire,GU32 3JA,Tel: 01730 235 977, - ,,,No ratings yet Rate it yourself - /Services/opticians/LeaveReview/DefaultView.aspx?id=GU32 3JA__000001_GU323JA,0,0,
A Matheson,GU32 3DT__000001_GU323DT,OPT,17 Chapel Street,,Petersfield,Hants,,GU32 3DT,Tel: 01730 261442, - ,,,No ratings yet Rate it yourself - /Services/opticians/LeaveReview/DefaultView.aspx?id=GU32 3DT__000001_GU323DT,0,0,
Richard C. Arnold Optometrists,OP_5FD_10298__000001_GU323JU,OPT,3-4 Exchange Building,High Street,,Petersfield,,GU32 3JU,Tel: 01730 263302, - ,,,No ratings yet Rate it yourself - /Services/opticians/LeaveReview/DefaultView.aspx?id=OP_5FD_10298__000001_GU323JU,0,0,
Specsavers Opticians,OP_GU323HJ_46229,OPT,Specsavers Opticians,3-4 The Square,,Petersfield,Hampshire,GU32 3HJ,Tel: 01730 710820, - ,,,No ratings yet Rate it yourself - /Services/opticians/LeaveReview/DefaultView.aspx?id=OP_GU323HJ_46229,0,0,
Brian Craig Eyecare Ltd,OP_5G6_14842__000001_GU111HT,OPT,44 Station Road,Aldershot,,Hampshire,,GU11 1HT,Tel: 01252 324048, - ,,,No ratings yet Rate it yourself - /Services/opticians/LeaveReview/DefaultView.aspx?id=OP_5G6_14842__000001_GU111HT,0,0,
Specsavers,OP_5G6_3553__000001_GU111EG,OPT,25 Union Street,,Aldershot,Hampshire,,GU11 1EG,Tel: 01252 345 556, - ,,,No ratings yet Rate it yourself - /Services/opticians/LeaveReview/DefaultView.aspx?id=OP_5G6_3553__000001_GU111EG,0,0,
Vision Express,OP_5G6_1652__000003_GU111DB,OPT,13a Wellington Centre,,Aldershot,Hampshire,,GU11 1DB,Tel: 01252 323491, - ,,,No ratings yet Rate it yourself - /Services/opticians/LeaveReview/DefaultView.aspx?id=OP_5G6_1652__000003_GU111DB,0,0,
Optisave,OP_5G6_14844__000004_GU111DB,OPT,26-27 The Galleries,,Aldershot,Hampshire,,GU11 1DB,Tel: 01252 319234, - ,,,No ratings yet Rate it yourself - /Services/opticians/LeaveReview/DefaultView.aspx?id=OP_5G6_14844__000004_GU111DB,0,0,
McGregor & Hull Eye Care Centre,OP_5G6_14840__000001_GU111DX,OPT,3 Wellington Street,Aldershot,Hampshire,,,GU11 1DX,Tel: 01252 661162, - ,,,No ratings yet Rate it yourself - /Services/opticians/LeaveReview/DefaultView.aspx?id=OP_5G6_14840__000001_GU111DX,0,0,
Owen Leigh Optometry,OP_5FD_14836__000001_GU323LA,OPT,28 The Spain,,Petersfield,Hampshire,,GU32 3LA,Tel: 01730 710174, - ,,,No ratings yet Rate it yourself - /Services/opticians/LeaveReview/DefaultView.aspx?id=OP_5FD_14836__000001_GU323LA,0,0,
The Opticians,OP_5G6_9543__000001_RG291LA,OPT,,113a High Street,,Odiham,Hampshire,RG29 1LA,Tel: 01256 703707, - ,,,No ratings yet Rate it yourself - /Services/opticians/LeaveReview/DefaultView.aspx?id=OP_5G6_9543__000001_RG291LA,0,0,
Brown & White (Opticians) Ltd,OP_5G6_5186__000001_GU513BU,OPT,341 Fleet Road,,Fleet,,,GU51 3NT,Tel: 01252 616830, - ,,,1 rating Rate it yourself - /Services/opticians/LeaveReview/DefaultView.aspx?id=OP_5G6_5186__000001_GU513BU,,,
John Harwood Optometrist,OP_5G6_13202__000002_GU513PQ,OPT,202 Fleet Road,,Fleet,Hampshire,,GU51 4BY,Tel: 01252 613733, - ,,,No ratings yet Rate it yourself - /Services/opticians/LeaveReview/DefaultView.aspx?id=OP_5G6_13202__000002_GU513PQ,0,0,
Boots-Fleet,OP_5G6_5230__000002_GU513LA,OPT,Unit 23,Hart Shopping Centre,Fleet Road,Fleet,Hampshire,GU51 3LA,Tel: 01252 629 259, - ,,,No ratings yet Rate it yourself - /Services/opticians/LeaveReview/DefaultView.aspx?id=OP_5G6_5230__000002_GU513LA,0,0,
Leightons Opticians & Hearing Care,OP_5G6_14843__000001_GU514BE,OPT,,168b Fleet Road,,Fleet,Hampshire,GU51 4BE,Tel: 01252 617753, - ,,,No ratings yet Rate it yourself - /Services/opticians/LeaveReview/DefaultView.aspx?id=OP_5G6_14843__000001_GU514BE,0,0,
Specsavers,OP_5G6_12127__000001_GU513PQ,OPT,231 Fleet Road,,Fleet,Hampshire,,GU51 4BN,Tel: 01252 815 275, - ,,,No ratings yet Rate it yourself - /Services/opticians/LeaveReview/DefaultView.aspx?id=OP_5G6_12127__000001_GU513PQ,0,0,
Optical Centre,OP_5L7_8334__000002_GU125AZ,OPT,5 The Parade,Wharf Road,Ash Vale,,,GU12 5AZ,Tel: 01252 314 332, - ,,,1 rating Rate it yourself - /Services/opticians/LeaveReview/DefaultView.aspx?id=OP_5L7_8334__000002_GU125AZ,,,
Paxton & Welham,PAX001__000001_GU299BY,OPT,Rumbolds Hill,,Midhurst,West Sussex,,GU29 9BY,Tel: 01730 813788, - ,,,No ratings yet Rate it yourself - /Services/opticians/LeaveReview/DefaultView.aspx?id=PAX001__000001_GU299BY,0,0,
Richard C Arnold Optometrists,OP_5L9_3134__000001_GU299PB,OPT,Red Lion Street,Church Hill,Midhurst,West Sussex,,GU29 9PB,Tel: 01730 814035, - ,,,No ratings yet Rate it yourself - /Services/opticians/LeaveReview/DefaultView.aspx?id=OP_5L9_3134__000001_GU299PB,0,0,
iSpy Opticians,TP2DG,OPT,,67 High street,,Godalming,Surrey,GU7 1AW,Tel: 01483 414168, - ,,,No ratings yet Rate it yourself - /Services/opticians/LeaveReview/DefaultView.aspx?id=TP2DG,0,0,
Boots-Godalming,GU7 1AU__000002_GU71AU,OPT,33 High Street,,,Godalming,Surrey,GU7 1AU,Tel: 01483 425087, - ,,,No ratings yet Rate it yourself - /Services/opticians/LeaveReview/DefaultView.aspx?id=GU7 1AU__000002_GU71AU,0,0,
Batemans  Opticians,OP_5L5_10443__000001_GU71AW,OPT,,37 High Street,,Godalming,Surrey,GU7 1AU,Tel: 01483 414 953, - ,,,No ratings yet Rate it yourself - /Services/opticians/LeaveReview/DefaultView.aspx?id=OP_5L5_10443__000001_GU71AW,0,0,
Chandlers Eyecare,B5V5J,OPT,,40 High Street,,Godalming,Surrey,GU7 1DY,Tel: 01483 418 020, - ,,,No ratings yet Rate it yourself - /Services/opticians/LeaveReview/DefaultView.aspx?id=B5V5J,0,0,
Costco Wholesale UK Ltd,CO-1833-8,OPT,,Templar Avenue,,Farnborough,,GU14 6FE,Tel: 01252 896 945, - ,,,No ratings yet Rate it yourself - /Services/opticians/LeaveReview/DefaultView.aspx?id=CO-1833-8,0,0,
Brown & White (Opticians) Ltd,OP_5G6_7713__000001_RG279DJ,OPT,Bourne House,London Road,,Hook,Hampshire,RG27 9DJ,Tel: 01256 763016, - ,,,No ratings yet Rate it yourself - /Services/opticians/LeaveReview/DefaultView.aspx?id=OP_5G6_7713__000001_RG279DJ,0,0,
ASDA Opticians,OP_5G6_14839__000002_GU147LT,OPT,Asda Stores Ltd,West Meade,Farnborough,Hampshire,,GU14 7LT,Tel: 01252 557292, - ,,,No ratings yet Rate it yourself - /Services/opticians/LeaveReview/DefaultView.aspx?id=OP_5G6_14839__000002_GU147LT,0,0,
Boots-Farnborough,OP_5G6_5035__000001_GU147RZ,OPT,87-91 Queensmead,,,Farnborough,Hampshire,GU14 7RZ,Tel: 01252 549100, - ,,,No ratings yet Rate it yourself - /Services/opticians/LeaveReview/DefaultView.aspx?id=OP_5G6_5035__000001_GU147RZ,0,0,
Specsavers,OP_5G6_5949__000002_GU146YA,OPT,Princes Mead Centre,,,Farnborough,,GU14 6YA,Tel: 01252 370 498, - ,,,No ratings yet Rate it yourself - /Services/opticians/LeaveReview/DefaultView.aspx?id=OP_5G6_5949__000002_GU146YA,0,0,
Speccies,GU14 7RL__000001_GU147RL,OPT,71 Queens Mead,,Farnborough,Hants,,GU14 7RL,Tel: 01252 373008, - ,,,No ratings yet Rate it yourself - /Services/opticians/LeaveReview/DefaultView.aspx?id=GU14 7RL__000001_GU147RL,0,0,
Leightons Opticians & Hearing Care,OP_5G6_8593__000001_GU147NY,OPT,20 Victoria Road,.,Farnborough,.,,GU14 7NY,Tel: 01252 545666, - ,,,No ratings yet Rate it yourself - /Services/opticians/LeaveReview/DefaultView.aspx?id=OP_5G6_8593__000001_GU147NY,0,0,
Brian Craig Eyecare Ltd,GU14 7NY__000002_GU147NY,OPT,20 Victoria Road,,Farnborough,Hampshire,,GU14 7NY,, - ,,,No ratings yet Rate it yourself - /Services/opticians/LeaveReview/DefaultView.aspx?id=GU14 7NY__000002_GU147NY,0,0,
Thomas H. Collison Ltd,OP_5L5_9284__000001_GU25XX,OPT,The Royal Surrey County Hospital,Egerton Road,,Guildford,Surrey,GU2 5XX,Tel: 01483 571122 (ext. 2144), - ,,,No ratings yet Rate it yourself - /Services/opticians/LeaveReview/DefaultView.aspx?id=OP_5L5_9284__000001_GU25XX,0,0,
Matheson Optometrists,OP_5E9_572__000001_SO249AG,OPT,1-3 West Street,,,Alresford,,SO24 9AG,Tel: 01962 732336, - ,,,2 ratings Rate it yourself - /Services/opticians/LeaveReview/DefaultView.aspx?id=OP_5E9_572__000001_SO249AG,,,
Rawlings Opticians,OP_5E9_6187__000001_SO249AT,OPT,Bay Tree House,26 West Street,Alresford,Hampshire,,SO24 9AT,Tel: 01962 733269, - ,,,2 ratings Rate it yourself - /Services/opticians/LeaveReview/DefaultView.aspx?id=OP_5E9_6187__000001_SO249AT,,,
Insight Opticians,OP_5L7_13115__000001_GU165HJ,OPT,,21 Frimley High Street,Frimley,Camberley,Surrey,GU16 7HJ,Tel: 01276 627 44, - ,,,1 rating Rate it yourself - /Services/opticians/LeaveReview/DefaultView.aspx?id=OP_5L7_13115__000001_GU165HJ,,,Data not available
Buyspecs Direct,OPT_RG211NX_1,OPT,,"Yard House, May Place",,Basingstoke,,RG21 1NX,, - ,,,No ratings yet Rate it yourself - /Services/opticians/LeaveReview/DefaultView.aspx?id=OPT_RG211NX_1,0,0,
Boots-Frimley,OP_5L7_5111__000002_GU165HY,OPT,4 The Parade,,High Street,Frimley,,GU16 7HY,Tel: 01276 62656, - ,,,No ratings yet Rate it yourself - /Services/opticians/LeaveReview/DefaultView.aspx?id=OP_5L7_5111__000002_GU165HY,0,0,
Leightons Opticians & Hearing Care,OP_5DF_9286__000001_RG217DE,OPT,,9-11 Church Street,,Basingstoke,Hampshire,RG21 7QG,Tel: 01256 321068, - ,,,No ratings yet Rate it yourself - /Services/opticians/LeaveReview/DefaultView.aspx?id=OP_5DF_9286__000001_RG217DE,0,0,
Batemans Opticians,OP_5DF_270__000001_RG217LN,OPT,13 Kensington House,Festival Centre,,Basingstoke,Hampshire,RG21 7LN,Tel: 01256 321327, - ,,,No ratings yet Rate it yourself - /Services/opticians/LeaveReview/DefaultView.aspx?id=OP_5DF_270__000001_RG217LN,0,0,
David Clulow Opticians,OP_5DF_8373__000001_RG217JY,OPT,25 Mayfair House,25 Mayfair House,,Basingstoke,Hampshire,RG21 7JY,Tel: 01256 332113, - ,,,No ratings yet Rate it yourself - /Services/opticians/LeaveReview/DefaultView.aspx?id=OP_5DF_8373__000001_RG217JY,0,0,
Vision Express,OP_5DF_12805__000001_RG217LD,OPT,"Unit 4, Chiswick House","Unit 4, Chiswick House",,Basingstoke,,RG21 7LD,Tel: 01256 814824, - ,,,No ratings yet Rate it yourself - /Services/opticians/LeaveReview/DefaultView.aspx?id=OP_5DF_12805__000001_RG217LD,0,0,
Specsavers,OP_5DF_1542__000001_RG217JR,OPT,5 Chiswick House,Festival Place,,Basingstoke,,RG21 7LD,Tel: 01256 479429, - ,,,98 ratings Rate it yourself - /Services/opticians/LeaveReview/DefaultView.aspx?id=OP_5DF_1542__000001_RG217JR,,,
Prime Opticians,F6T5F,OPT,,"Unit 3a, Old Basing Mall",,Basingstoke,Hampshire,RG21 7AW,Tel: 01256 278 278, - ,,,No ratings yet Rate it yourself - /Services/opticians/LeaveReview/DefaultView.aspx?id=F6T5F,0,0,
Tesco Opticians,654321__000001_RG248BE,OPT,District Shopping Centre,Chineham,,Basingstoke,,RG24 8BE,Tel: 0345 601 3479, - ,,,1 rating Rate it yourself - /Services/opticians/LeaveReview/DefaultView.aspx?id=654321__000001_RG248BE,,,
Boots-Basingstoke - Old Basing Mall,OP_5DF_6102__000002_RG217LW,OPT,15 Old Basing Mall,,,Basingstoke,Hampshire,RG21 7LW,Tel: 01256 364943, - ,,,1 rating Rate it yourself - /Services/opticians/LeaveReview/DefaultView.aspx?id=OP_5DF_6102__000002_RG217LW,,,
Chineham Centre Opticians,OP_5DF_11440__000002_RG248BQ,OPT,17 Chineham Shopping Centre,Chineham,,Basingstoke,,RG24 8BQ,Tel: 01256 327564, - ,,,1 rating Rate it yourself - /Services/opticians/LeaveReview/DefaultView.aspx?id=OP_5DF_11440__000002_RG248BQ,,,
Vision Express ,OP_5L7_6926__000001_GU211GD,OPT,,46 Wolsey Walk,,Woking,Surrey,GU2 6GH,Tel: 01483 767 141, - ,,,No ratings yet Rate it yourself - /Services/opticians/LeaveReview/DefaultView.aspx?id=OP_5L7_6926__000001_GU211GD,0,0,
Specsavers Opticians,OP_5L5_8367__000001_GU14EH,OPT,23 Friary Street,,,Guildford,,GU1 4EH,Tel: 01483 452 225, - ,,,No ratings yet Rate it yourself - /Services/opticians/LeaveReview/DefaultView.aspx?id=OP_5L5_8367__000001_GU14EH,0,0,
Bayfields Opticians,OP_5L5_4821__000001_GU13DY,OPT,37 High Street,,Guildford,Guildford,,GU1 3DY,Tel: 01483 575 650, - ,,,2 ratings Rate it yourself - /Services/opticians/LeaveReview/DefaultView.aspx?id=OP_5L5_4821__000001_GU13DY,,,
Vision Express (UK) Ltd,OP_5L5_719__000002_GU13DY,OPT,51 High Street,,,Guildford,,GU1 3DY,Tel: 01483 300 344, - ,,,No ratings yet Rate it yourself - /Services/opticians/LeaveReview/DefaultView.aspx?id=OP_5L5_719__000002_GU13DY,0,0,
Boots Optician Ltd,OPT_GU14EQ_1,OPT,,22-24 Swan Lane,,Guildford,Surrey,GU1 4EQ,Tel: 01483 573637, - ,,,No ratings yet Rate it yourself - /Services/opticians/LeaveReview/DefaultView.aspx?id=OPT_GU14EQ_1,0,0,
Boots-Guildford - Swan Lane,OP_5L5_629__000001_GU14EQ,OPT,22-24 Swan Lane,,,Guildford,Surrey,GU1 4EQ,Tel: 01483 573637, - ,,,No ratings yet Rate it yourself - /Services/opticians/LeaveReview/DefaultView.aspx?id=OP_5L5_629__000001_GU14EQ,0,0,
Dollond & Aitchison,OP_5L5_7322__000001_GU13HE,OPT,94 High Street,,Guildford,,,GU1 3HE,Tel: 01483 570 093, - ,,,No ratings yet Rate it yourself - /Services/opticians/LeaveReview/DefaultView.aspx?id=OP_5L5_7322__000001_GU13HE,0,0,
David Clulow Opticians,OP_GU13DP_89449,OPT,,103 High Street,,Guildford,,GU1 3DP,Tel: 01483 453339, - ,,,No ratings yet Rate it yourself - /Services/opticians/LeaveReview/DefaultView.aspx?id=OP_GU13DP_89449,0,0,
Optical Express,GU1 3EZ_11111,OPT,"Suite 3, 1 Milkhouse gate",,,Guildford,Surrey,GU1 3EZ,Tel: 0800 023 2020, - ,,,No ratings yet Rate it yourself - /Services/opticians/LeaveReview/DefaultView.aspx?id=GU1 3EZ_11111,0,0,
Batemans (Opticians) Ltd,OP_5L5_2184__000001_GU13HN,OPT,162 High Street,,Guildford,,,GU1 3HN,Tel: 01483 572 953, - ,,,No ratings yet Rate it yourself - /Services/opticians/LeaveReview/DefaultView.aspx?id=OP_5L5_2184__000001_GU13HN,0,0,
Forsight,OP_5G6_14841__000002_GU179AA,OPT,2 Kings Parade,42 London Road,Blackwater,,,GU17 9AA,Tel: 01276 34053, - ,,,No ratings yet Rate it yourself - /Services/opticians/LeaveReview/DefaultView.aspx?id=OP_5G6_14841__000002_GU179AA,0,0,
Medical Eye Centre,GU17 9AA__000003_GU179AA,OPT,White Hart Parade,,Blackwater,Hampshire,,GU17 9AA,, - ,,,No ratings yet Rate it yourself - /Services/opticians/LeaveReview/DefaultView.aspx?id=GU17 9AA__000003_GU179AA,0,0,
Nicklins Opticians,OP_5L5_9270__000001_GU13JB,OPT,216 High Street,,,Guildford,,GU1 3JB,Tel: 01483 561 256, - ,,,No ratings yet Rate it yourself - /Services/opticians/LeaveReview/DefaultView.aspx?id=OP_5L5_9270__000001_GU13JB,0,0,
Helen Hill ,OP_5FD_8448__000001_PO80JS,OPT,39 Drift Road,Clanfield,Waterlooville,,,PO8 0JS,Tel: 023 9257 1028, - ,,,No ratings yet Rate it yourself - /Services/opticians/LeaveReview/DefaultView.aspx?id=OP_5FD_8448__000001_PO80JS,0,0,
Vision Express,OP_5G2_7146__000001_GU470FD,OPT,Tesco Extra,The Meadows,Marshall Road,Sandhurst,Berkshire,GU47 0FD,Tel: 0125 229 8186, - ,,,No ratings yet Rate it yourself - /Services/opticians/LeaveReview/DefaultView.aspx?id=OP_5G2_7146__000001_GU470FD,0,0,
Specsavers Opticians,OP_5L7_3649__000001_GU153SP,OPT,3 Princess Way,,Camberley,,,GU15 3SP,Tel: 01276 677 686, - ,,,No ratings yet Rate it yourself - /Services/opticians/LeaveReview/DefaultView.aspx?id=OP_5L7_3649__000001_GU153SP,0,0,
Vision Express Camberley,E0W2O,OPT,,36 High Street,,Camberley,Surrey,GU15 3RS,Tel: 01276670222, - ,,,No ratings yet Rate it yourself - /Services/opticians/LeaveReview/DefaultView.aspx?id=E0W2O,0,0,
Leightons Opticians & Hearing Care,OP_5L7_11292__000001_GU153RS,OPT,,62 High Street,,Camberley,Surrey,GU15 3RS,Tel: 01276 23648, - ,,,No ratings yet Rate it yourself - /Services/opticians/LeaveReview/DefaultView.aspx?id=OP_5L7_11292__000001_GU153RS,0,0,
Boots-Camberley - Grace Reynolds Walk,OP_5L7_12539__000001_GU153SN,OPT,1B Grace Reynolds Walk,Main Square,,Camberley,,GU15 3SN,Tel: 01276 25880, - ,,,No ratings yet Rate it yourself - /Services/opticians/LeaveReview/DefaultView.aspx?id=OP_5L7_12539__000001_GU153SN,0,0,
Boots-Camberley - Obelisk Way,OP_5L7_3761__000002_GU153SD,OPT,26-30 Obelisk Way,,,Camberley,Surrey,GU15 3SD,Tel: 01276 670393, - ,,,7 ratings Rate it yourself - /Services/opticians/LeaveReview/DefaultView.aspx?id=OP_5L7_3761__000002_GU153SD,,,
Bayfields Opticians,OP_5L7_4702__000001_GU153QU,OPT,1b High Street,,Camberley,Camberley,,GU15 3QU,Tel: 01276 21791, - ,,,No ratings yet Rate it yourself - /Services/opticians/LeaveReview/DefaultView.aspx?id=OP_5L7_4702__000001_GU153QU,0,0,
Southcoast Opticians,OP_5FD_7643__000001_PO80BT,OPT,31 Highcroft Industrial Estate,Enterprise Road,Horndean,Waterlooville,Hampshire,PO8 0BT,Tel: 023 9259 9411, - ,,,No ratings yet Rate it yourself - /Services/opticians/LeaveReview/DefaultView.aspx?id=OP_5FD_7643__000001_PO80BT,0,0,
Boots-Cranleigh,GU6 8RG__000001_GU68RG,OPT,Unit 3,Stocklund Square,170 High Street,Cranleigh,Surrey,GU6 8RG,Tel: 01483 276994, - ,,,No ratings yet Rate it yourself - /Services/opticians/LeaveReview/DefaultView.aspx?id=GU6 8RG__000001_GU68RG,0,0,
Cranleigh Specsavers Ltd,TP8NR,OPT,,Specsavers Opticians,,"104 High Street, Cranleigh",,GU6 8AJ,, - ,,,No ratings yet Rate it yourself - /Services/opticians/LeaveReview/DefaultView.aspx?id=TP8NR,0,0,
Gregory & Seeley,OP_5L5_9748__000001_GU68AU,OPT,Tylers Building,High Street,Cranleigh,,,GU6 8AU,Tel: 01483 272 629, - ,,,No ratings yet Rate it yourself - /Services/opticians/LeaveReview/DefaultView.aspx?id=OP_5L5_9748__000001_GU68AU,0,0,
Batemans Opticians Ltd,OP_5L5_2968__000002_GU68AG,OPT,Dunford House,58 High Street,,Cranleigh,Surrey,GU6 8AG,Tel: 01483 272 750, - ,,,No ratings yet Rate it yourself - /Services/opticians/LeaveReview/DefaultView.aspx?id=OP_5L5_2968__000002_GU68AG,0,0,
Healthcall Optical Services,OP_GU470UR_46762,OPT,,108 Harvard Road,Owlsmoor,Sandhurst,Berkshire,GU47 0UR,Tel: 01962 609011, - ,,,No ratings yet Rate it yourself - /Services/opticians/LeaveReview/DefaultView.aspx?id=OP_GU470UR_46762,0,0,
Penny & Hayter,OP_5L7_10130__000001_GU212PS,OPT,3 Albion Parade,High Street,Woking,,,GU21 2PS,Tel: 01483 475 205, - ,,,No ratings yet Rate it yourself - /Services/opticians/LeaveReview/DefaultView.aspx?id=OP_5L7_10130__000001_GU212PS,0,0,
Norman Prince Crowthorne Opticians,J7N9X,OPT,,85 Church Street,,Crowthorne,Berkshire,RG45 7AW,Tel: 01344 772062, - ,,,No ratings yet Rate it yourself - /Services/opticians/LeaveReview/DefaultView.aspx?id=J7N9X,0,0,