Organisation Name,NACS Code,Organisation Type,Address1,Address2,Address3,Address4,Address5,PostCode,Telephone Number,Opening time,Value  (Opening time),Banding Classification  (Opening time),NHS.UK users rating,Value  (NHS.UK users rating),Banding Classification  (NHS.UK users rating),Car parking (Is there car parking at this organisation?)
Holbeach Optical Ltd,0925011216,OPT,,38 High Street,,Holbeach,,PE12 7DY,, - ,,,No ratings yet Rate it yourself - /Services/opticians/LeaveReview/DefaultView.aspx?id=0925011216,0,0,
Stradling Opticians,OP_5H9_8187__000001_PE127LW,OPT,12 West End,Holbeach,Spalding,,,PE12 7LW,Tel: 01406 423239, - ,,,No ratings yet Rate it yourself - /Services/opticians/LeaveReview/DefaultView.aspx?id=OP_5H9_8187__000001_PE127LW,0,0,
Coakley & Associates Opticians (Martin Walters and Partners),OP_5H9_3058__000001_PE129JA,OPT,11 Market Place,Long Sutton,Spalding,",",,PE12 9JA,Tel: 01406 363348, - ,,,1 rating Rate it yourself - /Services/opticians/LeaveReview/DefaultView.aspx?id=OP_5H9_3058__000001_PE129JA,,,yes
Boots-Spalding,OP_5H9_668__000002_PE111XA,OPT,16 Bridge Street,,,Spalding,Lincolnshire,PE11 1XA,Tel: 01775 723 479, - ,,,No ratings yet Rate it yourself - /Services/opticians/LeaveReview/DefaultView.aspx?id=OP_5H9_668__000002_PE111XA,0,0,
Specsavers Opticians,OP_PE111SG_34925,OPT,,31 Hall Place,,Spalding,,PE11 1SG,, - ,,,No ratings yet Rate it yourself - /Services/opticians/LeaveReview/DefaultView.aspx?id=OP_PE111SG_34925,0,0,
Vision Express Spalding,01-17534,OPT,,9 Hall Place,,Spalding,,PE11 1SR,Tel: 01775 719872, - ,,,1 rating Rate it yourself - /Services/opticians/LeaveReview/DefaultView.aspx?id=01-17534,,,
Eyecare Centre,OP_5H9_2126__000001_PE111BH,OPT,,6 Sheepmarket,,Spalding,,PE11 1BH,Tel: 01775 722141, - ,,,No ratings yet Rate it yourself - /Services/opticians/LeaveReview/DefaultView.aspx?id=OP_5H9_2126__000001_PE111BH,0,0,no
Boots-Wisbech - The Horsefair,OP_5JK_3026__000002_PE131AR,OPT,15 Horse Fair,,Wisbech,Cambridgeshire,,PE13 1AR,Tel: 01945 584677, - ,,,No ratings yet Rate it yourself - /Services/opticians/LeaveReview/DefaultView.aspx?id=OP_5JK_3026__000002_PE131AR,0,0,
RM  Driver (Opticians) Ltd,OP_5JK_1430__000001_PE131DB,OPT,4 High Street,,Wisbech,Cambridgeshire,,PE13 1DB,Tel: 01945 582096, - ,,,No ratings yet Rate it yourself - /Services/opticians/LeaveReview/DefaultView.aspx?id=OP_5JK_1430__000001_PE131DB,0,0,
Coakley & Associates Opticians,OP_5JK_1757__000001_PE131EB,OPT,9 York Row,,Wisbech,Cambridgeshire,Cambridgeshire,PE13 1EB,Tel: 01945 583044, - ,,,No ratings yet Rate it yourself - /Services/opticians/LeaveReview/DefaultView.aspx?id=OP_5JK_1757__000001_PE131EB,0,0,
Specsavers Opticians,OP_5JK_12278__000001_PE131DT,OPT,9 Market Place,,Wisbech,Cambridgeshire,,PE13 1DT,Tel: 01945 428810, - ,,,1 rating Rate it yourself - /Services/opticians/LeaveReview/DefaultView.aspx?id=OP_5JK_12278__000001_PE131DT,,,
Tesco Opticians Wisbech,PE14 0RG,OPT,,Cromwell Road,,Wisbech,,PE14 0RG,, - ,,,1 rating Rate it yourself - /Services/opticians/LeaveReview/DefaultView.aspx?id=PE14 0RG,,,
Boots-Boston,OP_PE216LS_17891,OPT,,8 Market Place,,Boston,Lincolnshire,PE21 6EH,Tel: 01205 351414, - ,,,No ratings yet Rate it yourself - /Services/opticians/LeaveReview/DefaultView.aspx?id=OP_PE216LS_17891,0,0,
Specsavers Opticians,OP_5H9_1081__000002_PE216EH,OPT,29a Market Place,,Boston,,,PE21 6EH,Tel: 01205 353263, - ,,,No ratings yet Rate it yourself - /Services/opticians/LeaveReview/DefaultView.aspx?id=OP_5H9_1081__000002_PE216EH,0,0,
R & T Opticians,OP_5H9_2127__000001_PE216EU,OPT,30-32 Dolphin Lane,,Boston,,,PE21 6EU,Tel: 01205 355550, - ,,,1 rating Rate it yourself - /Services/opticians/LeaveReview/DefaultView.aspx?id=OP_5H9_2127__000001_PE216EU,,,yes
Dollond & Aitchison,OP_5H9_5271__000001_PE216LS,OPT,8 Market Place,Boston,Lincolnshire,,,PE21 6LS,Tel: 01205 351414, - ,,,No ratings yet Rate it yourself - /Services/opticians/LeaveReview/DefaultView.aspx?id=OP_5H9_5271__000001_PE216LS,0,0,
Clark Family Eyecare Ltd,OP_PE114ST_46350,OPT,Clark Family Eyecare,20 Market Place,Donington,Spalding,Lincolnshire,PE11 4ST,Tel: 01775 821888, - ,,,No ratings yet Rate it yourself - /Services/opticians/LeaveReview/DefaultView.aspx?id=OP_PE114ST_46350,0,0,yes
Enderbys of Boston,OP_5H9_13814__000002_PE216SE,OPT,,84 Wide Bargate,,Boston,,PE21 6SE,Tel: 01205 311181, - ,,,1 rating Rate it yourself - /Services/opticians/LeaveReview/DefaultView.aspx?id=OP_5H9_13814__000002_PE216SE,,,no
David Hallgate Optometrists (I.O.E Ltd),OP_5H9_13813__000001_PE216SE,OPT,,86/88 Wide Bargate,,Boston,Lincolnshire,PE21 6SE,Tel: 01205 310 710, - ,,,1 rating Rate it yourself - /Services/opticians/LeaveReview/DefaultView.aspx?id=OP_5H9_13813__000001_PE216SE,,,yes
Peebles & Hilton,OP_5H9_2503__000002_PE216PA,OPT,Lyndon,Tawney Street,,Boston,,PE21 6PA,Tel: 01205 365395, - ,,,No ratings yet Rate it yourself - /Services/opticians/LeaveReview/DefaultView.aspx?id=OP_5H9_2503__000002_PE216PA,0,0,yes
Boots-Kings Lynn - High St,OP_5CY_3227__000001_PE301BB,OPT,80 High Street,,,Kings Lynn,Norfolk,PE30 1BB,Tel: 01553 772 210, - ,,,No ratings yet Rate it yourself - /Services/opticians/LeaveReview/DefaultView.aspx?id=OP_5CY_3227__000001_PE301BB,0,0,
Vision Express,OP_5CY_13037__000001_PE301BJ,OPT,38-39 High Street,,King's Lynn,,,PE30 1BJ,Tel: 01553 775445, - ,,,No ratings yet Rate it yourself - /Services/opticians/LeaveReview/DefaultView.aspx?id=OP_5CY_13037__000001_PE301BJ,0,0,
Boots-Kings Lynn - High St (opposite Boots UK),OP_5CY_6644__000001_PE301ER,OPT,34-35 High Street,,,King's Lynn,Norfolk,PE30 1BJ,Tel: 01553 772558, - ,,,No ratings yet Rate it yourself - /Services/opticians/LeaveReview/DefaultView.aspx?id=OP_5CY_6644__000001_PE301ER,0,0,
Specsavers Opticians,OP_5CY_1605__000001_PE301DT,OPT,8 Norfolk Street,,King's Lynn,,,PE30 1AR,Tel: 01553 692604, - ,,,No ratings yet Rate it yourself - /Services/opticians/LeaveReview/DefaultView.aspx?id=OP_5CY_1605__000001_PE301DT,0,0,
Moss & Leakey Opticians,OP_5CY_13921__000001_PE301AN,OPT,16 Norfolk Street,,King's Lynn,Norfolk,,PE30 1AN,Tel: 01553 765270, - ,,,2 ratings Rate it yourself - /Services/opticians/LeaveReview/DefaultView.aspx?id=OP_5CY_13921__000001_PE301AN,,,
Wigram & Ware Ltd,000002_PE301NN__000001_PE301NN,OPT,,8 Blackfriars Street,,King's Lynn,Norfolk,PE30 1NN,Tel: 01553 772878, - ,,,No ratings yet Rate it yourself - /Services/opticians/LeaveReview/DefaultView.aspx?id=000002_PE301NN__000001_PE301NN,0,0,
Eye-D,77865__000002_PE304PR,OPT,59c Lynn Road,Gaywood,Kings Lynn,Norfolk,,PE30 4PR,Tel: 01553 775665, - ,,,No ratings yet Rate it yourself - /Services/opticians/LeaveReview/DefaultView.aspx?id=77865__000002_PE304PR,0,0,
Tesco Opticians Kings Lynn,CO-1998_2409,OPT,,"Hardwich Road , Kings Lynn",,Norfolk,,PE30 4NA,, - ,,,No ratings yet Rate it yourself - /Services/opticians/LeaveReview/DefaultView.aspx?id=CO-1998_2409,0,0,
Specsavers Opticians & Audiologists Kings Lynn- Hardwick,TP88C,OPT,,"Sainsbury's, Scania Way, Hardwick Industrial Estate ",,Kings Lynn,,PE30 4LR,, - ,,,No ratings yet Rate it yourself - /Services/opticians/LeaveReview/DefaultView.aspx?id=TP88C,0,0,
Selby and Taylor Opticians,CO/3820,OPT,,44a Dartford Road,,Cambs,,PE15 8BQ,, - ,,,No ratings yet Rate it yourself - /Services/opticians/LeaveReview/DefaultView.aspx?id=CO/3820,0,0,
Driver Opticians,3014/5PP__000001_PE158TX,OPT,The Wheel Centre,March,March,Cambridgeshire,,PE15 8TX,Tel: 01354 658833, - ,,,No ratings yet Rate it yourself - /Services/opticians/LeaveReview/DefaultView.aspx?id=3014/5PP__000001_PE158TX,0,0,
Spectacular Opticians,OP_5JK_10815__000001_PE158LB,OPT,10 Broad Street,,,March,Cambridgeshire,PE15 8TG,Tel: 01354 650115, - ,,,No ratings yet Rate it yourself - /Services/opticians/LeaveReview/DefaultView.aspx?id=OP_5JK_10815__000001_PE158LB,0,0,
N P Coley,OP_5JK_7814__000001_PE158TG,OPT,30 Broad Street,,March,Cambridgeshire,,PE15 8TG,Tel: 01354 653393, - ,,,No ratings yet Rate it yourself - /Services/opticians/LeaveReview/DefaultView.aspx?id=OP_5JK_7814__000001_PE158TG,0,0,
Harrison Eyeclinic,OP_5JK_12283__000001_PE159BS,OPT,10a Elwyn Road,,,March,Cambridgeshire,PE15 9BS,Tel: 01354 652418, - ,,,No ratings yet Rate it yourself - /Services/opticians/LeaveReview/DefaultView.aspx?id=OP_5JK_12283__000001_PE159BS,0,0,
Scrivens Ltd,OP_5D3_3417__000002_PE68EA,OPT,,5 The Precinct,,Market Deeping,Northamptonshire,PE6 8DL,Tel: 01778 346259, - ,,,2 ratings Rate it yourself - /Services/opticians/LeaveReview/DefaultView.aspx?id=OP_5D3_3417__000002_PE68EA,,,
Philip David Edwards Opticians,OP_5D3_13824__000001_PE68AA,OPT,,37a Church Street,Market Deeping,Lincolnshire,,PE6 8AN,Tel: 01778 346147, - ,,,1 rating Rate it yourself - /Services/opticians/LeaveReview/DefaultView.aspx?id=OP_5D3_13824__000001_PE68AA,,,no
Krog & Whitehead Opticians,OP_5AG_8938__000001_PE71AH,OPT,,1-2 Blunts Lane,Whittlesey,Peterborough,Cambridgeshire,PE7 1AH,Tel: 01733 205466, - ,,,1 rating Rate it yourself - /Services/opticians/LeaveReview/DefaultView.aspx?id=OP_5AG_8938__000001_PE71AH,,,
J Neville Opticians Ltd,12 5PP__000002_PE71HA,OPT,18 Broad Street Whittlesey,,Peterborough,Cambridgeshire,,PE7 1HA,Tel: 01733 208578, - ,,,1 rating Rate it yourself - /Services/opticians/LeaveReview/DefaultView.aspx?id=12 5PP__000002_PE71HA,,,
"Specsavers Bourne (I Stradling, N Stradling & K Stradlling)",OP_5D3_3252__000001_PE109NS,OPT,,Unit 11,The Burghley Centre,Bourne,Lincolnshire,PE10 9EG,Tel: 01778 422402, - ,,,1 rating Rate it yourself - /Services/opticians/LeaveReview/DefaultView.aspx?id=OP_5D3_3252__000001_PE109NS,,,
One Stop Eye Care Centre,OP_5D3_14935__000002_PE109NE,OPT,2 West Street,Bourne,,,,PE10 9NE,Tel: 01778 421188, - ,,,No ratings yet Rate it yourself - /Services/opticians/LeaveReview/DefaultView.aspx?id=OP_5D3_14935__000002_PE109NE,0,0,
Scrivens Ltd,OP_5D3_5467__000001_PE109NE,OPT,Unit 1 Crown Walk,West Street,,Bourne,Lincolnshire,PE10 9NE,Tel: 01778 425995, - ,,,No ratings yet Rate it yourself - /Services/opticians/LeaveReview/DefaultView.aspx?id=OP_5D3_5467__000001_PE109NE,0,0,
Werrington Health Care Ltd,5PN/3405__000002_PE46QF,OPT,Werrington Opticians,97 Church Street,Werrington Village,Peterborough,,PE4 6QF,Tel: 01733 576596, - ,,,No ratings yet Rate it yourself - /Services/opticians/LeaveReview/DefaultView.aspx?id=5PN/3405__000002_PE46QF,0,0,
Spectacular Opticians,OP_5CY_8392__000001_PE389DH,OPT,2 Maltings Mall,Bridge Street,Downham Market,,,PE38 9DH,Tel: 01366 385241, - ,,,No ratings yet Rate it yourself - /Services/opticians/LeaveReview/DefaultView.aspx?id=OP_5CY_8392__000001_PE389DH,0,0,
Parker Optometrists,OP_5CY_3006__000003_PE389JZ,OPT,5 Wales Court,,Downham Market,,,PE38 9JZ,Tel: 01366 382118, - ,,,1 rating Rate it yourself - /Services/opticians/LeaveReview/DefaultView.aspx?id=OP_5CY_3006__000003_PE389JZ,,,
Wigram & Ware Ltd,OP_5CY_14944__000001_PE314HH,OPT,4 Jubilee Court,Dersingham,Norfolk,,,PE31 6HH,Tel: 01485 544850, - ,,,1 rating Rate it yourself - /Services/opticians/LeaveReview/DefaultView.aspx?id=OP_5CY_14944__000001_PE314HH,,,
Sask Optics,195PN__000003_PE12PH,OPT,293 Lincoln Road Millfield,,Peterborough,Cambridgeshire,,PE1 2PH,Tel: 01733 563845, - ,,,No ratings yet Rate it yourself - /Services/opticians/LeaveReview/DefaultView.aspx?id=195PN__000003_PE12PH,0,0,
Special Eyes,OP_5AF_7859__000001_PE11RE,OPT,34 North Street,,Peterborough,Cambridgeshire,,PE1 2RA,Tel: 01733 893998, - ,,,No ratings yet Rate it yourself - /Services/opticians/LeaveReview/DefaultView.aspx?id=OP_5AF_7859__000001_PE11RE,0,0,
Westgate Optical,OP_5AF_10333__000002_PE12TA,OPT,1st Floor Westgate House Park Road,Peterborough,,cambs,,PE1 2TA,Tel: 01733 342464, - ,,,No ratings yet Rate it yourself - /Services/opticians/LeaveReview/DefaultView.aspx?id=OP_5AF_10333__000002_PE12TA,0,0,
Boots-Peterborough - Queensgate,OP_5AF_12954__000003_PE11NW,OPT,Queensgate Centre,,,Peterborough,Cambridgeshire,PE1 1NW,Tel: 01733 313380, - ,,,1 rating Rate it yourself - /Services/opticians/LeaveReview/DefaultView.aspx?id=OP_5AF_12954__000003_PE11NW,,,
Vision Express,OP_5AF_12958__000003_PE11NH,OPT,20 Queensgate Centre,,Peterborough,Cambridgeshire,,PE1 1NH,Tel: 01733 555655, - ,,,No ratings yet Rate it yourself - /Services/opticians/LeaveReview/DefaultView.aspx?id=OP_5AF_12958__000003_PE11NH,0,0,
Dolland & Aitchison,OP_5AF_4909__000002_PE11NH,OPT,27 Queensgate Centre,,Peterborough,Cambridgeshire,,PE1 1NH,Tel: 01733 312705, - ,,,No ratings yet Rate it yourself - /Services/opticians/LeaveReview/DefaultView.aspx?id=OP_5AF_4909__000002_PE11NH,0,0,
Boots-Peterborough - Long Causeway,OP_5AF_12218__000001_PE11YD,OPT,Unit 2,1-4 Long Causeway,,Peterborough,Cambridgeshire,PE1 1YD,Tel: 01733 562 019, - ,,,1 rating Rate it yourself - /Services/opticians/LeaveReview/DefaultView.aspx?id=OP_5AF_12218__000001_PE11YD,,,
Henry Smith & Hamylton (Opticians) Ltd,OP_5AF_3378__000001_PE11YR,OPT,1 Cumbergate,,Peterborough,Cambridgeshire,,PE1 1YR,Tel: 01733 310661, - ,,,No ratings yet Rate it yourself - /Services/opticians/LeaveReview/DefaultView.aspx?id=OP_5AF_3378__000001_PE11YR,0,0,
Peterborough Visionplus Ltd,OP_5AF_2835__000001_PE11HA,OPT,53 Bridge Street,,Peterborough,Cambridgeshire,,PE1 1HA,Tel: 01733 348822, - ,,,No ratings yet Rate it yourself - /Services/opticians/LeaveReview/DefaultView.aspx?id=OP_5AF_2835__000001_PE11HA,0,0,
Optical Express,7 5PN__000001_PE11YT,OPT,"Suite 9, Cross St Court",,Cross Street,Peterborough,Cambridgeshire,PE1 1XA,Tel: 0800 023 2020, - ,,,No ratings yet Rate it yourself - /Services/opticians/LeaveReview/DefaultView.aspx?id=7 5PN__000001_PE11YT,0,0,
The Eye Centre,OP_5AF_12953__000001_PE11DH,OPT,4 Cowgate,,Peterborough,Cambridgeshire,,PE1 1DH,Tel: 01733 343380, - ,,,No ratings yet Rate it yourself - /Services/opticians/LeaveReview/DefaultView.aspx?id=OP_5AF_12953__000001_PE11DH,0,0,
Asda Stores Ltd,PE1 001,OPT,,West Rivergate Shopping Centre,Viersen Platz,Peterborough,Cambridgeshire,PE1 1ET,Tel: 01733 556300, - ,,,No ratings yet Rate it yourself - /Services/opticians/LeaveReview/DefaultView.aspx?id=PE1 001,0,0,
Specsavers Hunstanton,TP98K,OPT,,29 High Street,,Hunstanton,,PE36 5AB,Tel: 01485 500490, - ,,,No ratings yet Rate it yourself - /Services/opticians/LeaveReview/DefaultView.aspx?id=TP98K,0,0,
Anglia Regional Co-operative Society Ltd,5PQ0001__000001_PE365EP,OPT,69 Westgate,,Hunstanton,Norfolk,,PE36 5EP,Tel: 01485 532381, - ,,,No ratings yet Rate it yourself - /Services/opticians/LeaveReview/DefaultView.aspx?id=5PQ0001__000001_PE365EP,0,0,
Hunstanton EyeCare,OP_5CY_7973__000001_PE365HD,OPT,Hunstanton Eyecare,44 Church Street,,Hunstanton,Norfolk,PE36 5HD,Tel: 01485 532326, - ,,,No ratings yet Rate it yourself - /Services/opticians/LeaveReview/DefaultView.aspx?id=OP_5CY_7973__000001_PE365HD,0,0,
Tesco Opticians,OP_5AG_10533__000002_PE78BD,OPT,Serpentine Green Shopping Centrehargate Way,,Peterborough,Cambridgeshire,,PE7 8BD,Tel: 01733 410514, - ,,,No ratings yet Rate it yourself - /Services/opticians/LeaveReview/DefaultView.aspx?id=OP_5AG_10533__000002_PE78BD,0,0,
Selby and Taylor Opticians,OPT_PE166BH_1,OPT,,42 High Street,,Chatteris,,PE16 6BH,, - ,,,1 rating Rate it yourself - /Services/opticians/LeaveReview/DefaultView.aspx?id=OPT_PE166BH_1,,,
Spectacular Opticians,OP_5JK_1682__000002_PE166EX,OPT,Spectacular Ophthalmic Opticians Contact Lens Practitioners,16 High Street,Chatteris,Cambridgeshire,,PE16 6BG,Tel: 01354 694666, - ,,,No ratings yet Rate it yourself - /Services/opticians/LeaveReview/DefaultView.aspx?id=OP_5JK_1682__000002_PE166EX,0,0,
Carl Love Opticians,OP_5AG_4710__000001_PE73LB,OPT,138 Main Street Yaxley,,Peterborough,Cambridgeshire,,PE7 3LB,Tel: 01733 243504, - ,,,No ratings yet Rate it yourself - /Services/opticians/LeaveReview/DefaultView.aspx?id=OP_5AG_4710__000001_PE73LB,0,0,
Peebles & Hilton,OP_5H9_2611__000002_LN44SG,OPT,,16 Silver Street,,Coningsby,Lincolnshire,LN4 4SG,Tel: 01526 344556, - ,,,No ratings yet Rate it yourself - /Services/opticians/LeaveReview/DefaultView.aspx?id=OP_5H9_2611__000002_LN44SG,0,0,no
Specsavers Opticians Ltd,OP_5D3_14933__000001_PE92FT,OPT,Wm. Morrisons Supermarket,Uffington Road,Stamford,,,PE9 2FT,Tel: 01780 761950, - ,,,No ratings yet Rate it yourself - /Services/opticians/LeaveReview/DefaultView.aspx?id=OP_5D3_14933__000001_PE92FT,0,0,yes
Lunettes Opticians,OP_5D3_14934__000001_NG347RL,OPT,,70 Southgate,,Sleaford,Lincolnshire,NG34 7RL,Tel: 01529 414066, - ,,,No ratings yet Rate it yourself - /Services/opticians/LeaveReview/DefaultView.aspx?id=OP_5D3_14934__000001_NG347RL,0,0,no
Hunts of Sleaford,OP_5D3_900__000001_NG347SR,OPT,,11 Market Place,,Sleaford,Lincolnshire,NG34 7SR,Tel: 01529 302122, - ,,,No ratings yet Rate it yourself - /Services/opticians/LeaveReview/DefaultView.aspx?id=OP_5D3_900__000001_NG347SR,0,0,yes
E R Dixon Ltd,OP_5D3_910__000001_NG347PD,OPT,6 Southgate Shopping Precinct,Southgate,Sleaford,,,NG34 7PD,Tel: 01529 414212, - ,,,No ratings yet Rate it yourself - /Services/opticians/LeaveReview/DefaultView.aspx?id=OP_5D3_910__000001_NG347PD,0,0,yes
Christine Pirrie Ltd (Christine Pirrie),OP_5D3_192__000001_PE92AZ,OPT,7  - 8 Maiden Lane,",",Stamford,",",,PE9 2AZ,Tel: 01780 753488, - ,,,No ratings yet Rate it yourself - /Services/opticians/LeaveReview/DefaultView.aspx?id=OP_5D3_192__000001_PE92AZ,0,0,
Scrivens Ltd,OP_5D3_10765__000001_PE91PL,OPT,10 Ironmonger Street,,,Stamford,Lincolnshire,PE9 1PL,Tel: 01780 753719, - ,,,No ratings yet Rate it yourself - /Services/opticians/LeaveReview/DefaultView.aspx?id=OP_5D3_10765__000001_PE91PL,0,0,
Vision Express (Stamford VE Ltd),OP_5D3_13828__000003_PE92AW,OPT,"Unit 3, St Michaels Church",High Street,Stamford,,,PE9 2AW,Tel: 01780 480737, - ,,,1 rating Rate it yourself - /Services/opticians/LeaveReview/DefaultView.aspx?id=OP_5D3_13828__000003_PE92AW,,,
Boots-Stamford,OP_5D3_8979__000002_PE92AW,OPT,Unit 2 St Michaels Church,,,Stamford,Lincolnshire,PE9 2AW,Tel: 01780 762665, - ,,,No ratings yet Rate it yourself - /Services/opticians/LeaveReview/DefaultView.aspx?id=OP_5D3_8979__000002_PE92AW,0,0,no
Gathercole & Ward,OP_5GF_3400__000001_PE171BS,OPT,102 High Street Ramsey,Huntingdon,Cambridgeshire,,,PE26 1BS,Tel: 01487 812358, - ,,,No ratings yet Rate it yourself - /Services/opticians/LeaveReview/DefaultView.aspx?id=OP_5GF_3400__000001_PE171BS,0,0,
The Stamford Eye Clinic Opticians,01-18126_21012015_RL,OPT,,32 St Peter's Street,,Stamford,,PE9 2PF,Tel: 01780 767403, - ,,,17 ratings Rate it yourself - /Services/opticians/LeaveReview/DefaultView.aspx?id=01-18126_21012015_RL,,,
Lunettes Opticians Ltd,OP_NG349DT_84705,OPT,,24 High Street,,Ruskington,Lincolnshire,NG34 9DW,Tel: 01526 834466, - ,,,No ratings yet Rate it yourself - /Services/opticians/LeaveReview/DefaultView.aspx?id=OP_NG349DT_84705,0,0,
Loach & Wade,8 5PP__000002_CB61NE,OPT,7 Granby Street Littleport,,Ely,Cambridgeshire,,CB6 1NE,Tel: 01353 862333, - ,,,No ratings yet Rate it yourself - /Services/opticians/LeaveReview/DefaultView.aspx?id=8 5PP__000002_CB61NE,0,0,
Boots-Skegness,OP_5H9_10633__000001_PE253NU,OPT,Unit 7,The Hildreds Shopping Centre,,Skegness,Lincolnshire,PE25 3NU,Tel: 01754 763 146, - ,,,1 rating Rate it yourself - /Services/opticians/LeaveReview/DefaultView.aspx?id=OP_5H9_10633__000001_PE253NU,,,
Specsavers Opticians,OP_5H9_12159__000002_PE253NG,OPT,66 Lumley Road,,Skegness,,,PE25 3NG,Tel: 01754 898000, - ,,,No ratings yet Rate it yourself - /Services/opticians/LeaveReview/DefaultView.aspx?id=OP_5H9_12159__000002_PE253NG,0,0,
Rawlinsons Optometrists,OP_5N9_0096__000001_PE252AH,OPT,,1 Lumley Avenue,,Skegness,Lincolnshire,PE25 2AH,Tel: 01754 766773, - ,,,2 ratings Rate it yourself - /Services/opticians/LeaveReview/DefaultView.aspx?id=OP_5N9_0096__000001_PE252AH,,,no
Opticks Opticians,OP_5H9_2501__000001_LN106QL,OPT,,7 Station Road,Woodhall Spa,Lincolnshire,,LN10 6QL,Tel: 01526 352236, - ,,,No ratings yet Rate it yourself - /Services/opticians/LeaveReview/DefaultView.aspx?id=OP_5H9_2501__000001_LN106QL,0,0,
Judith Day Optometrist,PE8 4BA,OPT,,5 Market Place,,Oundle,,PE8 4BA,Tel: 01832 272974, - ,,,6 ratings Rate it yourself - /Services/opticians/LeaveReview/DefaultView.aspx?id=PE8 4BA,,,
Helen Ashby Opticians,OP_5JW_886__000001_IP270AA,OPT,9 Market Hill,,Brandon,Suffolk,,IP27 0AA,Tel: 01842 815055, - ,,,No ratings yet Rate it yourself - /Services/opticians/LeaveReview/DefaultView.aspx?id=OP_5JW_886__000001_IP270AA,0,0,
