Organisation Name,NACS Code,Organisation Type,Address1,Address2,Address3,Address4,Address5,PostCode,Telephone Number,Opening time,Value  (Opening time),Banding Classification  (Opening time),NHS.UK users rating,Value  (NHS.UK users rating),Banding Classification  (NHS.UK users rating),Car parking (Is there car parking at this organisation?)
Haine & Smith Opticians,SP4 7HD,OPT,,20 Salisbury Street,,Amesbury,Wiltshire,SP4 7HD,Tel: 01980 626551, - ,,,No ratings yet Rate it yourself - /Services/opticians/LeaveReview/DefaultView.aspx?id=SP4 7HD,0,0,
Batemans (Opticians) Ltd,OP_5DJ_10456__000004_SP47HD,OPT,12 Salisbury Street,,,Amesbury,Wiltshire,SP4 7HD,Tel: 01980 623228, - ,,,No ratings yet Rate it yourself - /Services/opticians/LeaveReview/DefaultView.aspx?id=OP_5DJ_10456__000004_SP47HD,0,0,
Memory Opticians,OP_5DJ_14124__000005_SP47HD,OPT,44b Salisbury Street,,Amesbury,,,SP4 7HD,Tel: 01980 624065, - ,,,1 rating Rate it yourself - /Services/opticians/LeaveReview/DefaultView.aspx?id=OP_5DJ_14124__000005_SP47HD,,,
Memory Opticians,OP_5K4_619__000001_SP97NN,OPT,Station Road,,Tidworth,,,SP9 7NN,Tel: 01980 843440, - ,,,No ratings yet Rate it yourself - /Services/opticians/LeaveReview/DefaultView.aspx?id=OP_5K4_619__000001_SP97NN,0,0,
S J Hussey Opticians,OP_5K4_12376__000002_SN95AQ,OPT,2 Old Ford Court,,Pewsey,Wiltshire,,SN9 5AQ,Tel: 01672 564617, - ,,,No ratings yet Rate it yourself - /Services/opticians/LeaveReview/DefaultView.aspx?id=OP_5K4_12376__000002_SN95AQ,0,0,
Bourneside Optometry Limited - Mrs S Downie,OPT_SP46HL_1,OPT,,Bourneside House,,Salisbury,,SP4 6HL,Tel: 01980 611433, - ,,,No ratings yet Rate it yourself - /Services/opticians/LeaveReview/DefaultView.aspx?id=OPT_SP46HL_1,0,0,
Nixon & Shaw,OP_5K4_9397__000001_SN101DN,OPT,30 Monday Market Street,,Devizes,,,SN10 1DN,Tel: 01380 725802, - ,,,No ratings yet Rate it yourself - /Services/opticians/LeaveReview/DefaultView.aspx?id=OP_5K4_9397__000001_SN101DN,0,0,
Specsavers,OP_5K4_12374__000005_SN101AJ,OPT,27 The Brittox,,Devizes,Wiltshire,,SN10 1AJ,Tel: 01380 722225, - ,,,No ratings yet Rate it yourself - /Services/opticians/LeaveReview/DefaultView.aspx?id=OP_5K4_12374__000005_SN101AJ,0,0,
Haine & Smith Opticians,OP_5K4_12246__000002_SN101AJ,OPT,,31 The Brittox,,Devizes,Wiltshire,SN10 1AJ,Tel: 01380 723446, - ,,,1 rating Rate it yourself - /Services/opticians/LeaveReview/DefaultView.aspx?id=OP_5K4_12246__000002_SN101AJ,,,
Eye Tech Opticians,OP_5K4_12373__000001_SN101JL,OPT,34 Market Place,,Devizes,,,SN10 1JG,Tel: 01380 722228, - ,,,No ratings yet Rate it yourself - /Services/opticians/LeaveReview/DefaultView.aspx?id=OP_5K4_12373__000001_SN101JL,0,0,
Boots-Devizes,SN10 1JG_19183,OPT,,33 Market Place,,Devizes,Wiltshire,SN10 1JG,Tel: 01380 728223, - ,,,1 rating Rate it yourself - /Services/opticians/LeaveReview/DefaultView.aspx?id=SN10 1JG_19183,,,
Haine & Smith Opticians,OP_5K4_11275__000002_SN81LT,OPT,,23-24  High Street,,Marlborough,Wiltshire,SN8 1LW,Tel: 01672 513432, - ,,,No ratings yet Rate it yourself - /Services/opticians/LeaveReview/DefaultView.aspx?id=OP_5K4_11275__000002_SN81LT,0,0,
Wilton i Ltd,SP2 0DF,OPT,within The Old Orchard Surgery,South Street,,Wilton,,SP2 0JU,Tel: 01722 743122, - ,,,No ratings yet Rate it yourself - /Services/opticians/LeaveReview/DefaultView.aspx?id=SP2 0DF,0,0,
Mark Jones Eyecare,OP_5DJ_14125__000001_SP27SU,OPT,,21 Fisherton Street,,Salisbury,,SP2 7SU,Tel: 01722 322891, - ,,,1 rating Rate it yourself - /Services/opticians/LeaveReview/DefaultView.aspx?id=OP_5DJ_14125__000001_SP27SU,,,
Specavers Opticians,SN8 1HN,OPT,,131 High Street,,Marlborough,,SN8 1HN,Tel: 01672 517900, - ,,,No ratings yet Rate it yourself - /Services/opticians/LeaveReview/DefaultView.aspx?id=SN8 1HN,0,0,
Jacqueline Burns Opticians,OP_SN81HN_33975,OPT,,140 High Street,,Marlborough,,SN8 1HN,, - ,,,2 ratings Rate it yourself - /Services/opticians/LeaveReview/DefaultView.aspx?id=OP_SN81HN_33975,,,
Vision Express (UK) Ltd,OP_5DJ_1147__000002_SP11EP,OPT,25-27 Butcher Row,,Salisbury,,,SP1 1EP,Tel: 01722 330056, - ,,,No ratings yet Rate it yourself - /Services/opticians/LeaveReview/DefaultView.aspx?id=OP_5DJ_1147__000002_SP11EP,0,0,
Batemans (Opticians) Ltd,OP_5DJ_3495__000001_SP12LX,OPT,6 Bridge Street,,Salisbury,,,SP1 2LX,Tel: 01722 322585, - ,,,No ratings yet Rate it yourself - /Services/opticians/LeaveReview/DefaultView.aspx?id=OP_5DJ_3495__000001_SP12LX,0,0,
Boots-Salisbury - Silver St,SP1 2NG_29481,OPT,,41-49 Silver Street,,Salisbury,Wiltshire,SP1 2NG,Tel: 01722 412625, - ,,,4 ratings Rate it yourself - /Services/opticians/LeaveReview/DefaultView.aspx?id=SP1 2NG_29481,,,
Boots-Salisbury - Catherine St,OP_5DJ_10591__000001_SP12DF,OPT,17 Catherine Street,,,Salisbury,Wiltshire,SP1 2DF,Tel: 01722 322 522, - ,,,No ratings yet Rate it yourself - /Services/opticians/LeaveReview/DefaultView.aspx?id=OP_5DJ_10591__000001_SP12DF,0,0,
Memory Opticians,OP_5DJ_8550__000002_SP12DF,OPT,13 Catherine Street,,Salisbury,,,SP1 2DF,Tel: 01722 410959, - ,,,No ratings yet Rate it yourself - /Services/opticians/LeaveReview/DefaultView.aspx?id=OP_5DJ_8550__000002_SP12DF,0,0,
Specsavers Opticians,OP_5DJ_9766__000001_SP12DG,OPT,1 Catherine Street,,Salisbury,,,SP1 2DF,Tel: 01722 412255, - ,,,No ratings yet Rate it yourself - /Services/opticians/LeaveReview/DefaultView.aspx?id=OP_5DJ_9766__000001_SP12DG,0,0,
Boots Opticians Limited,OP_5DJ_11593__000001_SP12AA,OPT,49-51 New Canel,,Salisbury,,,SP1 2AA,Tel: 01722 412625, - ,,,No ratings yet Rate it yourself - /Services/opticians/LeaveReview/DefaultView.aspx?id=OP_5DJ_11593__000001_SP12AA,0,0,
Silverthornes Opticians,OP_5DJ_14126__000001_SP12DD,OPT,50 Catherine Street,,Salisbury,Wiltshire,,SP1 2DD,Tel: 01722 322880, - ,,,No ratings yet Rate it yourself - /Services/opticians/LeaveReview/DefaultView.aspx?id=OP_5DJ_14126__000001_SP12DD,0,0,
Carol Underwood,PCTCAROLUNDERWOOD1__000001_SP103DG,OPT,King George Road,,andover,Hants,,SP10 3DG,Tel: 0845 602 3842, - ,,,No ratings yet Rate it yourself - /Services/opticians/LeaveReview/DefaultView.aspx?id=PCTCAROLUNDERWOOD1__000001_SP103DG,0,0,
Leightons Opticians & Hearing Care,OP_5E9_433__000001_SP101RW,OPT,,68 The Chantry Centre,,Andover,Hampshire,SP10 1RW,Tel: 01264 365695, - ,,,No ratings yet Rate it yourself - /Services/opticians/LeaveReview/DefaultView.aspx?id=OP_5E9_433__000001_SP101RW,0,0,
Vision Express,OP_5E9_1549__000001_SP101LU,OPT,45 Chantry Way,The Chantry Centre,andover,Hampshire,,SP10 1LQ,Tel: 01264 324801, - ,,,No ratings yet Rate it yourself - /Services/opticians/LeaveReview/DefaultView.aspx?id=OP_5E9_1549__000001_SP101LU,0,0,
Boots-Andover - High St,OP_5E9_6071__000001_SP101LP,OPT,63 High Street,,,Andover,Hampshire,SP10 1LP,Tel: 01264 352887, - ,,,2 ratings Rate it yourself - /Services/opticians/LeaveReview/DefaultView.aspx?id=OP_5E9_6071__000001_SP101LP,,,
West Country Eyecare,OL/5FT__000004_SP101NG,OPT,76 High Street,,andover,Hants,,SP10 1NG,Tel: 01264 366165, - ,,,No ratings yet Rate it yourself - /Services/opticians/LeaveReview/DefaultView.aspx?id=OL/5FT__000004_SP101NG,0,0,
Specsavers,OP_5E9_5988__000001_SP101NG,OPT,,72 High Street,,Andover,Hampshire,SP10 1NG,Tel: 01264 339 369, - ,,,2 ratings Rate it yourself - /Services/opticians/LeaveReview/DefaultView.aspx?id=OP_5E9_5988__000001_SP101NG,,,
Tesco Opticians,OP_SP101UZ_29725,OPT,,River Way,,Andover,Hampshire,SP10 1UZ,Tel: 0345 601 3479, - ,,,No ratings yet Rate it yourself - /Services/opticians/LeaveReview/DefaultView.aspx?id=OP_SP101UZ_29725,0,0,
Haine & Smith Opticians,OP_5K4_2477__000003_SN110HA,OPT,,5 Phelps Parade,,Calne,Wiltshire,SN11 0HA,Tel: 01249 814560, - ,,,No ratings yet Rate it yourself - /Services/opticians/LeaveReview/DefaultView.aspx?id=OP_5K4_2477__000003_SN110HA,0,0,
Rayner Opticians,OP_5K4_10733__000001_SN110BS,OPT,,3 The Square,Wood Street,Calne,Wiltshire,SN11 0BY,Tel: 01249 813597, - ,,,No ratings yet Rate it yourself - /Services/opticians/LeaveReview/DefaultView.aspx?id=OP_5K4_10733__000001_SN110BS,0,0,no
Vision Express,OP_5DK_11298__000002_RG170DL,OPT,,21 High Street,,Hungerford,Berkshire,RG17 0NF,Tel: 01488 682458, - ,,,No ratings yet Rate it yourself - /Services/opticians/LeaveReview/DefaultView.aspx?id=OP_5DK_11298__000002_RG170DL,0,0,yes
Carter & Harding,OP_5DH_9220__000001_BA133DN,OPT,21 Maristow Street,,Westbury,,,BA13 3DN,Tel: 01373 822084, - ,,,No ratings yet Rate it yourself - /Services/opticians/LeaveReview/DefaultView.aspx?id=OP_5DH_9220__000001_BA133DN,0,0,
Haine & Smith Opticians,OP_5DH_2366__000005_BA133BN,OPT,,19 High Street,,Westbury,Wiltshire,BA13 3BN,Tel: 01373 822163, - ,,,No ratings yet Rate it yourself - /Services/opticians/LeaveReview/DefaultView.aspx?id=OP_5DH_2366__000005_BA133BN,0,0,
Boots Opticians Warminster,240417135350,OPT,,51 Market Place,,Warminster,,BA12 9AZ,, - ,,,No ratings yet Rate it yourself - /Services/opticians/LeaveReview/DefaultView.aspx?id=240417135350,0,0,
Haine & Smith Opticians,OP_5DH_11016__000001_BA129AN,OPT,,10 Market Place,,Warminster,Wiltshire,BA12 9AN,Tel: 01985 212034, - ,,,No ratings yet Rate it yourself - /Services/opticians/LeaveReview/DefaultView.aspx?id=OP_5DH_11016__000001_BA129AN,0,0,
Batemans (Opticians) Ltd,OP_5DH_82__000001_BA129AY,OPT,21 Market Place,,,Warminster,Wiltshire,BA12 9AY,Tel: 01985 213347, - ,,,No ratings yet Rate it yourself - /Services/opticians/LeaveReview/DefaultView.aspx?id=OP_5DH_82__000001_BA129AY,0,0,
Specsavers Opticians,OP_5DH_645__000005_BA129AY,OPT,Unit 2,1 Market Place,Warminster,Wiltshire,,BA12 9AY,Tel: 01985 219 016, - ,,,No ratings yet Rate it yourself - /Services/opticians/LeaveReview/DefaultView.aspx?id=OP_5DH_645__000005_BA129AY,0,0,
Nixon & Shaw,OP_5DH_9392__000001_SN126JU,OPT,6 High Street,,Melksham,,,SN12 6JU,Tel: 01225 703218, - ,,,No ratings yet Rate it yourself - /Services/opticians/LeaveReview/DefaultView.aspx?id=OP_5DH_9392__000001_SN126JU,0,0,
Haine & Smith Opticians,OP_5DH_5723__000002_SN126LG,OPT,,27 High Street,,Melksham,Wiltshire,SN12 6JY,Tel: 01225 707881, - ,,,No ratings yet Rate it yourself - /Services/opticians/LeaveReview/DefaultView.aspx?id=OP_5DH_5723__000002_SN126LG,0,0,
A J Bass,OP_5DH_11495__000001_SP53LX,OPT,53 The Borough,Downton,Salisbury,Wiltshire,,SP5 3LX,Tel: 01725 512058, - ,,,No ratings yet Rate it yourself - /Services/opticians/LeaveReview/DefaultView.aspx?id=OP_5DH_11495__000001_SP53LX,0,0,
R D White Opticians,OP5DH__000003_BA148DE,OPT,38 Roundstone Street,,Trowbridge,Wiltshire,,BA14 8DE,Tel: 01225 753172, - ,,,No ratings yet Rate it yourself - /Services/opticians/LeaveReview/DefaultView.aspx?id=OP5DH__000003_BA148DE,0,0,
Boots-Trowbridge,OP_5DH_36__000001_BA148EW,OPT,28-29 Fore Street,,,Trowbridge,Wiltshire,BA14 8EW,Tel: 01225 719055, - ,,,No ratings yet Rate it yourself - /Services/opticians/LeaveReview/DefaultView.aspx?id=OP_5DH_36__000001_BA148EW,0,0,
Specsavers Opticians,OP_5DH_9973__000003_BA148AT,OPT,23 The Shires,Trowbridge,Wiltshire,,,BA14 8AT,Tel: 01225 775 434, - ,,,No ratings yet Rate it yourself - /Services/opticians/LeaveReview/DefaultView.aspx?id=OP_5DH_9973__000003_BA148AT,0,0,
Haine & Smith Opticians,OP_5DH_2822__000004_BA148AT,OPT,,5a The Shires,,Trowbridge,Wiltshire,BA14 8AT,Tel: 01225 776871, - ,,,No ratings yet Rate it yourself - /Services/opticians/LeaveReview/DefaultView.aspx?id=OP_5DH_2822__000004_BA148AT,0,0,
Carter & Harding,OP_5DH_11493__000001_BA148HD,OPT,5a Fore Street,,Trowbridge,Wiltshire,,BA14 8HD,Tel: 01225 752143, - ,,,No ratings yet Rate it yourself - /Services/opticians/LeaveReview/DefaultView.aspx?id=OP_5DH_11493__000001_BA148HD,0,0,
Haine & Smith Opticians,OP_5K3_2478__000002_SN49LN,OPT,8 Ellendune,Wroughton,,Wiltshire,,SN4 9LN,Tel: 01793 813054, - ,,,No ratings yet Rate it yourself - /Services/opticians/LeaveReview/DefaultView.aspx?id=OP_5K3_2478__000002_SN49LN,0,0,
Eyecare Centres,OP_5K4_3939__000001_SN153HL,OPT,56 Market Place,,Chippenham,Wiltshire,,SN15 3HL,Tel: 01249 446368, - ,,,No ratings yet Rate it yourself - /Services/opticians/LeaveReview/DefaultView.aspx?id=OP_5K4_3939__000001_SN153HL,0,0,
Boots-Chippenham,OP_5K4_6068__000003_SN153ER,OPT,10 High Street,,,Chippenham,Wiltshire,SN15 3ER,Tel: 01249 652323, - ,,,No ratings yet Rate it yourself - /Services/opticians/LeaveReview/DefaultView.aspx?id=OP_5K4_6068__000003_SN153ER,0,0,
Haine & Smith Opticians,OP_5K4_2479__000003_SN153JP,OPT,,10 Emery Gate,,Chippenham,Wiltshire,SN15 3JP,Tel: 01249 652883, - ,,,No ratings yet Rate it yourself - /Services/opticians/LeaveReview/DefaultView.aspx?id=OP_5K4_2479__000003_SN153JP,0,0,
Vision Express,OPT_SN153WL_1,OPT,,Unit 13 Borough Parade,,Chippenham,,SN15 3WL,Tel: 01249 651000, - ,,,No ratings yet Rate it yourself - /Services/opticians/LeaveReview/DefaultView.aspx?id=OPT_SN153WL_1,0,0,
Specsavers Opticians,OP_5K4_6420__000001_SN153WL,OPT,17 Borough Parade,,Chippenham,,,SN15 3WL,Tel: 01249 463636, - ,,,1 rating Rate it yourself - /Services/opticians/LeaveReview/DefaultView.aspx?id=OP_5K4_6420__000001_SN153WL,,,
Brignall Opticians,OP_5K4_3605__000001_SN151HP,OPT,33 New Road,,Chippenham,Wiltshire,,SN15 1HP,Tel: 01249 653292, - ,,,No ratings yet Rate it yourself - /Services/opticians/LeaveReview/DefaultView.aspx?id=OP_5K4_3605__000001_SN151HP,0,0,
Vision Visit,SN3 1JU,OPT,,51 Windsor Road,,Swindon,,SN3 1JU,Tel: 01793 232588, - ,,,No ratings yet Rate it yourself - /Services/opticians/LeaveReview/DefaultView.aspx?id=SN3 1JU,0,0,
Haine & Smith Opticians,OP_5K4_2814__000003_SN47AY,OPT,,140 High Street,,Royal Wootton Bassett,Wiltshire,SN4 7AY,Tel: 01793 853298, - ,,,No ratings yet Rate it yourself - /Services/opticians/LeaveReview/DefaultView.aspx?id=OP_5K4_2814__000003_SN47AY,0,0,
Specsavers (Royal Wootton Bassett),T0H0Q,OPT,,10-11 Borough Fields Shopping Centre,,Royal Wootton Bassett,Wiltshire,SN4 7AX,Tel: 01793 290062, - ,,,No ratings yet Rate it yourself - /Services/opticians/LeaveReview/DefaultView.aspx?id=T0H0Q,0,0,
Leightons Opticians & Hearing Care,OP_5K3_4081__000004_SN14AN,OPT,,33 Wood Street,,Swindon,Wiltshire,SN1 4AN,Tel: 01793 522 586, - ,,,No ratings yet Rate it yourself - /Services/opticians/LeaveReview/DefaultView.aspx?id=OP_5K3_4081__000004_SN14AN,0,0,
The Outside Clinic,OP_5CK_14996__000007_SN14AN,OPT,7 Wood Street,Old Town,Swindon,,,SN1 4AN,Tel: 0800 85 44 77, - ,,,3 ratings Rate it yourself - /Services/opticians/LeaveReview/DefaultView.aspx?id=OP_5CK_14996__000007_SN14AN,,,
The Outside Clinic,OP_5CC_14872__000024_SN14AN,OPT,Old Town Court,10-14 High Street,Old Town,Swindon,Wiltshire,SN1 3EP,Tel: 0800 60 50 40, - ,,,243 ratings Rate it yourself - /Services/opticians/LeaveReview/DefaultView.aspx?id=OP_5CC_14872__000024_SN14AN,,,
Carter & Harding,OP_5DH_4248__000001_BA151LL,OPT,9 The Shambles,,,Bradford-on-Avon,,BA15 1JS,Tel: 01225 865206, - ,,,No ratings yet Rate it yourself - /Services/opticians/LeaveReview/DefaultView.aspx?id=OP_5DH_4248__000001_BA151LL,0,0,
Nixon & Shaw,OP_5DH_9177__000001_BA151LN,OPT,4 Church Street,,Bradford-on-Avon,,,BA15 1LN,Tel: 01225 863632, - ,,,No ratings yet Rate it yourself - /Services/opticians/LeaveReview/DefaultView.aspx?id=OP_5DH_9177__000001_BA151LN,0,0,
Haine & Smith Opticians,OP_5K4_2816__000002_SN130HB,OPT,,22 High Street,,Corsham,Wiltshire,SN13 0HB,Tel: 01249 715175, - ,,,No ratings yet Rate it yourself - /Services/opticians/LeaveReview/DefaultView.aspx?id=OP_5K4_2816__000002_SN130HB,0,0,
Corsham Opticians,OP_5K4_8234__000001_SN130ES,OPT,,11 High Street,,Corsham,,SN13 0ES,Tel: 01249 712369, - ,,,No ratings yet Rate it yourself - /Services/opticians/LeaveReview/DefaultView.aspx?id=OP_5K4_8234__000001_SN130ES,0,0,
G D Monk,OP_5K3_14301__000004_SN11SD,OPT,35 Havelock Street,,Swindon,Wiltshire,,SN1 1SD,Tel: 01793 523743, - ,,,No ratings yet Rate it yourself - /Services/opticians/LeaveReview/DefaultView.aspx?id=OP_5K3_14301__000004_SN11SD,0,0,
R J Holmes Opticians Ltd,OP_5K3_8460__000003_SN57DL,OPT,West Swindon District Centre,Tewkesbury Way,Swindon,,,SN5 7DL,Tel: 01793 870011, - ,,,1 rating Rate it yourself - /Services/opticians/LeaveReview/DefaultView.aspx?id=OP_5K3_8460__000003_SN57DL,,,
Specsavers Opticians,OP_5K3_12126__000001_SN11SD,OPT,62/63 Regent Street,,Swindon,,,SN1 1JS,Tel: 01793 617858, - ,,,No ratings yet Rate it yourself - /Services/opticians/LeaveReview/DefaultView.aspx?id=OP_5K3_12126__000001_SN11SD,0,0,
Haine & Smith Opticians,OP_5K3_2612__000003_SN11JS,OPT,,45c Regent Street,Swindon,Wiltshire,,SN1 1JS,Tel: 01793 487888, - ,,,1 rating Rate it yourself - /Services/opticians/LeaveReview/DefaultView.aspx?id=OP_5K3_2612__000003_SN11JS,,,
SimplySpecs,SN14 6QA,OPT,,18 Bumpers Enterprise Centre,,Chippenham,,SN14 6QA,, - ,,,No ratings yet Rate it yourself - /Services/opticians/LeaveReview/DefaultView.aspx?id=SN14 6QA,0,0,
Boots-Swindon - Brunel Plaza (in Boots UK),OP_5K3_11563__000002_SN11LF,OPT,3 Brunel Plaza,,,Swindon,Wiltshire,SN1 1LF,Tel: 01793 433060, - ,,,6 ratings Rate it yourself - /Services/opticians/LeaveReview/DefaultView.aspx?id=OP_5K3_11563__000002_SN11LF,,,
The White Horse Optical Practice,OP_5K3_5315__000006_SN11LF,OPT,,7 Brunel Plaza,,Swindon,,SN1 1LF,Tel: 01793 432751, - ,,,No ratings yet Rate it yourself - /Services/opticians/LeaveReview/DefaultView.aspx?id=OP_5K3_5315__000006_SN11LF,0,0,
Ashleigh Sight Care,OP_5LY_14850__000001_SO518BU,OPT,,8 Church Street,,Romsey,Hampshire,SO51 8BU,Tel: 01794 512480, - ,,,1 rating Rate it yourself - /Services/opticians/LeaveReview/DefaultView.aspx?id=OP_5LY_14850__000001_SO518BU,,,
Vision Express (UK) Ltd,OP_5K3_11424__000001_SN11JY,OPT,83 Regent Street,,Swindon,,,SN1 1JY,Tel: 01793 491194, - ,,,No ratings yet Rate it yourself - /Services/opticians/LeaveReview/DefaultView.aspx?id=OP_5K3_11424__000001_SN11JY,0,0,
Mark Freeman Opticians,SO51 8NB__000003_SO518NB,OPT,3 Market Place,,Romsey,Hants,,SO51 8NB,Tel: 01794 513953, - ,,,No ratings yet Rate it yourself - /Services/opticians/LeaveReview/DefaultView.aspx?id=SO51 8NB__000003_SO518NB,0,0,
D N White Opticians,OP_5LY_14855__000001_SO518NA,OPT,23 Market Place,,Romsey,Hampshire,,SO51 8NA,Tel: 01794 517311, - ,,,No ratings yet Rate it yourself - /Services/opticians/LeaveReview/DefaultView.aspx?id=OP_5LY_14855__000001_SO518NA,0,0,
Romsey Eyecare,OPT_SO51 8DE,OPT,,"1 Victoria Place, Love Lane",,Romsey,Hampshire,SO51 8DE,Tel: 01794 522747, - ,,,3 ratings Rate it yourself - /Services/opticians/LeaveReview/DefaultView.aspx?id=OPT_SO51 8DE,,,
M J Anthony,OP_5K4_12375__000001_SN68PX,OPT,Foxwood House,West End,Bishopstone,,,SN6 8PX,Tel: 01793 791352, - ,,,No ratings yet Rate it yourself - /Services/opticians/LeaveReview/DefaultView.aspx?id=OP_5K4_12375__000001_SN68PX,0,0,
Boots Opticians,G7K1V,OPT,,3-5 The Hundred,,Romsey,Hampshire,SO51 8GD,Tel: 01794 513258, - ,,,No ratings yet Rate it yourself - /Services/opticians/LeaveReview/DefaultView.aspx?id=G7K1V,0,0,
Optical Express,SN1 1DA_83473,OPT,,"1st Floor (suite 4), Minton Place, Station Road",,Swindon,,SN1 1DA,Tel: 08000232020, - ,,,No ratings yet Rate it yourself - /Services/opticians/LeaveReview/DefaultView.aspx?id=SN1 1DA_83473,0,0,
A.J Bass BSc FCOptom,OP_5A1_14086__000001_SP61AX,OPT,36 High Street,,Fordingbridge,Hampshire,,SP6 1AX,Tel: 01425 652663, - ,,,2 ratings Rate it yourself - /Services/opticians/LeaveReview/DefaultView.aspx?id=OP_5A1_14086__000001_SP61AX,,,
Tesco Opticians,TP41K,OPT,,Ocotal Way,,Swindon,,SN1 2EH,, - ,,,No ratings yet Rate it yourself - /Services/opticians/LeaveReview/DefaultView.aspx?id=TP41K,0,0,
Vision Express,OP_RG147HB_85778,OPT,,"Tesco Express, Pinchington Lane",,Newbury,,RG14 7HB,, - ,,,No ratings yet Rate it yourself - /Services/opticians/LeaveReview/DefaultView.aspx?id=OP_RG147HB_85778,0,0,
Haine & Smith Opticians,OP_5K3_1303__000002_SN26AN,OPT,,105 Cricklade Road,,Swindon,Wiltshire,SN2 1AB,Tel: 01793 522572, - ,,,No ratings yet Rate it yourself - /Services/opticians/LeaveReview/DefaultView.aspx?id=OP_5K3_1303__000002_SN26AN,0,0,
Scott Waters Opticians,OP_5DK_5322__000002_RG141AA,OPT,,98 Northbrook Street,,Newbury,Berkshire,RG14 1AA,Tel: 01635 31113, - ,,,No ratings yet Rate it yourself - /Services/opticians/LeaveReview/DefaultView.aspx?id=OP_5DK_5322__000002_RG141AA,0,0,
Vision Express,OP_5DK_3370__000001_RG141AA,OPT,92 Northbrook Street,,Newbury,,,RG14 1AA,Tel: 01635 230294, - ,,,No ratings yet Rate it yourself - /Services/opticians/LeaveReview/DefaultView.aspx?id=OP_5DK_3370__000001_RG141AA,0,0,
Boots-Newbury - Northbrook St (in Boots UK),OP_RG141DJ_85768,OPT,4-5 Northbrook Street,,,Newbury,Berkshire,RG14 1DJ,Tel: 01635 40397, - ,,,2 ratings Rate it yourself - /Services/opticians/LeaveReview/DefaultView.aspx?id=OP_RG141DJ_85768,,,
Specsavers - Hectors Way Newbury,,OPT,,Sainsbury's Hectors Way,,Newbury,Berkshire,RG14 5AB,Tel: 01635 881 657, - ,,,N/A - Data not available,,,
Specsavers Opticians,OP_5DK_1746__000001_RG141DT,OPT,42-42a Northbrook Street,Newbury,Berkshire,,,RG14 1DT,Tel: 01635 46105, - ,,,No ratings yet Rate it yourself - /Services/opticians/LeaveReview/DefaultView.aspx?id=OP_5DK_1746__000001_RG141DT,0,0,
Ottica UK Ltd,OP_RG141AY_85774,OPT,,38 Parkway,,Newbury,,RG14 1AY,, - ,,,No ratings yet Rate it yourself - /Services/opticians/LeaveReview/DefaultView.aspx?id=OP_RG141AY_85774,0,0,
O'toid Opticians,01-19886,OPT,,5 The Bridge,,Frome,,BA11 1AR,Tel: 01373 467467, - ,,,No ratings yet Rate it yourself - /Services/opticians/LeaveReview/DefaultView.aspx?id=01-19886,0,0,
Boots-Frome,OP_5FX_12891__000001_BA111BN,OPT,3 Cheap Street,,,Frome,Somerset,BA11 1BN,Tel: 01373 462031, - ,,,No ratings yet Rate it yourself - /Services/opticians/LeaveReview/DefaultView.aspx?id=OP_5FX_12891__000001_BA111BN,0,0,
Specsavers Opticians,OP_5FX_7746__000002_BA111BS,OPT,19 Westway Centre,Frome,,Somerset,,BA11 1BS,Tel: 01373 451180, - ,,,No ratings yet Rate it yourself - /Services/opticians/LeaveReview/DefaultView.aspx?id=OP_5FX_7746__000002_BA111BS,0,0,
Eye-Tech Opticians,OP_5FX_13589__000001_BA111AH,OPT,25 Market Place,Frome,,Somerset,,BA11 1AH,Tel: 01373 462573, - ,,,No ratings yet Rate it yourself - /Services/opticians/LeaveReview/DefaultView.aspx?id=OP_5FX_13589__000001_BA111AH,0,0,
Eyesite Opticians,OP_5E9_12451__000001_SO239BX,OPT,Southgate Corner,65 High Street,,Winchester,Hampshire,SO23 9BX,Tel: 01962 864446, - ,,,No ratings yet Rate it yourself - /Services/opticians/LeaveReview/DefaultView.aspx?id=OP_5E9_12451__000001_SO239BX,0,0,
Rawlings Opticians,OP_5E9_615__000003_SO239BX,OPT,60-61 High Street,,Winchester,Hampshire,,SO23 9BX,Tel: 01962 853082, - ,,,1 rating Rate it yourself - /Services/opticians/LeaveReview/DefaultView.aspx?id=OP_5E9_615__000003_SO239BX,,,
Specsavers Opticians,OPT_SO239AH_1,OPT,,106a High Street,,Winchester,,SO23 9AH,, - ,,,No ratings yet Rate it yourself - /Services/opticians/LeaveReview/DefaultView.aspx?id=OPT_SO239AH_1,0,0,
Vision Express,OP_5E9_2258__000002_SO239BL,OPT,,40 High Street,,Winchester,Hampshire,SO23 9BL,Tel: 01962 856850, - ,,,No ratings yet Rate it yourself - /Services/opticians/LeaveReview/DefaultView.aspx?id=OP_5E9_2258__000002_SO239BL,0,0,
Leightons Opticians & Hearing Care,OP_5E9_158__000001_SO238AH,OPT,,67 St. Georges Street,,Winchester,Hampshire,SO23 8AH,Tel: 01962 852961, - ,,,No ratings yet Rate it yourself - /Services/opticians/LeaveReview/DefaultView.aspx?id=OP_5E9_158__000001_SO238AH,0,0,
Glasses Direct,OP5M2_148__000001_SN169RU,OPT,Unit 3 Gemini House,Groundwell Industrial Estate,Swindon,Wiltshire,,SN25 5AJ,Tel: 08456 882020, - ,,,3 ratings Rate it yourself - /Services/opticians/LeaveReview/DefaultView.aspx?id=OP5M2_148__000001_SN169RU,,,
ASDA Vision Centre,OP_5K3_14300__000002_SN254BG,OPT,North Swindon District Centre,Thamesdown Drive,,Swindon,,SN25 4BG,Tel: 01793 707882, - ,,,1 rating Rate it yourself - /Services/opticians/LeaveReview/DefaultView.aspx?id=OP_5K3_14300__000002_SN254BG,,,