Organisation Name,NACS Code,Organisation Type,Address1,Address2,Address3,Address4,Address5,PostCode,Telephone Number,Opening time,Value  (Opening time),Banding Classification  (Opening time),NHS.UK users rating,Value  (NHS.UK users rating),Banding Classification  (NHS.UK users rating),Car parking (Is there car parking at this organisation?)
Venturi Optics Limited,OPT_GU272JB_1,OPT,,5 Petworth Road,,Haslemere,,GU27 2JB,, - ,,,No ratings yet Rate it yourself - /Services/opticians/LeaveReview/DefaultView.aspx?id=OPT_GU272JB_1,0,0,
Venturi Optics Limited,3928,OPT,,5 Petworth Road,,Haslemere,,GU27 2JB,, - ,,,No ratings yet Rate it yourself - /Services/opticians/LeaveReview/DefaultView.aspx?id=3928,0,0,
Batemans  Opticians Ltd,OP_5L5_5818__000002_GU272LA,OPT,68 High Street,,,Haslemere,Surrey,GU27 2LA,Tel: 01428 642 224, - ,,,No ratings yet Rate it yourself - /Services/opticians/LeaveReview/DefaultView.aspx?id=OP_5L5_5818__000002_GU272LA,0,0,
Chandlers Eyecare,M4G1X,OPT,2 Charter Walk,West Street,,Haslemere,Surrey,GU27 2AD,Tel: 01428 652 512, - ,,,No ratings yet Rate it yourself - /Services/opticians/LeaveReview/DefaultView.aspx?id=M4G1X,0,0,
Leightons Opticians & Hearing Care,OP_5L5_12053__000001_GU271BZ,OPT,,37 Wey Hill,,Haslemere,Surrey,GU27 1BZ,Tel: 01428 643 975, - ,,,No ratings yet Rate it yourself - /Services/opticians/LeaveReview/DefaultView.aspx?id=OP_5L5_12053__000001_GU271BZ,0,0,
Matheson Optometrists,OP_5DF_1789__000002_GU266HF,OPT,3-4 Victoria Terraces,"Crossways Road, Grayshott",Hindhead,,,GU26 6HJ,Tel: 01428 606069, - ,,,No ratings yet Rate it yourself - /Services/opticians/LeaveReview/DefaultView.aspx?id=OP_5DF_1789__000002_GU266HF,0,0,
Zaman Opticians Limited,OPT_GU266HJ_1,OPT,,"Edinburgh House,",Crossways Road,Grayshott,Surrey,GU26 6HJ,Tel: 01428 609707, - ,,,1 rating Rate it yourself - /Services/opticians/LeaveReview/DefaultView.aspx?id=OPT_GU266HJ_1,,,
Liphook Eyecare,OP_5DF_7292__000001_GU307DW,OPT,Liphook Eye Care,31 Station Road,Liphook,Hampshire,,GU30 7DW,Tel: 01428 725158, - ,,,No ratings yet Rate it yourself - /Services/opticians/LeaveReview/DefaultView.aspx?id=OP_5DF_7292__000001_GU307DW,0,0,
Paxton & Welham,PAX001__000001_GU299BY,OPT,Rumbolds Hill,,Midhurst,West Sussex,,GU29 9BY,Tel: 01730 813788, - ,,,No ratings yet Rate it yourself - /Services/opticians/LeaveReview/DefaultView.aspx?id=PAX001__000001_GU299BY,0,0,
Richard C Arnold Optometrists,OP_5L9_3134__000001_GU299PB,OPT,Red Lion Street,Church Hill,Midhurst,West Sussex,,GU29 9PB,Tel: 01730 814035, - ,,,No ratings yet Rate it yourself - /Services/opticians/LeaveReview/DefaultView.aspx?id=OP_5L9_3134__000001_GU299PB,0,0,
iSpy Opticians,TP2DG,OPT,,67 High street,,Godalming,Surrey,GU7 1AW,Tel: 01483 414168, - ,,,No ratings yet Rate it yourself - /Services/opticians/LeaveReview/DefaultView.aspx?id=TP2DG,0,0,
Boots-Godalming,GU7 1AU__000002_GU71AU,OPT,33 High Street,,,Godalming,Surrey,GU7 1AU,Tel: 01483 425087, - ,,,No ratings yet Rate it yourself - /Services/opticians/LeaveReview/DefaultView.aspx?id=GU7 1AU__000002_GU71AU,0,0,
Batemans  Opticians,OP_5L5_10443__000001_GU71AW,OPT,,37 High Street,,Godalming,Surrey,GU7 1AU,Tel: 01483 414 953, - ,,,No ratings yet Rate it yourself - /Services/opticians/LeaveReview/DefaultView.aspx?id=OP_5L5_10443__000001_GU71AW,0,0,
Chandlers Eyecare,B5V5J,OPT,,40 High Street,,Godalming,Surrey,GU7 1DY,Tel: 01483 418 020, - ,,,No ratings yet Rate it yourself - /Services/opticians/LeaveReview/DefaultView.aspx?id=B5V5J,0,0,
Boots-Cranleigh,GU6 8RG__000001_GU68RG,OPT,Unit 3,Stocklund Square,170 High Street,Cranleigh,Surrey,GU6 8RG,Tel: 01483 276994, - ,,,No ratings yet Rate it yourself - /Services/opticians/LeaveReview/DefaultView.aspx?id=GU6 8RG__000001_GU68RG,0,0,
Cranleigh Specsavers Ltd,TP8NR,OPT,,Specsavers Opticians,,"104 High Street, Cranleigh",,GU6 8AJ,, - ,,,No ratings yet Rate it yourself - /Services/opticians/LeaveReview/DefaultView.aspx?id=TP8NR,0,0,
Gregory & Seeley,OP_5L5_9748__000001_GU68AU,OPT,Tylers Building,High Street,Cranleigh,,,GU6 8AU,Tel: 01483 272 629, - ,,,No ratings yet Rate it yourself - /Services/opticians/LeaveReview/DefaultView.aspx?id=OP_5L5_9748__000001_GU68AU,0,0,
Batemans Opticians Ltd,OP_5L5_2968__000002_GU68AG,OPT,Dunford House,58 High Street,,Cranleigh,Surrey,GU6 8AG,Tel: 01483 272 750, - ,,,No ratings yet Rate it yourself - /Services/opticians/LeaveReview/DefaultView.aspx?id=OP_5L5_2968__000002_GU68AG,0,0,
Park & Brown  ,OP_5L9_2765__000001_RH149PF,OPT,32 High Street,,Billingshurst,West Sussex,,RH14 9PF,Tel: 01403 784682, - ,,,13 ratings Rate it yourself - /Services/opticians/LeaveReview/DefaultView.aspx?id=OP_5L9_2765__000001_RH149PF,,,
Chandlers Opticians,OP_5DF_866__000002_GU350TN,OPT,5 Forest Centre,,Bordon,,,GU35 0TN,Tel: 01420 477444, - ,,,No ratings yet Rate it yourself - /Services/opticians/LeaveReview/DefaultView.aspx?id=OP_5DF_866__000002_GU350TN,0,0,
Bliinx Eyecare Studios,GU35 9LU__000001_GU359LU,OPT,Ganders Business Park,Kingsley,Bordon,Hampshire,,GU35 9LU,Tel: 01420 478899, - ,,,No ratings yet Rate it yourself - /Services/opticians/LeaveReview/DefaultView.aspx?id=GU35 9LU__000001_GU359LU,0,0,
Specsavers Opticians,OP_5L5_8367__000001_GU14EH,OPT,23 Friary Street,,,Guildford,,GU1 4EH,Tel: 01483 452 225, - ,,,No ratings yet Rate it yourself - /Services/opticians/LeaveReview/DefaultView.aspx?id=OP_5L5_8367__000001_GU14EH,0,0,
Bayfields Opticians,OP_5L5_4821__000001_GU13DY,OPT,37 High Street,,Guildford,Guildford,,GU1 3DY,Tel: 01483 575 650, - ,,,2 ratings Rate it yourself - /Services/opticians/LeaveReview/DefaultView.aspx?id=OP_5L5_4821__000001_GU13DY,,,
Vision Express (UK) Ltd,OP_5L5_719__000002_GU13DY,OPT,51 High Street,,,Guildford,,GU1 3DY,Tel: 01483 300 344, - ,,,No ratings yet Rate it yourself - /Services/opticians/LeaveReview/DefaultView.aspx?id=OP_5L5_719__000002_GU13DY,0,0,
Dollond & Aitchison,OP_5L5_7322__000001_GU13HE,OPT,94 High Street,,Guildford,,,GU1 3HE,Tel: 01483 570 093, - ,,,No ratings yet Rate it yourself - /Services/opticians/LeaveReview/DefaultView.aspx?id=OP_5L5_7322__000001_GU13HE,0,0,
Boots-Guildford - Swan Lane,OP_5L5_629__000001_GU14EQ,OPT,22-24 Swan Lane,,,Guildford,Surrey,GU1 4EQ,Tel: 01483 573637, - ,,,No ratings yet Rate it yourself - /Services/opticians/LeaveReview/DefaultView.aspx?id=OP_5L5_629__000001_GU14EQ,0,0,
Boots Optician Ltd,OPT_GU14EQ_1,OPT,,22-24 Swan Lane,,Guildford,Surrey,GU1 4EQ,Tel: 01483 573637, - ,,,No ratings yet Rate it yourself - /Services/opticians/LeaveReview/DefaultView.aspx?id=OPT_GU14EQ_1,0,0,
Optical Express,GU1 3EZ_11111,OPT,"Suite 3, 1 Milkhouse gate",,,Guildford,Surrey,GU1 3EZ,Tel: 0800 023 2020, - ,,,No ratings yet Rate it yourself - /Services/opticians/LeaveReview/DefaultView.aspx?id=GU1 3EZ_11111,0,0,
David Clulow Opticians,OP_GU13DP_89449,OPT,,103 High Street,,Guildford,,GU1 3DP,Tel: 01483 453339, - ,,,No ratings yet Rate it yourself - /Services/opticians/LeaveReview/DefaultView.aspx?id=OP_GU13DP_89449,0,0,
Thomas H. Collison Ltd,OP_5L5_9284__000001_GU25XX,OPT,The Royal Surrey County Hospital,Egerton Road,,Guildford,Surrey,GU2 5XX,Tel: 01483 571122 (ext. 2144), - ,,,No ratings yet Rate it yourself - /Services/opticians/LeaveReview/DefaultView.aspx?id=OP_5L5_9284__000001_GU25XX,0,0,
Batemans (Opticians) Ltd,OP_5L5_2184__000001_GU13HN,OPT,162 High Street,,Guildford,,,GU1 3HN,Tel: 01483 572 953, - ,,,No ratings yet Rate it yourself - /Services/opticians/LeaveReview/DefaultView.aspx?id=OP_5L5_2184__000001_GU13HN,0,0,
Leightons Opticians & Hearing Care,OP_5L5_7999__000001_GU97PH,OPT,,46 Downing Street,,Farnham,Surrey,GU9 7PH,Tel: 01252 711 369, - ,,,No ratings yet Rate it yourself - /Services/opticians/LeaveReview/DefaultView.aspx?id=OP_5L5_7999__000001_GU97PH,0,0,
Nicklins Opticians,OP_5L5_9270__000001_GU13JB,OPT,216 High Street,,,Guildford,,GU1 3JB,Tel: 01483 561 256, - ,,,No ratings yet Rate it yourself - /Services/opticians/LeaveReview/DefaultView.aspx?id=OP_5L5_9270__000001_GU13JB,0,0,
Boots-Farnham,OP_5L5_3466__000002_GU97NW,OPT,30 The Borough,,,Farnham,Surrey,GU9 7NW,Tel: 01252 715 540, - ,,,No ratings yet Rate it yourself - /Services/opticians/LeaveReview/DefaultView.aspx?id=OP_5L5_3466__000002_GU97NW,0,0,
Bartlett & Austin,OP_5L5_14605__000001_GU97DN,OPT,9 West Street,Farnham,,Surrey,,GU9 7DN,Tel: 01252 715 728, - ,,,No ratings yet Rate it yourself - /Services/opticians/LeaveReview/DefaultView.aspx?id=OP_5L5_14605__000001_GU97DN,0,0,
C.E. Hall Opticians,OP_5L5_14612__000003_GU97HH,OPT,111 West Street,,,Farnham,Surrey,GU9 7HH,Tel: 01252 713 785, - ,,,No ratings yet Rate it yourself - /Services/opticians/LeaveReview/DefaultView.aspx?id=OP_5L5_14612__000003_GU97HH,0,0,
Specsavers,OP_5L5_14615__000004_GU97HH,OPT,119 West Street,Farnham,Surrey,,,GU9 7HH,Tel: 01252 727 737, - ,,,No ratings yet Rate it yourself - /Services/opticians/LeaveReview/DefaultView.aspx?id=OP_5L5_14615__000004_GU97HH,0,0,
Optisave,OP_5L5_14614__000001_GU97TX,OPT,13 Woolmead,Farnham,Surrey,,,GU9 7TX,Tel: 01252 717 655, - ,,,No ratings yet Rate it yourself - /Services/opticians/LeaveReview/DefaultView.aspx?id=OP_5L5_14614__000001_GU97TX,0,0,
The Optical Studio,OP_5L5_14611__000001_GU97LL,OPT,,19 Lion and Lamb Yard,Farnham,Surrey,,GU9 7LL,Tel: 01252 717 717, - ,,,No ratings yet Rate it yourself - /Services/opticians/LeaveReview/DefaultView.aspx?id=OP_5L5_14611__000001_GU97LL,0,0,
Vision Express ,OP_5L7_6926__000001_GU211GD,OPT,,46 Wolsey Walk,,Woking,Surrey,GU2 6GH,Tel: 01483 767 141, - ,,,No ratings yet Rate it yourself - /Services/opticians/LeaveReview/DefaultView.aspx?id=OP_5L7_6926__000001_GU211GD,0,0,
Brian Craig Eyecare Ltd,OP_5G6_14842__000001_GU111HT,OPT,44 Station Road,Aldershot,,Hampshire,,GU11 1HT,Tel: 01252 324048, - ,,,No ratings yet Rate it yourself - /Services/opticians/LeaveReview/DefaultView.aspx?id=OP_5G6_14842__000001_GU111HT,0,0,
Optical Centre,OP_5L7_8334__000002_GU125AZ,OPT,5 The Parade,Wharf Road,Ash Vale,,,GU12 5AZ,Tel: 01252 314 332, - ,,,1 rating Rate it yourself - /Services/opticians/LeaveReview/DefaultView.aspx?id=OP_5L7_8334__000002_GU125AZ,,,
Optisave,OP_5G6_14844__000004_GU111DB,OPT,26-27 The Galleries,,Aldershot,Hampshire,,GU11 1DB,Tel: 01252 319234, - ,,,No ratings yet Rate it yourself - /Services/opticians/LeaveReview/DefaultView.aspx?id=OP_5G6_14844__000004_GU111DB,0,0,
Vision Express,OP_5G6_1652__000003_GU111DB,OPT,13a Wellington Centre,,Aldershot,Hampshire,,GU11 1DB,Tel: 01252 323491, - ,,,No ratings yet Rate it yourself - /Services/opticians/LeaveReview/DefaultView.aspx?id=OP_5G6_1652__000003_GU111DB,0,0,
McGregor & Hull Eye Care Centre,OP_5G6_14840__000001_GU111DX,OPT,3 Wellington Street,Aldershot,Hampshire,,,GU11 1DX,Tel: 01252 661162, - ,,,No ratings yet Rate it yourself - /Services/opticians/LeaveReview/DefaultView.aspx?id=OP_5G6_14840__000001_GU111DX,0,0,
Specsavers,OP_5G6_3553__000001_GU111EG,OPT,25 Union Street,,Aldershot,Hampshire,,GU11 1EG,Tel: 01252 345 556, - ,,,No ratings yet Rate it yourself - /Services/opticians/LeaveReview/DefaultView.aspx?id=OP_5G6_3553__000001_GU111EG,0,0,
Vision Express,GU32 3JA__000001_GU323JA,OPT,,14 Rams Walk,,Petersfield,Hampshire,GU32 3JA,Tel: 01730 235 977, - ,,,No ratings yet Rate it yourself - /Services/opticians/LeaveReview/DefaultView.aspx?id=GU32 3JA__000001_GU323JA,0,0,
Richard C. Arnold Optometrists,OP_5FD_10298__000001_GU323JU,OPT,3-4 Exchange Building,High Street,,Petersfield,,GU32 3JU,Tel: 01730 263302, - ,,,No ratings yet Rate it yourself - /Services/opticians/LeaveReview/DefaultView.aspx?id=OP_5FD_10298__000001_GU323JU,0,0,
Specsavers Opticians,OP_GU323HJ_46229,OPT,Specsavers Opticians,3-4 The Square,,Petersfield,Hampshire,GU32 3HJ,Tel: 01730 710820, - ,,,No ratings yet Rate it yourself - /Services/opticians/LeaveReview/DefaultView.aspx?id=OP_GU323HJ_46229,0,0,
A Matheson,GU32 3DT__000001_GU323DT,OPT,17 Chapel Street,,Petersfield,Hants,,GU32 3DT,Tel: 01730 261442, - ,,,No ratings yet Rate it yourself - /Services/opticians/LeaveReview/DefaultView.aspx?id=GU32 3DT__000001_GU323DT,0,0,
Morgan-Owen & Coates Optometrist,OP_5FD_9132__000001_GU323EL,OPT,37 Lavant Street,,Petersfield,Hampshire,,GU32 3EL,Tel: 01730 264258, - ,,,No ratings yet Rate it yourself - /Services/opticians/LeaveReview/DefaultView.aspx?id=OP_5FD_9132__000001_GU323EL,0,0,
Averns & Sandall,OP_5MC_9293__000001_RH204DH,OPT,5 North Street,,Storrington,West Sussex,,RH20 4DH,Tel: 01903 742640, - ,,,2 ratings Rate it yourself - /Services/opticians/LeaveReview/DefaultView.aspx?id=OP_5MC_9293__000001_RH204DH,,,
Owen Leigh Optometry,OP_5FD_14836__000001_GU323LA,OPT,28 The Spain,,Petersfield,Hampshire,,GU32 3LA,Tel: 01730 710174, - ,,,No ratings yet Rate it yourself - /Services/opticians/LeaveReview/DefaultView.aspx?id=OP_5FD_14836__000001_GU323LA,0,0,
Martin Steels Ltd,OP_5MC_10264__000002_RH204NQ,OPT,5 Old Mill Square,,Storrington,West Sussex,,RH20 4NQ,Tel: 01903 740420, - ,,,No ratings yet Rate it yourself - /Services/opticians/LeaveReview/DefaultView.aspx?id=OP_5MC_10264__000002_RH204NQ,0,0,
Boots-Horsham - West St,OP_5MC_3630__000001_RH121PP,OPT,39 West Street,,Horsham,West Sussex,,RH12 1PP,Tel: 01403 253553, - ,,,1 rating Rate it yourself - /Services/opticians/LeaveReview/DefaultView.aspx?id=OP_5MC_3630__000001_RH121PP,,,
Vision Express,OP_5MC_12036__000001_RH121PB,OPT,23 West Street,,Horsham,West Sussex,,RH12 1PB,Tel: 01403 256636, - ,,,No ratings yet Rate it yourself - /Services/opticians/LeaveReview/DefaultView.aspx?id=OP_5MC_12036__000001_RH121PB,0,0,
Specsavers Opticians,OP_5P6_OPTICIAN SPECSAVERS HORSHAM__000001_RH121PL,OPT,57 West Street,,Horsham,West Sussex,,RH12 1PL,Tel: 01403 275115, - ,,,1 rating Rate it yourself - /Services/opticians/LeaveReview/DefaultView.aspx?id=OP_5P6_OPTICIAN SPECSAVERS HORSHAM__000001_RH121PL,,,
Opticial Express,OP_12345_RH12 1HQ,OPT,25 Swan Walk,,,Horsham,West Sussex,RH12 1HQ,Tel: 0800 023 2020, - ,,,No ratings yet Rate it yourself - /Services/opticians/LeaveReview/DefaultView.aspx?id=OP_12345_RH12 1HQ,0,0,
Louise Sloan Opticians,OPT_RH121EH_2,OPT,,1 Piries Place,,Horsham,,RH12 1EH,Tel: 01403 264682, - ,,,No ratings yet Rate it yourself - /Services/opticians/LeaveReview/DefaultView.aspx?id=OPT_RH121EH_2,0,0,
Community Eye Care,OP_5L5_3088__000001_GU236EW,OPT,"Suite A, Astra",Vicarage Lane,"Send, Woking",Surrey,,GU23 7JN,Tel: 01483 224914, - ,,,No ratings yet Rate it yourself - /Services/opticians/LeaveReview/DefaultView.aspx?id=OP_5L5_3088__000001_GU236EW,0,0,
Boots Opticians,OPT_GU341BN_1,OPT,,30 High Street,,Hampshire,,GU34 1BN,Tel: 0142084396, - ,,,No ratings yet Rate it yourself - /Services/opticians/LeaveReview/DefaultView.aspx?id=OPT_GU341BN_1,0,0,
Rawlings Opticians,OP_5DF_4855__000001_GU341AW,OPT,36 High Street,,Alton,Hampshire,,GU34 1BD,Tel: 01420 84230, - ,,,No ratings yet Rate it yourself - /Services/opticians/LeaveReview/DefaultView.aspx?id=OP_5DF_4855__000001_GU341AW,0,0,
Specsavers Alton,564738__000002_GU341AW,OPT,,58 High Street,,Alton,,GU34 1ET,Tel: 01420 593600, - ,,,No ratings yet Rate it yourself - /Services/opticians/LeaveReview/DefaultView.aspx?id=564738__000002_GU341AW,0,0,
Alton Eyecare,GU34 1HA__000001_GU341HA,OPT,23 Market Street,,Alton,Hants,,GU34 1HA,Tel: 01420 542363, - ,,,No ratings yet Rate it yourself - /Services/opticians/LeaveReview/DefaultView.aspx?id=GU34 1HA__000001_GU341HA,0,0,
Leightons Opticians & Hearing Care,OP_5DF_1179__000001_GU341EN,OPT,,90 High Street,,Alton,Hampshire,GU34 1EN,Tel: 01420 83070, - ,,,No ratings yet Rate it yourself - /Services/opticians/LeaveReview/DefaultView.aspx?id=OP_5DF_1179__000001_GU341EN,0,0,
Costco Wholesale UK Ltd,CO-1833-8,OPT,,Templar Avenue,,Farnborough,,GU14 6FE,Tel: 01252 896 945, - ,,,No ratings yet Rate it yourself - /Services/opticians/LeaveReview/DefaultView.aspx?id=CO-1833-8,0,0,
Martin Steels Ltd,OP_5P6_OPTICIAN MARTIN STEELS ARUNDEL__000001_BN18,OPT,39 Tarrant Street,,Arundel,West Sussex,,BN18 9DG,Tel: 01903 883444, - ,,,No ratings yet Rate it yourself - /Services/opticians/LeaveReview/DefaultView.aspx?id=OP_5P6_OPTICIAN MARTIN STEELS ARUNDEL__000001_BN18,0,0,
Boots-Farnborough,OP_5G6_5035__000001_GU147RZ,OPT,87-91 Queensmead,,,Farnborough,Hampshire,GU14 7RZ,Tel: 01252 549100, - ,,,No ratings yet Rate it yourself - /Services/opticians/LeaveReview/DefaultView.aspx?id=OP_5G6_5035__000001_GU147RZ,0,0,
ASDA Opticians,OP_5G6_14839__000002_GU147LT,OPT,Asda Stores Ltd,West Meade,Farnborough,Hampshire,,GU14 7LT,Tel: 01252 557292, - ,,,No ratings yet Rate it yourself - /Services/opticians/LeaveReview/DefaultView.aspx?id=OP_5G6_14839__000002_GU147LT,0,0,
Speccies,GU14 7RL__000001_GU147RL,OPT,71 Queens Mead,,Farnborough,Hants,,GU14 7RL,Tel: 01252 373008, - ,,,No ratings yet Rate it yourself - /Services/opticians/LeaveReview/DefaultView.aspx?id=GU14 7RL__000001_GU147RL,0,0,
Specsavers,OP_5G6_5949__000002_GU146YA,OPT,Princes Mead Centre,,,Farnborough,,GU14 6YA,Tel: 01252 370 498, - ,,,No ratings yet Rate it yourself - /Services/opticians/LeaveReview/DefaultView.aspx?id=OP_5G6_5949__000002_GU146YA,0,0,
Brian Craig Eyecare Ltd,GU14 7NY__000002_GU147NY,OPT,20 Victoria Road,,Farnborough,Hampshire,,GU14 7NY,, - ,,,No ratings yet Rate it yourself - /Services/opticians/LeaveReview/DefaultView.aspx?id=GU14 7NY__000002_GU147NY,0,0,
Leightons Opticians & Hearing Care,OP_5G6_8593__000001_GU147NY,OPT,20 Victoria Road,.,Farnborough,.,,GU14 7NY,Tel: 01252 545666, - ,,,No ratings yet Rate it yourself - /Services/opticians/LeaveReview/DefaultView.aspx?id=OP_5G6_8593__000001_GU147NY,0,0,
Brown & White (Opticians) Ltd,OP_5G6_5186__000001_GU513BU,OPT,341 Fleet Road,,Fleet,,,GU51 3NT,Tel: 01252 616830, - ,,,1 rating Rate it yourself - /Services/opticians/LeaveReview/DefaultView.aspx?id=OP_5G6_5186__000001_GU513BU,,,
John Harwood Optometrist,OP_5G6_13202__000002_GU513PQ,OPT,202 Fleet Road,,Fleet,Hampshire,,GU51 4BY,Tel: 01252 613733, - ,,,No ratings yet Rate it yourself - /Services/opticians/LeaveReview/DefaultView.aspx?id=OP_5G6_13202__000002_GU513PQ,0,0,
Boots-Fleet,OP_5G6_5230__000002_GU513LA,OPT,Unit 23,Hart Shopping Centre,Fleet Road,Fleet,Hampshire,GU51 3LA,Tel: 01252 629 259, - ,,,No ratings yet Rate it yourself - /Services/opticians/LeaveReview/DefaultView.aspx?id=OP_5G6_5230__000002_GU513LA,0,0,
Specsavers Opticians,TP90N,OPT,,Sainsburys' Supermarket,Westhampnett Road,Chichester,Sussex,PO19 7YR,Tel: 01243 781691, - ,,,No ratings yet Rate it yourself - /Services/opticians/LeaveReview/DefaultView.aspx?id=TP90N,0,0,
Leightons Opticians & Hearing Care,OP_5G6_14843__000001_GU514BE,OPT,,168b Fleet Road,,Fleet,Hampshire,GU51 4BE,Tel: 01252 617753, - ,,,No ratings yet Rate it yourself - /Services/opticians/LeaveReview/DefaultView.aspx?id=OP_5G6_14843__000001_GU514BE,0,0,
Specsavers,OP_5G6_12127__000001_GU513PQ,OPT,231 Fleet Road,,Fleet,Hampshire,,GU51 4BN,Tel: 01252 815 275, - ,,,No ratings yet Rate it yourself - /Services/opticians/LeaveReview/DefaultView.aspx?id=OP_5G6_12127__000001_GU513PQ,0,0,
Barnham Opticians,OP_PO220HB_46265,OPT,,64 Barnham Road,,Barnham,Sussex,PO22 0ES,Tel: 01243 554091, - ,,,3 ratings Rate it yourself - /Services/opticians/LeaveReview/DefaultView.aspx?id=OP_PO220HB_46265,,,
Penny & Hayter,OP_5L7_10130__000001_GU212PS,OPT,3 Albion Parade,High Street,Woking,,,GU21 2PS,Tel: 01483 475 205, - ,,,No ratings yet Rate it yourself - /Services/opticians/LeaveReview/DefaultView.aspx?id=OP_5L7_10130__000001_GU212PS,0,0,
Batemans Opticians,OP_5L7_12343__000001_GU215AG,OPT,55 Commercial Way,,Woking,,,GU21 3HN,Tel: 01483 760770, - ,,,No ratings yet Rate it yourself - /Services/opticians/LeaveReview/DefaultView.aspx?id=OP_5L7_12343__000001_GU215AG,0,0,
Insight Opticians,OP_5L7_13115__000001_GU165HJ,OPT,,21 Frimley High Street,Frimley,Camberley,Surrey,GU16 7HJ,Tel: 01276 627 44, - ,,,1 rating Rate it yourself - /Services/opticians/LeaveReview/DefaultView.aspx?id=OP_5L7_13115__000001_GU165HJ,,,Data not available
Boots-Frimley,OP_5L7_5111__000002_GU165HY,OPT,4 The Parade,,High Street,Frimley,,GU16 7HY,Tel: 01276 62656, - ,,,No ratings yet Rate it yourself - /Services/opticians/LeaveReview/DefaultView.aspx?id=OP_5L7_5111__000002_GU165HY,0,0,
North Opticians & Eyewear,OPT_PO191NB_1,OPT,,60 North Street,,Chichester,,PO19 1NB,Tel: 01243 940180, - ,,,1 rating Rate it yourself - /Services/opticians/LeaveReview/DefaultView.aspx?id=OPT_PO191NB_1,,,
Specsavers Opticians,OP_5L7_375__000001_GU211XS,OPT,,17-19 Wolsey Walk,Wolsey Place Shopping Centre,Woking,Surrey,GU21 6XU,Tel: 01483 767 170, - ,,,No ratings yet Rate it yourself - /Services/opticians/LeaveReview/DefaultView.aspx?id=OP_5L7_375__000001_GU211XS,0,0,
Boots Opticians Woking ,OP_5L7_6031__000002_GU211YA,OPT,1-9 Commercial Way,"10 Wolsey Walk, Wolsey Place Shopping Centre",,Woking,Surrey,GU21 6XU,Tel: 01483 761640, - ,,,1 rating Rate it yourself - /Services/opticians/LeaveReview/DefaultView.aspx?id=OP_5L7_6031__000002_GU211YA,,,
Boots-Chichester - North St,W1001__000002_PO191LQ,OPT,76-77 North Street,,,Chichester,West Sussex,PO19 1LQ,Tel: 01243 789 927, - ,,,1 rating Rate it yourself - /Services/opticians/LeaveReview/DefaultView.aspx?id=W1001__000002_PO191LQ,,,
Bayfields Opticians,OP_5L7_9872__000001_GU211XU,OPT,,35 Commercial Way,,Woking,,GU21 6XR,Tel: 01483 766 800, - ,,,No ratings yet Rate it yourself - /Services/opticians/LeaveReview/DefaultView.aspx?id=OP_5L7_9872__000001_GU211XU,0,0,
Specsavers Opticians,OP_5L9_3469__000001_PO191HX,OPT,65 East Street,,Chichester,West Sussex,,PO19 1HL,Tel: 01243 533350, - ,,,No ratings yet Rate it yourself - /Services/opticians/LeaveReview/DefaultView.aspx?id=OP_5L9_3469__000001_PO191HX,0,0,
Dollond & Aitchison,OP_5L7_3550__000001_GU211XX,OPT,35 Wolsey Walk,,Woking,,,GU21 6YH,Tel: 01483 761 495, - ,,,No ratings yet Rate it yourself - /Services/opticians/LeaveReview/DefaultView.aspx?id=OP_5L7_3550__000001_GU211XX,0,0,
Matheson Optometrists,OP_5DF_14849__000001_GU345HG,OPT,47 Winchester Road,Four Marks,Alton,,,GU34 5HG,Tel: 01420 560082, - ,,,No ratings yet Rate it yourself - /Services/opticians/LeaveReview/DefaultView.aspx?id=OP_5DF_14849__000001_GU345HG,0,0,
Vision Express,O0M8Y,OPT,,74 South Street,,Chichester,West Sussex,PO19 1EE,Tel: 01243 380098, - ,,,No ratings yet Rate it yourself - /Services/opticians/LeaveReview/DefaultView.aspx?id=O0M8Y,0,0,
The Richard Tildesley Practice,,OPT,,51 West Street,,Chichester,,PO19 1RP,, - ,,,N/A - Data not available,,,
EMSLIE OPTICIANS,OP_5KP_14528__000001_RH41AY,OPT,62 High Street,,Dorking,Dorking,,RH4 1AY,Tel: 01306 875 201, - ,,,No ratings yet Rate it yourself - /Services/opticians/LeaveReview/DefaultView.aspx?id=OP_5KP_14528__000001_RH41AY,0,0,
Boots-Dorking,OP_5KP_10554__000003_RH41AW,OPT,83 High Street,,,Dorking,Surrey,RH4 1AW,Tel: 01306 882 176, - ,,,1 rating Rate it yourself - /Services/opticians/LeaveReview/DefaultView.aspx?id=OP_5KP_10554__000003_RH41AW,,,
Forbes Eyecare Ltd,OP_5L9_11782__000001_PO191DS,OPT,60 South Street,,Chichester,West Sussex,,PO19 1DS,Tel: 01243 771573, - ,,,3 ratings Rate it yourself - /Services/opticians/LeaveReview/DefaultView.aspx?id=OP_5L9_11782__000001_PO191DS,,,
Specsavers Opticians,OP_5KP_14662__000002_RH41BA,OPT,Specsavers,110 High Street,,Dorking,Surrey,RH4 1BA,Tel: 01306 745 350, - ,,,No ratings yet Rate it yourself - /Services/opticians/LeaveReview/DefaultView.aspx?id=OP_5KP_14662__000002_RH41BA,0,0,
Batemans (Opticians) Ltd,OP_5KP_11827__000001_RH41BA,OPT,,114 High Street,,Dorking,Surrey,RH4 1BA,Tel: 01306 882 787, - ,,,No ratings yet Rate it yourself - /Services/opticians/LeaveReview/DefaultView.aspx?id=OP_5KP_11827__000001_RH41BA,0,0,
The Opticians,OP_5G6_9543__000001_RG291LA,OPT,,113a High Street,,Odiham,Hampshire,RG29 1LA,Tel: 01256 703707, - ,,,No ratings yet Rate it yourself - /Services/opticians/LeaveReview/DefaultView.aspx?id=OP_5G6_9543__000001_RG291LA,0,0,