Organisation Name,NACS Code,Organisation Type,Address1,Address2,Address3,Address4,Address5,PostCode,Telephone Number,Opening time,Value  (Opening time),Banding Classification  (Opening time),NHS.UK users rating,Value  (NHS.UK users rating),Banding Classification  (NHS.UK users rating),Car parking (Is there car parking at this organisation?)
Clinic 4 Eyes,OPT_OL162LJ_1,OPT,,268 Entwistle Road,,Rochdale,,OL16 2LJ,Tel: 01706 643622, - ,,,No ratings yet Rate it yourself - /Services/opticians/LeaveReview/DefaultView.aspx?id=OPT_OL162LJ_1,0,0,
Yates & Suddell,OP_5JY_4206__000001_OL163NW,OPT,,109 Dale Street,Rochdale,Milnrow,Lancashire,OL16 3NW,Tel: 01706 642203, - ,,,No ratings yet Rate it yourself - /Services/opticians/LeaveReview/DefaultView.aspx?id=OP_5JY_4206__000001_OL163NW,0,0,
Eye Care Optical,OP_5JY_12490__000001_OL120DR,OPT,149 Yorkshire Street,149 Yorkshire Street,Rochdale,Rochdale,,OL12 0DR,Tel: 01706 645006, - ,,,No ratings yet Rate it yourself - /Services/opticians/LeaveReview/DefaultView.aspx?id=OP_5JY_12490__000001_OL120DR,0,0,
Clinic 4 Eyes,OP_5NQ_00001__000002_OL111HH,OPT,Nye Bevan House,Maclure Road,Rochdale,Lancashire,,OL11 1DN,Tel: 01706 868333, - ,,,No ratings yet Rate it yourself - /Services/opticians/LeaveReview/DefaultView.aspx?id=OP_5NQ_00001__000002_OL111HH,0,0,
The Clinic 4 Eyes Ltd,SP_5J5_3094__000001_OL111HH,OPT,Nye Bevan House,Maclure Road,,Rochdale,,OL11 1DN,Tel: 01706 868333, - ,,,2 ratings Rate it yourself - /Services/opticians/LeaveReview/DefaultView.aspx?id=SP_5J5_3094__000001_OL111HH,,,
Crescent Optical Ltd,OPT_OL161PZ_1,OPT,,103 Drake Street,,Rochdale,Lancashire,OL16 1PZ,Tel: 01706 633020, - ,,,No ratings yet Rate it yourself - /Services/opticians/LeaveReview/DefaultView.aspx?id=OPT_OL161PZ_1,0,0,
S J  Holt,OP_5JY_13743__000001_OL112ER,OPT,216 Oldham Road,Rochdale,Lancashire,,,OL11 2ER,Tel: 01706 633084, - ,,,No ratings yet Rate it yourself - /Services/opticians/LeaveReview/DefaultView.aspx?id=OP_5JY_13743__000001_OL112ER,0,0,
Specsavers Opticians,OP_5JY_11180__000001_OL161BZ,OPT,67 Yorkshire Street,,Rochdale,,,OL16 1BZ,Tel: 01706 642 244, - ,,,No ratings yet Rate it yourself - /Services/opticians/LeaveReview/DefaultView.aspx?id=OP_5JY_11180__000001_OL161BZ,0,0,
Eye Care Optical,OP_5JY_13744__000001_OL111EB,OPT,44 Milkstone Road,Rochdale,Lancashire,,,OL11 1EB,Tel: 01706 710500, - ,,,No ratings yet Rate it yourself - /Services/opticians/LeaveReview/DefaultView.aspx?id=OP_5JY_13744__000001_OL111EB,0,0,
Focus Opticians,OP_5NQ_20430__000002_OL111EB,OPT,4 Milkstone Road,,Rochdale,Lancashire,,OL11 1EB,Tel: 01706 713200, - ,,,No ratings yet Rate it yourself - /Services/opticians/LeaveReview/DefaultView.aspx?id=OP_5NQ_20430__000002_OL111EB,0,0,
Paul Cheetham Eyecare,OP_5JY_1235__000001_OL161ED,OPT,,4 Lord Square,,Rochdale,Lancashire,OL16 1ED,Tel: 01706 647119, - ,,,No ratings yet Rate it yourself - /Services/opticians/LeaveReview/DefaultView.aspx?id=OP_5JY_1235__000001_OL161ED,0,0,
Vision Express,OP_5JY_7061__000004_OL161EA,OPT,56 Market Way,Royal Exchange Shopping Centre,Rochdale,,,OL16 1EA,Tel: 01706 352220, - ,,,No ratings yet Rate it yourself - /Services/opticians/LeaveReview/DefaultView.aspx?id=OP_5JY_7061__000004_OL161EA,0,0,
Boots-Rochdale - Royal Exchange Shopping Cntr,OP_5JY_12769__000003_OL161EA,OPT,50 Royal Exchange Shopping Centre,,,Rochdale,Lancashire,OL16 1EA,Tel: 01706 525135, - ,,,No ratings yet Rate it yourself - /Services/opticians/LeaveReview/DefaultView.aspx?id=OP_5JY_12769__000003_OL161EA,0,0,
Asda Opticians,OPT_OL12 6XT,OPT,ASDA,THE OLD CRICKET GROUND,,ROCHDALE,,OL12 6XT,Tel: 01706 652012, - ,,,No ratings yet Rate it yourself - /Services/opticians/LeaveReview/DefaultView.aspx?id=OPT_OL12 6XT,0,0,
Patricia Hooson ,OP_5J5_14210__000001_OL159DB,OPT,46 Victoria Street,Littleborough,,Rochdale,,OL15 9DB,Tel: 01706 379783, - ,,,No ratings yet Rate it yourself - /Services/opticians/LeaveReview/DefaultView.aspx?id=OP_5J5_14210__000001_OL159DB,0,0,
J H  Fisher (Optometrist),OP_5JY_2528__000001_OL113AW,OPT,778-780 Manchester Road,Castleton,,Rochdale,,OL11 3AW,Tel: 01706 343505, - ,,,No ratings yet Rate it yourself - /Services/opticians/LeaveReview/DefaultView.aspx?id=OP_5JY_2528__000001_OL113AW,0,0,
Robert Glass Opticians Limited,OP_5J5 42__000003_OL28NH,OPT,36 Market Street,Shaw,,Oldham,Lancashire,OL2 8NH,Tel: 01706 299422, - ,,,No ratings yet Rate it yourself - /Services/opticians/LeaveReview/DefaultView.aspx?id=OP_5J5 42__000003_OL28NH,0,0,
Scrivens Opticians & Hearing Care,OP_5J5_4079__000001_OL28NY,OPT,,63 Market Street,,Shaw,Lancashire,OL2 8NP,Tel: 01706 847809, - ,,,No ratings yet Rate it yourself - /Services/opticians/LeaveReview/DefaultView.aspx?id=OP_5J5_4079__000001_OL28NY,0,0,
Scrivens Opticians & Hearing Care,OP_5J5_162__000001_OL25QA,OPT,,3 Market Square,,Royton,Lancashire,OL2 5QD,Tel: 0161 620 0121, - ,,,No ratings yet Rate it yourself - /Services/opticians/LeaveReview/DefaultView.aspx?id=OP_5J5_162__000001_OL25QA,0,0,
Craven & Murray Opticians Ltd,OP_5NQ_00003__000001_OL115XE,OPT,675 Edenfield Road,Norden,Rochdale,Lancashire,,OL11 5XE,Tel: 01706 641138, - ,,,No ratings yet Rate it yourself - /Services/opticians/LeaveReview/DefaultView.aspx?id=OP_5NQ_00003__000001_OL115XE,0,0,
DG Opticians,OP_5F4_4583__000001_OL101AA,OPT,7 Hornby Street,,Heywood,,,OL10 1AA,Tel: 01706 369525, - ,,,No ratings yet Rate it yourself - /Services/opticians/LeaveReview/DefaultView.aspx?id=OP_5F4_4583__000001_OL101AA,0,0,
Shaw's Opticians,OP_5F4_1008__000002_OL101HX,OPT,39 Market Street,39 Market Street,Heywood,Heywood,,OL10 1HX,Tel: 01706 369369, - ,,,1 rating Rate it yourself - /Services/opticians/LeaveReview/DefaultView.aspx?id=OP_5F4_1008__000002_OL101HX,,,
The Eye Centre (Heywood) Ltd,OPT_OL104LY_1,OPT,,58 Market Street,,Heywood,Lancashire,OL10 4LY,Tel: 01706 620432, - ,,,1 rating Rate it yourself - /Services/opticians/LeaveReview/DefaultView.aspx?id=OPT_OL104LY_1,,,
Chadderton Opticians,OP_5J5_9837__000002_OL90LQ,OPT,"Unit 18, The Shopping Precinct",Middleton Road,Chadderton,Oldham,Lancashire,OL9 0LQ,Tel: 0161 678 7784, - ,,,1 rating Rate it yourself - /Services/opticians/LeaveReview/DefaultView.aspx?id=OP_5J5_9837__000002_OL90LQ,,,
Robert Glass Opticians Limited,OP_5J5 104__000002_OL42AH,OPT,104 Huddersfield Road,,Oldham,Lancashire,,OL4 2AH,, - ,,,No ratings yet Rate it yourself - /Services/opticians/LeaveReview/DefaultView.aspx?id=OP_5J5 104__000002_OL42AH,0,0,
Tesco Extra,OP-5J5-1998__000001_OL42GA,OPT,Huddersfield Road,,Oldham,Lancashire,,OL4 2GA,Tel: 0345 601 3479, - ,,,No ratings yet Rate it yourself - /Services/opticians/LeaveReview/DefaultView.aspx?id=OP-5J5-1998__000001_OL42GA,0,0,
Oldham Visionplus Limited,OP_5J5_12078__000001_OL13AE,OPT,9 Curzon Street,,Oldham,,,OL1 3AE,Tel: 0161 652 3339, - ,,,No ratings yet Rate it yourself - /Services/opticians/LeaveReview/DefaultView.aspx?id=OP_5J5_12078__000001_OL13AE,0,0,
Boots-Oldham - Town Sq Centre (in Boots UK),OP_5J5_566__000003_OL11XD,OPT,1 Town Square Centre,,,Oldham,Lancashire,OL1 1XD,Tel: 0161 6788551, - ,,,1 rating Rate it yourself - /Services/opticians/LeaveReview/DefaultView.aspx?id=OP_5J5_566__000003_OL11XD,,,
Vision Express,OP_5J5_8969__000002_OL11HE,OPT,"Unit 6, Lower Mall",The Spindles Shopping Centre,Oldham,,,OL1 1HE,Tel: 0161 633 2233, - ,,,No ratings yet Rate it yourself - /Services/opticians/LeaveReview/DefaultView.aspx?id=OP_5J5_8969__000002_OL11HE,0,0,
D Igoe Optometrists,OP_5F4_3971__000002_M246UQ,OPT,36 Long Street,Middleton,Manchester,,,M24 6UQ,Tel: 0161 653 0771, - ,,,No ratings yet Rate it yourself - /Services/opticians/LeaveReview/DefaultView.aspx?id=OP_5F4_3971__000002_M246UQ,0,0,
Eye Care Optical,OP_5J5_14172__000002_OL41PA,OPT,152 Lees Road,Oldham,Lancashire,,,OL4 1PA,Tel: 0161 678 7312, - ,,,No ratings yet Rate it yourself - /Services/opticians/LeaveReview/DefaultView.aspx?id=OP_5J5_14172__000002_OL41PA,0,0,
Tesco Opticians,OP_5NQ_1998__000002_M241HB,OPT,Tesco Extra,Barton Road,,Middleton,,M24 1HB,Tel: 0845 601 3479, - ,,,No ratings yet Rate it yourself - /Services/opticians/LeaveReview/DefaultView.aspx?id=OP_5NQ_1998__000002_M241HB,0,0,
Specsavers Opticians,OP_5F4_3314__000005_M244EL,OPT,Unit G15,Arndale Shopping Centre,Middleton,,,M24 4EL,Tel: 0161 654 0440, - ,,,No ratings yet Rate it yourself - /Services/opticians/LeaveReview/DefaultView.aspx?id=OP_5F4_3314__000005_M244EL,0,0,
Boots-Middleton ,OP_5F4_625__000004_M244EL,OPT,G8 Arndale Centre,,,Middleton,Lancashire,M24 4EL,Tel: 0161 655 3021, - ,,,No ratings yet Rate it yourself - /Services/opticians/LeaveReview/DefaultView.aspx?id=OP_5F4_625__000004_M244EL,0,0,
Lees Optical,OPT_OL45AA_1,OPT,,94 High Street,,"Lees, Oldham",,OL4 5AA,Tel: 0161 627 5735, - ,,,No ratings yet Rate it yourself - /Services/opticians/LeaveReview/DefaultView.aspx?id=OPT_OL45AA_1,0,0,
Gail Collier,OP_5J5_7304__000001_OL45AA,OPT,76 High Street,Lees,Oldham,,,OL4 5AA,Tel: 0161 620 3135, - ,,,No ratings yet Rate it yourself - /Services/opticians/LeaveReview/DefaultView.aspx?id=OP_5J5_7304__000001_OL45AA,0,0,
Hathershaw Opticians,OPT_OL81QN_1,OPT,,250 Ashton Road,,Oldham,,OL8 1QN,Tel: 0161 258 2147, - ,,,No ratings yet Rate it yourself - /Services/opticians/LeaveReview/DefaultView.aspx?id=OPT_OL81QN_1,0,0,
Costco Wholesale UK Limited,OP_OL98AU_46293,OPT,,The Broadway,Chadderton,Oldham,,OL9 8AU,Tel: 0161 684 2015, - ,,,No ratings yet Rate it yourself - /Services/opticians/LeaveReview/DefaultView.aspx?id=OP_OL98AU_46293,0,0,
Asda Stores Ltd,OP_5JX_11062__000002_BL98RS,OPT,Asda Store,Pilsworth Road,Pilsworth,Bury,,BL9 8RS,Tel: 0161 3512520, - ,,,No ratings yet Rate it yourself - /Services/opticians/LeaveReview/DefaultView.aspx?id=OP_5JX_11062__000002_BL98RS,0,0,
A R Gregory ,OP_5J5_3345__000001_OL84SA,OPT,764 Hollins Road,Hollinwood,Oldham,,,OL8 4SA,Tel: 0161 681 3011, - ,,,1 rating Rate it yourself - /Services/opticians/LeaveReview/DefaultView.aspx?id=OP_5J5_3345__000001_OL84SA,,,
S W Allen Ltd,OP_5J6_6334__000001_OL145AB,OPT,19 Water Street,,Todmorden,,,OL14 5AB,Tel: 01706 815551, - ,,,No ratings yet Rate it yourself - /Services/opticians/LeaveReview/DefaultView.aspx?id=OP_5J6_6334__000001_OL145AB,0,0,
Domiciliary only Ian Creek Opticians ,OP_5LH_14225__000002_M400JA,OPT,325 Hollinwood Avenue,New Moston,Manchester,,,M40 0JA,Tel: 0161 681 1348, - ,,,No ratings yet Rate it yourself - /Services/opticians/LeaveReview/DefaultView.aspx?id=OP_5LH_14225__000002_M400JA,0,0,
Gent Brothers Opticians ,OP_5CR_11412__000001_M400JA,OPT,325 Hollinwood Avenue,New Moston,Manchester,,,M40 0JA,Tel: 0161 681 1348, - ,,,3 ratings Rate it yourself - /Services/opticians/LeaveReview/DefaultView.aspx?id=OP_5CR_11412__000001_M400JA,,,
20/20 Saddleworth Limited,OP_5J5_14337__000001_OL36AY,OPT,61 High Street,Uppermill,Oldham,,,OL3 6AP,Tel: 01457 872020, - ,,,No ratings yet Rate it yourself - /Services/opticians/LeaveReview/DefaultView.aspx?id=OP_5J5_14337__000001_OL36AY,0,0,
Vision Express Ltd,OP_5JX_BL90JN__000001_BL90JN,OPT,19 Central Street,The Rock,Bury,,,BL9 0JN,Tel: 0161 797 6639, - ,,,No ratings yet Rate it yourself - /Services/opticians/LeaveReview/DefaultView.aspx?id=OP_5JX_BL90JN__000001_BL90JN,0,0,
Boots-Bury - Union Arcade,OP_5JX_10975__000001_BL90QF,OPT,Unit 7 Union Arcade,Millgate Shopping Centre,,Bury,Lancashire,BL9 0QF,Tel: 0161 705 1157, - ,,,No ratings yet Rate it yourself - /Services/opticians/LeaveReview/DefaultView.aspx?id=OP_5JX_10975__000001_BL90QF,0,0,
Yates & Suddell,OP_5JX_100__000001_BL90QG,OPT,,15-19 Minden Parade,,Bury,Greater Manchester,BL9 0QG,Tel: 0161 7642209, - ,,,No ratings yet Rate it yourself - /Services/opticians/LeaveReview/DefaultView.aspx?id=OP_5JX_100__000001_BL90QG,0,0,
Specscart (Union Street),TP9EC,OPT,Specscart Bury,10 Union Street,,Bury,Greater Manchester,BL9 0NY,Tel: 01613125767, - ,,,No ratings yet Rate it yourself - /Services/opticians/LeaveReview/DefaultView.aspx?id=TP9EC,0,0,
The Optical Shop,,OPT,,15 Princess Parade,Mill Gate Shopping Centre,Bury,Greater Manchester,BL9 0QL,Tel: 0161 2225020, - ,,,N/A - Data not available,,,
Specsavers Opticians,OP_5JX_717__000001_BL90BX,OPT,39/41,The Haymarket,Millgate Shopping Centre,Bury,Lancashire,BL9 0BX,Tel: 0161 763 3916, - ,,,No ratings yet Rate it yourself - /Services/opticians/LeaveReview/DefaultView.aspx?id=OP_5JX_717__000001_BL90BX,0,0,
Rose & Tarrant Opticians,OP_5JX_13736__000001_BL90AD,OPT,,14 Crompton Street,Lancashire,Bury,Lancashire,BL9 0AD,Tel: 0161 764 4420, - ,,,1 rating Rate it yourself - /Services/opticians/LeaveReview/DefaultView.aspx?id=OP_5JX_13736__000001_BL90AD,,,
Stotts Opticians,OP_5JX_5509__000001_BL98JN,OPT,113 Parr Lane,Unsworth,Bury,,,BL9 8JN,Tel: 0161 796 6170, - ,,,No ratings yet Rate it yourself - /Services/opticians/LeaveReview/DefaultView.aspx?id=OP_5JX_5509__000001_BL98JN,0,0,
"Anderton, Akbar & Procter Ltd",OP_5LH_9878__000001_OL50JF,OPT,7 George Street,,Ashton-under-Lyne,Mossley,,OL5 0JF,Tel: 01457 832188, - ,,,No ratings yet Rate it yourself - /Services/opticians/LeaveReview/DefaultView.aspx?id=OP_5LH_9878__000001_OL50JF,0,0,
Focus Optics,5J5 8408,OPT,Focus Optics,Failsworth District Centre,Ashton Road West,"Failsworth, Manchester",,M35 0AD,Tel: 0161 684 8659, - ,,,No ratings yet Rate it yourself - /Services/opticians/LeaveReview/DefaultView.aspx?id=5J5 8408,0,0,
Tesco Opticians,OP_19985J5__000002_M350EJ,OPT,Oldham Road,Failsworth,Oldham,Oldham,,M35 0EJ,Tel: 0161 251 7438, - ,,,No ratings yet Rate it yourself - /Services/opticians/LeaveReview/DefaultView.aspx?id=OP_19985J5__000002_M350EJ,0,0,
Optical Express ,OP_5CR_3256__000002_M91DH,OPT,"Unit 31, North City Shopping Centre",Lee Road,,Manchester,Lancashire,M9 4DH,Tel: 0800 023 2020, - ,,,No ratings yet Rate it yourself - /Services/opticians/LeaveReview/DefaultView.aspx?id=OP_5CR_3256__000002_M91DH,0,0,
Specsavers Harpurhey ,000006__000001_M94DH,OPT,Unit 41,North City Shopping Centre,,Harpurhey,,M9 4DH,Tel: 0161 202 8710, - ,,,1 rating Rate it yourself - /Services/opticians/LeaveReview/DefaultView.aspx?id=000006__000001_M94DH,,,
The Spectacle Studio Ltd,OP_5JX_6696__000001_BL09AD,OPT,45 Bridge Street,Ramsbottom,Bury,Lancashire,,BL0 9AD,Tel: 01706 822 200, - ,,,No ratings yet Rate it yourself - /Services/opticians/LeaveReview/DefaultView.aspx?id=OP_5JX_6696__000001_BL09AD,0,0,
Yates & Suddell,OP_5JX_3316__000002_BL09AD,OPT,,35 Bridge Street,Ramsbottom,Bury,Lancashire,BL0 9AD,Tel: 01706 822393, - ,,,No ratings yet Rate it yourself - /Services/opticians/LeaveReview/DefaultView.aspx?id=OP_5JX_3316__000002_BL09AD,0,0,
Allegro Optical,T6F9J,OPT,,30 Peel Street,,Marsden,,HD7 6BW,, - ,,,No ratings yet Rate it yourself - /Services/opticians/LeaveReview/DefaultView.aspx?id=T6F9J,0,0,
Arrowsmith Eyecare,OP_5CR_9836__000002_M95TT,OPT,672 Rochdale Road,Harpurhey,,Manchester,,M9 5TT,Tel: 0161 205 2575, - ,,,1 rating Rate it yourself - /Services/opticians/LeaveReview/DefaultView.aspx?id=OP_5CR_9836__000002_M95TT,,,
Specs Direct Opticians,OP_5JX_13738__000001_M456BG,OPT,8 Elms Square,Whitefield,Manchester,,,M45 7TA,Tel: 0161 767 9740, - ,,,No ratings yet Rate it yourself - /Services/opticians/LeaveReview/DefaultView.aspx?id=OP_5JX_13738__000001_M456BG,0,0,
Instore Optician,CO-5188,OPT,,"Morrisons, 5 Stanley Road",,Whitefield,Greater Manchester,M45 8QH,Tel: 0161 2220 920, - ,,,2 ratings Rate it yourself - /Services/opticians/LeaveReview/DefaultView.aspx?id=CO-5188,,,
P Toleman Opticians,OP_5CR_8861__000001_M106JF,OPT,86 Old Church Street,Newton Heath,Manchester,,,M40 2JF,Tel: 0161 681 5931, - ,,,1 rating Rate it yourself - /Services/opticians/LeaveReview/DefaultView.aspx?id=OP_5CR_8861__000001_M106JF,,,
Domiciliary only Primary Ophthalmic Services,2415LH__000001_OL69DD,OPT,2 Lowfield Avenue,,Ashton-under-Lyne,Lancashire,,OL6 9DD,, - ,,,No ratings yet Rate it yourself - /Services/opticians/LeaveReview/DefaultView.aspx?id=2415LH__000001_OL69DD,0,0,
I C Optical Limited,OP_5J5_14215__000001_M250AS,OPT,56 Bishops  Road,Prestwich,Manchester,,,M25 0AS,Tel: 0161 773 3343, - ,,,No ratings yet Rate it yourself - /Services/opticians/LeaveReview/DefaultView.aspx?id=OP_5J5_14215__000001_M250AS,0,0,
Domicillary only Ian Clyne,OP_5LH_14231__000002_M250AS,OPT,56 Bishops Road,Prestwich,Manchester,,,M25 0AS,Tel: 0161 773 3343, - ,,,No ratings yet Rate it yourself - /Services/opticians/LeaveReview/DefaultView.aspx?id=OP_5LH_14231__000002_M250AS,0,0,
Leightons Optometrists,OP_5JX_4666__000001_BL09SH,OPT,7 The Precinct,Longsight Road,Holcombe Brook,Holcombe Brook,,BL0 9SH,Tel: 01204 888100, - ,,,No ratings yet Rate it yourself - /Services/opticians/LeaveReview/DefaultView.aspx?id=OP_5JX_4666__000001_BL09SH,0,0,
The Eye Site Opticians ,OP_5CR_3302__000001_M85BN,OPT,58 Bury Old Road,Cheetham,Manchester,,,M8 5BN,Tel: 0161 795 2341, - ,,,1 rating Rate it yourself - /Services/opticians/LeaveReview/DefaultView.aspx?id=OP_5CR_3302__000001_M85BN,,,
Robert Glass Opticians,OP_5F5_7774__000001_M74QJ,OPT,3 King Edward Buildings,Bury Old Road,Salford,Manchester,,M7 4QJ,Tel: 0161 740 3069, - ,,,No ratings yet Rate it yourself - /Services/opticians/LeaveReview/DefaultView.aspx?id=OP_5F5_7774__000001_M74QJ,0,0,
David Hodes Ltd,OP_5JX_9703__000002_M251AY,OPT,14 Longfield Centre,Bury New Road,Prestwich,,,M25 1AY,Tel: 0161 773 9584, - ,,,4 ratings Rate it yourself - /Services/opticians/LeaveReview/DefaultView.aspx?id=OP_5JX_9703__000002_M251AY,,,
The Village Optician Ltd,OP_5JX_493__000001_M251AX,OPT,470 Bury New Road,Prestwich,Manchester,,,M25 1AX,Tel: 0161 773 0069, - ,,,No ratings yet Rate it yourself - /Services/opticians/LeaveReview/DefaultView.aspx?id=OP_5JX_493__000001_M251AX,0,0,
Travers Opticians,OP-5J5 -473__000013_M418TW,OPT,,39 Bishops Road,,manchester,,M25 0HT,Tel: 0161 746 8098, - ,,,2 ratings Rate it yourself - /Services/opticians/LeaveReview/DefaultView.aspx?id=OP-5J5 -473__000013_M418TW,,,
Vikesh Measuria,5LH 243__000001_OL66HG,OPT,28 - 30 Penny Meadow,,Ashton-under-Lyne,Lancashire,,OL6 6HG,Tel: 0161 330 9437, - ,,,No ratings yet Rate it yourself - /Services/opticians/LeaveReview/DefaultView.aspx?id=5LH 243__000001_OL66HG,0,0,
John H. Blease,OP_5LH_14165__000001_OL66BY,OPT,15 Fletcher Street,,Ashton-under-Lyne,,,OL6 6BY,Tel: 0161 330 2321, - ,,,No ratings yet Rate it yourself - /Services/opticians/LeaveReview/DefaultView.aspx?id=OP_5LH_14165__000001_OL66BY,0,0,
Vision Service Opticians,OP_5CR_11066__000001_M87ER,OPT,4 Progress Buildings,Halliwell Lane,Cheetham Hill,Manchester,,M8 9ER,Tel: 0161 740 9009, - ,,,1 rating Rate it yourself - /Services/opticians/LeaveReview/DefaultView.aspx?id=OP_5CR_11066__000001_M87ER,,,
Vision Express,OP_5LH_3021__000001_OL67JH,OPT,,12 Mercian Way,,Ashton-under-Lyne,,OL6 7JH,Tel: 0161 339 6502, - ,,,No ratings yet Rate it yourself - /Services/opticians/LeaveReview/DefaultView.aspx?id=OP_5LH_3021__000001_OL67JH,0,0,
Visioncare at Home North West Ltd (Domicilliary Only),OP_OL70AU_46385,OPT,,"Unit 5c, Kayley Industrial Estate",,Ashton-under-Lyne,,OL7 0AU,, - ,,,No ratings yet Rate it yourself - /Services/opticians/LeaveReview/DefaultView.aspx?id=OP_OL70AU_46385,0,0,
Specsavers Opticians,OP_5LH_11788__000001_OL67JG,OPT,Unit 12,Ladysmith Shopping Centre,Ashton-under-Lyne,Greater Manchester,,OL6 7JQ,Tel: 0161 339 4449, - ,,,No ratings yet Rate it yourself - /Services/opticians/LeaveReview/DefaultView.aspx?id=OP_5LH_11788__000001_OL67JG,0,0,
Boots-Ashton Under Lyne,OP_5LH_12363__000002_OL67JL,OPT,15-17 Staveleigh Way,Ladysmith Centre,Ashton-under-Lyne,Ashton-under-Lyne,,OL6 7JL,Tel: 0161 308 4428, - ,,,3 ratings Rate it yourself - /Services/opticians/LeaveReview/DefaultView.aspx?id=OP_5LH_12363__000002_OL67JL,,,
Prais Opticians,OP_5JX_13741__000001_M250JU,OPT,46 Bury New Road,Prestwich,Manchester,,,M25 0JU,Tel: 0161 798 8800, - ,,,1 rating Rate it yourself - /Services/opticians/LeaveReview/DefaultView.aspx?id=OP_5JX_13741__000001_M250JU,,,
Muldoon & Tonge Opticians,OP_5LH_8867__000001_OL67LR,OPT,178 Stamford Street,,Ashton-under-Lyne,,,OL6 7LR,Tel: 0161 330 4643, - ,,,1 rating Rate it yourself - /Services/opticians/LeaveReview/DefaultView.aspx?id=OP_5LH_8867__000001_OL67LR,,,
Maxwell Kay Opticians Ltd,OP_5JX_2911__000001_M261NQ,OPT,26 Blackburn Street,Radcliffe,Manchester,,,M26 1NQ,Tel: 0161 723 3397, - ,,,No ratings yet Rate it yourself - /Services/opticians/LeaveReview/DefaultView.aspx?id=OP_5JX_2911__000001_M261NQ,0,0,
The Eye Site (Opticians) Ltd,OP_5F5_14706__000003_M74AS,OPT,,47 Leicester Road,Salford,Manchester,,M7 4AS,Tel: 0161 792 8181, - ,,,No ratings yet Rate it yourself - /Services/opticians/LeaveReview/DefaultView.aspx?id=OP_5F5_14706__000003_M74AS,0,0,
Asda Opticians,OPT_OL6 7DP,OPT,,Cavendish Street,,Ashton-Under-Lyne,,OL6 7DP,Tel: 0161 342 6612, - ,,,No ratings yet Rate it yourself - /Services/opticians/LeaveReview/DefaultView.aspx?id=OPT_OL6 7DP,0,0,
Harris S J,OP_5F5_14700__000001_M74EF,OPT,37 Legh Street,Salford,,Manchester,,M7 4EF,Tel: 0161 792 0380, - ,,,No ratings yet Rate it yourself - /Services/opticians/LeaveReview/DefaultView.aspx?id=OP_5F5_14700__000001_M74EF,0,0,
Eyes Right Opticians Ltd,OP_5LH_4840__000001_M437AA,OPT,124 Market Street,,Manchester,Droylsden,,M43 7AA,Tel: 0161 301 1400, - ,,,No ratings yet Rate it yourself - /Services/opticians/LeaveReview/DefaultView.aspx?id=OP_5LH_4840__000001_M437AA,0,0,
Wass Opticians,OP_5LH_9513__000001_M437BP,OPT,48-50 Ashton Road,Droylsden,Manchester,,,M43 7BP,Tel: 0161 370 2037, - ,,,1 rating Rate it yourself - /Services/opticians/LeaveReview/DefaultView.aspx?id=OP_5LH_9513__000001_M437BP,,,
Selby & Glover,OP_5LH_2460__000001_M436QF,OPT,393 Manchester Road,Droylsden,Manchester,,,M43 6QF,Tel: 0161 370 1017, - ,,,No ratings yet Rate it yourself - /Services/opticians/LeaveReview/DefaultView.aspx?id=OP_5LH_2460__000001_M436QF,0,0,
Roberts Opticians,OP_5LH_333__000001_SK164JZ,OPT,125 King Street,,Dukinfield,,,SK16 4JZ,Tel: 0161 330 2394, - ,,,1 rating Rate it yourself - /Services/opticians/LeaveReview/DefaultView.aspx?id=OP_5LH_333__000001_SK164JZ,,,
Mark Hurst Opticians,HX7 8UQ__000001_HX78UQ,OPT,37 West End,Hebden Bridge,Halifax,West Yorkshire,,HX7 8UQ,Tel: 01422 843456, - ,,,1 rating Rate it yourself - /Services/opticians/LeaveReview/DefaultView.aspx?id=HX7 8UQ__000001_HX78UQ,,,
Stalybridge Eyecare,5LH 225__000001_SK152JJ,OPT,47 Melbourne Street,Stalybridge,Cheshire,,,SK15 2JJ,Tel: 0161 338 2561, - ,,,No ratings yet Rate it yourself - /Services/opticians/LeaveReview/DefaultView.aspx?id=5LH 225__000001_SK152JJ,0,0,
Steve Mayer Opticians,OP_5LH_1963__000001_SK151RR,OPT,46 A Grosvenor Street,,Stalybridge,,,SK15 1RR,Tel: 0161 303 7773, - ,,,No ratings yet Rate it yourself - /Services/opticians/LeaveReview/DefaultView.aspx?id=OP_5LH_1963__000001_SK151RR,0,0,
Valli Opticians,QDT-00:133__000001_HX75LL,OPT,,1 Bridgegate,,Hebden Bridge,West Yorkshire,HX7 8EX,Tel: 01422 842084, - ,,,No ratings yet Rate it yourself - /Services/opticians/LeaveReview/DefaultView.aspx?id=QDT-00:133__000001_HX75LL,0,0,
Valli Opticians,OP_5J6_4094__000001_HX78AH,OPT,14 Albert Street,,Hebden Bridge,Hebden Bridge,,HX7 8AH,Tel: 01422 842084, - ,,,No ratings yet Rate it yourself - /Services/opticians/LeaveReview/DefaultView.aspx?id=OP_5J6_4094__000001_HX78AH,0,0,
Specsavers Openshaw,01-19246,OPT,,"Unit 17&18 Lime Sq, Ashton old Rd ",,"Openshaw,  Manchester",,M11 1DA,, - ,,,3 ratings Rate it yourself - /Services/opticians/LeaveReview/DefaultView.aspx?id=01-19246,,,
Aldreds Opticians,OP_5LK_6551__000002_HD75AN,OPT,8 Carr Lane,Slaithwaite,Huddersfield,,,HD7 5AN,Tel: 01484 843023, - ,,,No ratings yet Rate it yourself - /Services/opticians/LeaveReview/DefaultView.aspx?id=OP_5LK_6551__000002_HD75AN,0,0,
Openshaw Optical ,00005__000001_M111JS,OPT,1311 Ashton Old Road,Openshaw,,Manchester,,M11 1JS,Tel: 0161 370 1800, - ,,,2 ratings Rate it yourself - /Services/opticians/LeaveReview/DefaultView.aspx?id=00005__000001_M111JS,,,