Organisation Name,NACS Code,Organisation Type,Address1,Address2,Address3,Address4,Address5,PostCode,Telephone Number,Opening time,Value  (Opening time),Banding Classification  (Opening time),NHS.UK users rating,Value  (NHS.UK users rating),Banding Classification  (NHS.UK users rating),Car parking (Is there car parking at this organisation?)
My Eyes Opticians,OP_5K8_779__000001_EC1R4RA,OPT,68 Exmouth Market,,London,,,EC1R 4QP,Tel: 0207 278 8480, - ,,,No ratings yet Rate it yourself - /Services/opticians/LeaveReview/DefaultView.aspx?id=OP_5K8_779__000001_EC1R4RA,0,0,
City University City Sight,OP_5K8_3701__000001_EC1V0HB,OPT,Tait Building,Northampton Square,London,London,,EC1V 0HB,Tel: 020 7040 8338, - ,,,No ratings yet Rate it yourself - /Services/opticians/LeaveReview/DefaultView.aspx?id=OP_5K8_3701__000001_EC1V0HB,0,0,
Angel Eyes Opticians,OP_5K8_9323__000001_EC1V4LD,OPT,395 St. John Street,,London,,,EC1V 4LD,Tel: 020 7837 9418, - ,,,No ratings yet Rate it yourself - /Services/opticians/LeaveReview/DefaultView.aspx?id=OP_5K8_9323__000001_EC1V4LD,0,0,
OPTIX AT BROADGATE (MR KARBARON),10021__000001_EC2M2WA,OPT,175 Bishops Gate 2 Exchange Arcade,,London,,,EC2M 2WA,Tel: 020 7628 0330, - ,,,No ratings yet Rate it yourself - /Services/opticians/LeaveReview/DefaultView.aspx?id=10021__000001_EC2M2WA,0,0,
New Era Optical,OP_5K8_103__000001_EC1N7TR,OPT,54 Leather Lane,,London,,,EC1N 7TP,Tel: 020 7405 0618, - ,,,No ratings yet Rate it yourself - /Services/opticians/LeaveReview/DefaultView.aspx?id=OP_5K8_103__000001_EC1N7TR,0,0,
Specsavers Islington,OP 5K8 6015__000003_N19ER,OPT,68 Chapel Market,Islington,London,,,N1 9ER,Tel: 020 7841 3030, - ,,,2 ratings Rate it yourself - /Services/opticians/LeaveReview/DefaultView.aspx?id=OP 5K8 6015__000003_N19ER,,,
Angel Eye Centre ,OP_5K8_6693__000001_N19EX,OPT,85 Chapel Market,,London,,,N1 9EX,Tel: 020 7278 3535, - ,,,No ratings yet Rate it yourself - /Services/opticians/LeaveReview/DefaultView.aspx?id=OP_5K8_6693__000001_N19EX,0,0,
Insight Opticians,OP_5K8_198__000001_N19EZ,OPT,24 Chapel Market,,London,,,N1 9EZ,Tel: 020 7278 1212, - ,,,No ratings yet Rate it yourself - /Services/opticians/LeaveReview/DefaultView.aspx?id=OP_5K8_198__000001_N19EZ,0,0,
VISION EXPRESS (UK)LTD,OP 5K8__000002_N10PQ,OPT,23-24 Upper Street,Islington,London,,,N1 0PQ,Tel: 0207 354 0057, - ,,,No ratings yet Rate it yourself - /Services/opticians/LeaveReview/DefaultView.aspx?id=OP 5K8__000002_N10PQ,0,0,
David Clulow,OP_5K8_790__000001_N10PQ,OPT,25 Upper Street,,London,,,N1 0PQ,Tel: 020 7704 0010, - ,,,No ratings yet Rate it yourself - /Services/opticians/LeaveReview/DefaultView.aspx?id=OP_5K8_790__000001_N10PQ,0,0,
Anthoney Austin Opticians,OP_5K8_732__000001_,OPT,32-33 Cowcross Street,,London,,,EC1M 6DF,Tel: 020 7253 5570, - ,,,No ratings yet Rate it yourself - /Services/opticians/LeaveReview/DefaultView.aspx?id=OP_5K8_732__000001_,0,0,
Cult Vision,OP_EC1M7AA_071014,OPT,,14 Goswell Road,,London,,EC1M 7AA,Tel: 020 7251 1268, - ,,,No ratings yet Rate it yourself - /Services/opticians/LeaveReview/DefaultView.aspx?id=OP_EC1M7AA_071014,0,0,
Eyelevel,OP_5K8_5085__000001_N10PN,OPT,37 Upper Street,,London,,,N1 0PN,Tel: 020 7354 9277, - ,,,No ratings yet Rate it yourself - /Services/opticians/LeaveReview/DefaultView.aspx?id=OP_5K8_5085__000001_N10PN,0,0,
Schuller Opticians,OP_5K7_6010__000001_WC1N3LJ,OPT,44 Lambs Conduit Street,,London,,,WC1N 3LJ,Tel: 020 7404 2002, - ,,,No ratings yet Rate it yourself - /Services/opticians/LeaveReview/DefaultView.aspx?id=OP_5K7_6010__000001_WC1N3LJ,0,0,
Boots-Holborn,OP_5K8_284__000002_EC1N2TD,OPT,122 Holborn,,,London,,EC1N 2TD,Tel: 0207 831 6467, - ,,,1 rating Rate it yourself - /Services/opticians/LeaveReview/DefaultView.aspx?id=OP_5K8_284__000002_EC1N2TD,,,
Specsavers Opticians,OP 932__000001_WC1V7PU,OPT,"Unit 4, 311-318 High Holborn",Camden,London,,,WC1V 7PU,Tel: 020 7404 4432, - ,,,No ratings yet Rate it yourself - /Services/opticians/LeaveReview/DefaultView.aspx?id=OP 932__000001_WC1V7PU,0,0,
Vision Express Optical Lab,OP_5K7_6012__000001_WC1V6BG,OPT,37-39 High Holborn,,London,,,WC1V 6BG,Tel: 020 7831 2670, - ,,,No ratings yet Rate it yourself - /Services/opticians/LeaveReview/DefaultView.aspx?id=OP_5K7_6012__000001_WC1V6BG,0,0,
City Opticians,OP_5K7_8810__000001_WC2A1AA,OPT,75 Chancery Lane,,London,,,WC2A 1AA,Tel: 020 7405 4875, - ,,,No ratings yet Rate it yourself - /Services/opticians/LeaveReview/DefaultView.aspx?id=OP_5K7_8810__000001_WC2A1AA,0,0,
London Eye Optique,OP_5K8_1865__000002_EC1Y8NX,OPT,2a Cherry Tree Walk,Whitecross Street,London,,,EC1Y 8NX,Tel: 020 7256 9778, - ,,,1 rating Rate it yourself - /Services/opticians/LeaveReview/DefaultView.aspx?id=OP_5K8_1865__000002_EC1Y8NX,,,
Brunswick Visionplus Ltd,OP_5K7_7001__000003_WC1N1AF,OPT,Unit 31 Brunswick Centre,,London,,,WC1N 1AF,Tel: 020 7520 0010, - ,,,No ratings yet Rate it yourself - /Services/opticians/LeaveReview/DefaultView.aspx?id=OP_5K7_7001__000003_WC1N1AF,0,0,
RNIB,-60 5LC__000002_WC1H9NE,OPT,105 Judd Street,,,London,,WC1H 9NE,Tel: 020 7391 2368, - ,,,No ratings yet Rate it yourself - /Services/opticians/LeaveReview/DefaultView.aspx?id=-60 5LC__000002_WC1H9NE,0,0,
PC Shah,OP_5K7_066__000002_EC1V2NE,OPT,152 City Road,,London,,,EC1V 2NP,Tel: 0207 253 1309, - ,,,No ratings yet Rate it yourself - /Services/opticians/LeaveReview/DefaultView.aspx?id=OP_5K7_066__000002_EC1V2NE,0,0,
Drury Porter Eyecare,OP_5K7_3022__000002_WC1N1AE,OPT,70 Brunswick Centre,Bloomsbury,London,Russell Square,,WC1N 1AE,Tel: 020 7837 3276, - ,,,No ratings yet Rate it yourself - /Services/opticians/LeaveReview/DefaultView.aspx?id=OP_5K7_3022__000002_WC1N1AE,0,0,
Essex Opticians,OP_5K8_4888__000002_N12SF,OPT,41 Essex Road,,London,,,N1 2SF,Tel: 020 7359 3816, - ,,,No ratings yet Rate it yourself - /Services/opticians/LeaveReview/DefaultView.aspx?id=OP_5K8_4888__000002_N12SF,0,0,
Hodd Barnes Dickins,OP_5K7_4265__000001_WC1V6LF,OPT,94 High Holborn,,London,,,WC1V 6LF,Tel: 020 7242 3492, - ,,,No ratings yet Rate it yourself - /Services/opticians/LeaveReview/DefaultView.aspx?id=OP_5K7_4265__000001_WC1V6LF,0,0,
Globe Opticians,OP_N17QP_30664,OPT,,100 Murray Grove,,London,,N1 7QP,Tel: 020 7253 6769, - ,,,No ratings yet Rate it yourself - /Services/opticians/LeaveReview/DefaultView.aspx?id=OP_N17QP_30664,0,0,
Vision Express,OP_EC4A2AX_30661,OPT,,108 Fleet St,,London,,EC4A 2AX,, - ,,,No ratings yet Rate it yourself - /Services/opticians/LeaveReview/DefaultView.aspx?id=OP_EC4A2AX_30661,0,0,
GREGORY SEELEY,OP_5C3_14465__000001_EC4Y1HT,OPT,63 Fleet Street,City,,London,,EC4Y 1HT,Tel: 020 7353 1408, - ,,,No ratings yet Rate it yourself - /Services/opticians/LeaveReview/DefaultView.aspx?id=OP_5C3_14465__000001_EC4Y1HT,0,0,
BOWINGS,OP_5C3_14477__000001_EC4Y1JU,OPT,58 Fleet Street,London,London,,,EC4Y 1JU,Tel: 020 7353 7801, - ,,,No ratings yet Rate it yourself - /Services/opticians/LeaveReview/DefaultView.aspx?id=OP_5C3_14477__000001_EC4Y1JU,0,0,
Boots-London - Cheapside,OP_5C3_14483__000001_EC26AT,OPT,Unit 7,12 Paternoster Square,Cheapside,London,,EC4M 7DX,Tel: 0207 248 2820, - ,,,2 ratings Rate it yourself - /Services/opticians/LeaveReview/DefaultView.aspx?id=OP_5C3_14483__000001_EC26AT,,,
EYELINK (SECOND SIGHT LTD),10024__000001_EC4V6DU,OPT,11 Ludgate,Broadgate,London,,,EC4V 6DU,Tel: 020 7329 4462, - ,,,No ratings yet Rate it yourself - /Services/opticians/LeaveReview/DefaultView.aspx?id=10024__000001_EC4V6DU,0,0,
Camden Eye Clinic,OP_5K7_5006__000001_NW11ES,OPT,24 Charlton Street,24 Charlton Street,London,London,,NW1 1JH,Tel: 020 7383 2931, - ,,,1 rating Rate it yourself - /Services/opticians/LeaveReview/DefaultView.aspx?id=OP_5K7_5006__000001_NW11ES,,,
Opticians2u,OPT_EC2A4NE_1,OPT,,86-90 Paul Street,,London,,EC2A 4NE,Tel: 0207 887 2268, - ,,,No ratings yet Rate it yourself - /Services/opticians/LeaveReview/DefaultView.aspx?id=OPT_EC2A4NE_1,0,0,
HODD BARNES & DICKENS,OP_5C3_14480__000001_EC2V5BT,OPT,11 Masons Avenue,,,London,,EC2V 5HR,Tel: 02076009861, - ,,,1 rating Rate it yourself - /Services/opticians/LeaveReview/DefaultView.aspx?id=OP_5C3_14480__000001_EC2V5BT,,,
DAVID CLULOW,OP_5C3_14487__000001_EC25TT,OPT,43 London Wall,,London,,,EC2M 5TF,Tel: 020 7638 8167, - ,,,No ratings yet Rate it yourself - /Services/opticians/LeaveReview/DefaultView.aspx?id=OP_5C3_14487__000001_EC25TT,0,0,
OPTIKA,OP_5C3_14519__000002_EC2V5BT,OPT,David Clulow,99 Cheapside,London,,,EC2V 5BT,Tel: 020 7638 9554, - ,,,No ratings yet Rate it yourself - /Services/opticians/LeaveReview/DefaultView.aspx?id=OP_5C3_14519__000002_EC2V5BT,0,0,
Boots-London Wall,OP_5C3_14463__000001_EC2Y5ET,OPT,160-161 Salisbury House,,London Wall,London,,EC2M 5QD,Tel: 0207 628 8721, - ,,,No ratings yet Rate it yourself - /Services/opticians/LeaveReview/DefaultView.aspx?id=OP_5C3_14463__000001_EC2Y5ET,0,0,
SPECSAVERS (MRS HANIF),10019__000001_EC2M5QD,OPT,165 - 166 London Wall,,London,,,EC2M 5QD,Tel: 020 7330 1130, - ,,,No ratings yet Rate it yourself - /Services/opticians/LeaveReview/DefaultView.aspx?id=10019__000001_EC2M5QD,0,0,
A View Opticians,OP_5K8__000001_N11RQ,OPT,203 Upper Street,,Islington,London,,N1 1RQ,Tel: 020 7359 6868, - ,,,7 ratings Rate it yourself - /Services/opticians/LeaveReview/DefaultView.aspx?id=OP_5K8__000001_N11RQ,,,
UNIVERSITY VISION LTD,OP_5C3_14489__000001_EC2R7NJ,OPT,1d Copthall Avenue,Angel Court,London,,,EC2R 7NJ,Tel: 020 7726 4979, - ,,,No ratings yet Rate it yourself - /Services/opticians/LeaveReview/DefaultView.aspx?id=OP_5C3_14489__000001_EC2R7NJ,0,0,
Optical Express,OP_5K7_5009__000002_WC2H8EL,OPT,219-229 Shaftesbury Avenue,,,London,,WC2H 8EL,Tel: 0800 023 2020, - ,,,No ratings yet Rate it yourself - /Services/opticians/LeaveReview/DefaultView.aspx?id=OP_5K7_5009__000002_WC2H8EL,0,0,
CITY EYES OPTICIANS,OP_5C3_14461__000001_EC2M5TU,OPT,"Suite 91, 3rd Floor",65 London Wall,,London,,EC2M 5TU,Tel: 020 7638 6192, - ,,,No ratings yet Rate it yourself - /Services/opticians/LeaveReview/DefaultView.aspx?id=OP_5C3_14461__000001_EC2M5TU,0,0,
Boots-London - Poultry,10015__000001_EC2R8EJ,OPT,,36 Poultry,,London,,EC2R 8AJ,Tel: 0207 600 0087, - ,,,No ratings yet Rate it yourself - /Services/opticians/LeaveReview/DefaultView.aspx?id=10015__000001_EC2R8EJ,0,0,
Store Street Opticians,TP8TM,OPT,,34 Store Street,,Camden,Greater London,WC1E 7BS,Tel: 020 7636 8925, - ,,,1 rating Rate it yourself - /Services/opticians/LeaveReview/DefaultView.aspx?id=TP8TM,,,
Obhrai & Son Ltd,OP_5LC_913__000001_WC2R1JA,OPT,146 Strand,,London,,,WC2R 1JA,Tel: 020 7379 5226, - ,,,No ratings yet Rate it yourself - /Services/opticians/LeaveReview/DefaultView.aspx?id=OP_5LC_913__000001_WC2R1JA,0,0,
David Clulow Opticians,OP_5LC_11207__000001_WC2E9JR,OPT,6 Neal Street,,London,,,WC2H 9LY,Tel: 020 7240 8284, - ,,,No ratings yet Rate it yourself - /Services/opticians/LeaveReview/DefaultView.aspx?id=OP_5LC_11207__000001_WC2E9JR,0,0,
Strand Specsavers Ltd ,OP_WC2R0AG_29378,OPT,,114 Strand,,London,,WC2R 0AG,Tel: 020 3077 4950, - ,,,6 ratings Rate it yourself - /Services/opticians/LeaveReview/DefaultView.aspx?id=OP_WC2R0AG_29378,,,
Boots-London - Tottenham Court Road,OP_5K7_5005__000001_W1T2BE,OPT,16-17 Tottenham Court Road,,,London,,W1T 1BE,Tel: 0207 580 6510, - ,,,No ratings yet Rate it yourself - /Services/opticians/LeaveReview/DefaultView.aspx?id=OP_5K7_5005__000001_W1T2BE,0,0,
HOXTON OPTICIANS,OP_5C3_14492__000001_N15LH,OPT,186 Hoxton Street,London,London,,,N1 5LH,Tel: 020 7613 1981, - ,,,1 rating Rate it yourself - /Services/opticians/LeaveReview/DefaultView.aspx?id=OP_5C3_14492__000001_N15LH,,,
Specsavers Opticians,OP_5K7_729__000002_W1P9DP,OPT,"Unit 6, 6-17 Tottenham Court Road",,London,,,W1T 1BG,Tel: 020 7580 5115, - ,,,1 rating Rate it yourself - /Services/opticians/LeaveReview/DefaultView.aspx?id=OP_5K7_729__000002_W1P9DP,,,
EYE CONTACT,OP_5C3_14495__000001_EC27PN,OPT,Unit 2,The Arcade,Liverpool Street,London,,EC2M 7PN,Tel: 020 7626 7232, - ,,,No ratings yet Rate it yourself - /Services/opticians/LeaveReview/DefaultView.aspx?id=OP_5C3_14495__000001_EC27PN,0,0,
i-Optix Eye Care,GOC-D-13328-0108-NW1 2HN,OPT,,96 Drummond Street,Euston,London,,NW1 2HN,Tel: 020 7388 1122, - ,,,No ratings yet Rate it yourself - /Services/opticians/LeaveReview/DefaultView.aspx?id=GOC-D-13328-0108-NW1 2HN,0,0,yes
OPTIX,OP_5C3_14494__000001_EC2,OPT,2 Exchange Arcade,Broadgate,London,,,EC2M 3WA,Tel: 020 7628 0330, - ,,,No ratings yet Rate it yourself - /Services/opticians/LeaveReview/DefaultView.aspx?id=OP_5C3_14494__000001_EC2,0,0,
Orb Optical,OP_W1T4RE_33984,OPT,,12a Tottenham Road,,London,,W1T 4RE,, - ,,,1 rating Rate it yourself - /Services/opticians/LeaveReview/DefaultView.aspx?id=OP_W1T4RE_33984,,,
Boots-London - Bishopsgate,OP_5C3_14475__000001_EC2M3UE,OPT,105-107 Bishopsgate,,,London,,EC2M 3UE,Tel: 020 7588 1840, - ,,,No ratings yet Rate it yourself - /Services/opticians/LeaveReview/DefaultView.aspx?id=OP_5C3_14475__000001_EC2M3UE,0,0,
Sight Care ,OP_5LC_1023__000001_W1D2DZ,OPT,45 Oxford Street,,London,,,W1D 2DZ,Tel: 020 7434 2385, - ,,,No ratings yet Rate it yourself - /Services/opticians/LeaveReview/DefaultView.aspx?id=OP_5LC_1023__000001_W1D2DZ,0,0,
David Clulow Cornhill,OP_EC3V3PD_30659,OPT,,59-60 Cornhill,,London,,EC3V 3PD,Tel: 020 7929 3403, - ,,,No ratings yet Rate it yourself - /Services/opticians/LeaveReview/DefaultView.aspx?id=OP_EC3V3PD_30659,0,0,
KITE Eyewear,OPT_E27DJ_1,OPT,KITE Eyewear,25 Redchurch Street,,London,,E2 7DJ,Tel: 02037287777, - ,,,1 rating Rate it yourself - /Services/opticians/LeaveReview/DefaultView.aspx?id=OPT_E27DJ_1,,,no
Otto Opticians,OP_5K8_10901__000001_N51RA,OPT,41 Holloway Road,Islington,London,Islington,,N7 8JP,Tel: 020 7700 7557, - ,,,No ratings yet Rate it yourself - /Services/opticians/LeaveReview/DefaultView.aspx?id=OP_5K8_10901__000001_N51RA,0,0,
Specsavers Opticians,OP_EC2M4LN_30666,OPT,,14 New Street,,London,,EC2M 4TR,Tel: 020 7377 4970, - ,,,No ratings yet Rate it yourself - /Services/opticians/LeaveReview/DefaultView.aspx?id=OP_EC2M4LN_30666,0,0,
The Eye Place,,OPT,,5 Charlotte Place,,Fitzrovia London,,W1T 1SF,Tel: 020 7583 1936, - ,,,N/A - Data not available,,,
Boots-London - Strand,OP_5LC_2028__000001_WC2R0QE,OPT,428 Strand,,,London,,WC2R 0QE,Tel: 0207 240 2049, - ,,,No ratings yet Rate it yourself - /Services/opticians/LeaveReview/DefaultView.aspx?id=OP_5LC_2028__000001_WC2R0QE,0,0,
Fisheye Optometrists Ltd,OP_5K8_793__000001_N78JZ,OPT,75 Holloway Road,,London,,,N7 8JZ,, - ,,,No ratings yet Rate it yourself - /Services/opticians/LeaveReview/DefaultView.aspx?id=OP_5K8_793__000001_N78JZ,0,0,
Eyecare Clinic,OP_5LC_8884__000001_WC2H7JS,OPT,19a Newport Court,,London,,,WC2H 7JS,Tel: 020 7734 3688, - ,,,No ratings yet Rate it yourself - /Services/opticians/LeaveReview/DefaultView.aspx?id=OP_5LC_8884__000001_WC2H7JS,0,0,
HAWKES & WAINER,OP_5C3_14468__000001_EC3V1LT,OPT,57 Leadenhall Market,London,,,,EC3V 1LT,Tel: 020 7623 7300, - ,,,No ratings yet Rate it yourself - /Services/opticians/LeaveReview/DefaultView.aspx?id=OP_5C3_14468__000001_EC3V1LT,0,0,
Optical Express,EC3M 1BU_11111,OPT,17 Eastcheap,,,London,,EC3M 1BU,Tel: 0800 023 2020, - ,,,230 ratings Rate it yourself - /Services/opticians/LeaveReview/DefaultView.aspx?id=EC3M 1BU_11111,,,
DCM OPTICIAL CLINIC PLC,OP_5C3_14476__000001_EC3M1JU,OPT,17 Eastcheap,,London,,,EC3M 1BU,Tel: 0800 783 5555, - ,,,No ratings yet Rate it yourself - /Services/opticians/LeaveReview/DefaultView.aspx?id=OP_5C3_14476__000001_EC3M1JU,0,0,
David Clulow Opticians,OP_5LC_9805__000001_W1V5PA,OPT,70 Old Compton Street,,London,,,W1D 4UL,Tel: 020 7437 4177, - ,,,No ratings yet Rate it yourself - /Services/opticians/LeaveReview/DefaultView.aspx?id=OP_5LC_9805__000001_W1V5PA,0,0,
Camden Contact Lens Centre,OP_5K7_7046__000002_NW10JH,OPT,32-36 Camden High Street,,London,,,NW1 0JH,Tel: 020 7383 3838, - ,,,No ratings yet Rate it yourself - /Services/opticians/LeaveReview/DefaultView.aspx?id=OP_5K7_7046__000002_NW10JH,0,0,
Zacks Eye Clinic,TP5H4,OPT,,30 Warren Street,,London,,W1T 5NF,Tel: 020 7713 7713, - ,,,No ratings yet Rate it yourself - /Services/opticians/LeaveReview/DefaultView.aspx?id=TP5H4,0,0,
EYEDIOLOGY OPTICIANS,EYEDIOLOGY OPTICIANS__000003_E16BD,OPT,Eyediology Opticians London,79 Commercial Street,Spitalfields Market,London,,E1 6BD,Tel: 020 7377 2020, - ,,,1 rating Rate it yourself - /Services/opticians/LeaveReview/DefaultView.aspx?id=EYEDIOLOGY OPTICIANS__000003_E16BD,,,
CHATOO & SONS,OP_5C3_14490__000001_EC3,OPT,50b Fenchurch Street,London,London,,,EC3M 3JY,Tel: 020 7283 0280, - ,,,No ratings yet Rate it yourself - /Services/opticians/LeaveReview/DefaultView.aspx?id=OP_5C3_14490__000001_EC3,0,0,
Leightons Opticians & Hearing Care,10014__000001_EC3A3DL,OPT,,79 Leadenhall Street,,London,Greater London,EC3A 3DL,Tel: 020 7283 4538, - ,,,No ratings yet Rate it yourself - /Services/opticians/LeaveReview/DefaultView.aspx?id=10014__000001_EC3A3DL,0,0,
J L Opticians,OP_5K7_4669__000001_NW17JL,OPT,69 Camden High Street,,,London,,NW1 7JL,Tel: 020 7388 5432, - ,,,No ratings yet Rate it yourself - /Services/opticians/LeaveReview/DefaultView.aspx?id=OP_5K7_4669__000001_NW17JL,0,0,
VISION CARE FOR HOMELESS PEOPLE,10065__000001_E16LT,OPT,Crisis Skylight,64 Commercial Street,London,LONDON,,E1 6LT,Tel: 020 7426 5650, - ,,,No ratings yet Rate it yourself - /Services/opticians/LeaveReview/DefaultView.aspx?id=10065__000001_E16LT,0,0,
PRAMUKH EYECARE,OP 5K7__000002_NW14BU,OPT,2 Chester Court,Camden,London,,,NW1 4BU,Tel: 0207 935 9304, - ,,,No ratings yet Rate it yourself - /Services/opticians/LeaveReview/DefaultView.aspx?id=OP 5K7__000002_NW14BU,0,0,
Boots,OP_5HL_325__000001_W1B 5RA,OPT,Boots Opticians,44-46 regent street London,,Piccadilly,,W1B 5RA,Tel: 020 7287 2261, - ,,,No ratings yet Rate it yourself - /Services/opticians/LeaveReview/DefaultView.aspx?id=OP_5HL_325__000001_W1B 5RA,0,0,
Specsavers Opticians,OP_5K7_6000__000001_NW50LU,OPT,126 Camden High Street,,,London,,NW1 0LU,Tel: 020 7482 4110, - ,,,No ratings yet Rate it yourself - /Services/opticians/LeaveReview/DefaultView.aspx?id=OP_5K7_6000__000001_NW50LU,0,0,
Washin Optical London,OP_5LC_2084__000001_W1R5PJ,OPT,14-20 Regent Street,,London,,,SW1Y 4PH,Tel: 020 7839 2091, - ,,,No ratings yet Rate it yourself - /Services/opticians/LeaveReview/DefaultView.aspx?id=OP_5LC_2084__000001_W1R5PJ,0,0,
Vision Express Opticians,OP_5LC_3710__000001_W1N9FA,OPT,263-265 Oxford Street,,London,,,W1C 2DF,Tel: 020 7409 7880, - ,,,1 rating Rate it yourself - /Services/opticians/LeaveReview/DefaultView.aspx?id=OP_5LC_3710__000001_W1N9FA,,,
Real Eyes Opticians,OP_5K8_10057__000002_N78DA,OPT,226 Holloway Road,,London,,,N7 8DA,Tel: 020 7607 8050, - ,,,No ratings yet Rate it yourself - /Services/opticians/LeaveReview/DefaultView.aspx?id=OP_5K8_10057__000002_N78DA,0,0,
Chakshu London,TP9AW,OPT,,97 Parkway,,London,,NW1 7PP,Tel: 0203 981 2907, - ,,,No ratings yet Rate it yourself - /Services/opticians/LeaveReview/DefaultView.aspx?id=TP9AW,0,0,
Optical Express,,OPT,,22 Harley Street,,London,,W1G 9AP,, - ,,,N/A - Data not available,,,
Optical Express,W1G 9AP_11111,OPT,22 Harley Street,,,London,,W1G 9AP,Tel: 0800 023 2020, - ,,,1 rating Rate it yourself - /Services/opticians/LeaveReview/DefaultView.aspx?id=W1G 9AP_11111,,,
S Squared Ltd,OP_5LD_12856__000001_SE17RG,OPT,33 Lower Marsh,Waterloo,London,,,SE1 7RG,Tel: 020 7633 0680, - ,,,No ratings yet Rate it yourself - /Services/opticians/LeaveReview/DefaultView.aspx?id=OP_5LD_12856__000001_SE17RG,0,0,
Visioncare Medical Eye Centre,OP_5LC_2285__000001_W1G8QY,OPT,77 Harley Street,,,London,,W1G 8QN,Tel: 020 7935 1400, - ,,,No ratings yet Rate it yourself - /Services/opticians/LeaveReview/DefaultView.aspx?id=OP_5LC_2285__000001_W1G8QY,0,0,
South London Resource Centre,OP_5LE_13045__000002_SE19RT,OPT,Department Of Ophthalmology,Guys Hospital,St Thomas Street,,,SE1 9RT,Tel: 020 7955 4307, - ,,,No ratings yet Rate it yourself - /Services/opticians/LeaveReview/DefaultView.aspx?id=OP_5LE_13045__000002_SE19RT,0,0,
G BLEETMAN OPTICIANS,OP_5C4_10235__000001_E26LG,OPT,347 Bethnal Green Road,,London,,,E2 6LG,Tel: 020 7739 2356, - ,,,2 ratings Rate it yourself - /Services/opticians/LeaveReview/DefaultView.aspx?id=OP_5C4_10235__000001_E26LG,,,
Boots-London - Wigmore St,OP_5LC_568__000001_W1U1PN,OPT,35 Wigmore Street,,,London,,W1U 1PW,Tel: 0207 580 4343, - ,,,No ratings yet Rate it yourself - /Services/opticians/LeaveReview/DefaultView.aspx?id=OP_5LC_568__000001_W1U1PN,0,0,
L K Leon Optician,OP_5LC_11271__000002_W1M7RL,OPT,29 New Cavendish Street,,London,,,W1G 9TU,Tel: 020 7486 9915, - ,,,No ratings yet Rate it yourself - /Services/opticians/LeaveReview/DefaultView.aspx?id=OP_5LC_11271__000002_W1M7RL,0,0,no
Eyecloud Opticians,TP8F5,OPT,,15 Kingsland High Street,Dalston,London,,E8 2JS,Tel: 020 7923 1852, - ,,,1 rating Rate it yourself - /Services/opticians/LeaveReview/DefaultView.aspx?id=TP8F5,,,
David Clulow Opticians,OP_5LC_503__000001_W1M9LE,OPT,41-43 Wigmore Street,,London,,,W1U 1PR,Tel: 020 7486 1485, - ,,,1 rating Rate it yourself - /Services/opticians/LeaveReview/DefaultView.aspx?id=OP_5LC_503__000001_W1M9LE,,,
Boots-London - Sedley Place,OLC016075LC__000001_W1C2JL,OPT,361 Oxford Street,,,London,,W1C 2JL,Tel: 0207 491 9644, - ,,,No ratings yet Rate it yourself - /Services/opticians/LeaveReview/DefaultView.aspx?id=OLC016075LC__000001_W1C2JL,0,0,
Hollands Of London,OLOTHER5LC__000001_W1G8UX,OPT,3 New Cavendish Street,,London,,,W1G 8UX,Tel: 020 7487 4267, - ,,,No ratings yet Rate it yourself - /Services/opticians/LeaveReview/DefaultView.aspx?id=OLOTHER5LC__000001_W1G8UX,0,0,
SPECSAVERS,OP_5C3_14488__000001_E8,OPT,Unit 18a,Kingsland Shopping Centre,,Dalston,,E8 2LX,Tel: 020 7254 7664, - ,,,2 ratings Rate it yourself - /Services/opticians/LeaveReview/DefaultView.aspx?id=OP_5C3_14488__000001_E8,,,
Mallon & Taub Optician,-1425LC__000001_W1U4QB,OPT,,63 Paddington Street,Marylebone,London,,W1U 4JF,Tel: 020 7935 8200, - ,,,1 rating Rate it yourself - /Services/opticians/LeaveReview/DefaultView.aspx?id=-1425LC__000001_W1U4QB,,,
Unger and Fagan Opticians,OP_5LC_13433__000001_W1H5PA,OPT,5 George Street,,Marylebone,London,,W1U 3QQ,Tel: 020 7486 6933, - ,,,No ratings yet Rate it yourself - /Services/opticians/LeaveReview/DefaultView.aspx?id=OP_5LC_13433__000001_W1H5PA,0,0,
In-Focus Opticians,P7W6U,OPT,431-433 Bethnal Green Road,431-433 Bethnal Green Road,London,London,,E2 0AN,Tel: 020 7613 3553, - ,,,No ratings yet Rate it yourself - /Services/opticians/LeaveReview/DefaultView.aspx?id=P7W6U,0,0,
SPECSAVERS (MR HALAI),10051__000003_E20AN,OPT,409-417 Bethnal Green Road,,London,,,E2 0AN,Tel: 020 7324 7520, - ,,,No ratings yet Rate it yourself - /Services/opticians/LeaveReview/DefaultView.aspx?id=10051__000003_E20AN,0,0,
"SACKWILD, MR L",OP_5C4_5384__000002_E11DB,OPT,237 Whitechapel Road,,London,,,E1 1DB,Tel: 020 7247 4442, - ,,,No ratings yet Rate it yourself - /Services/opticians/LeaveReview/DefaultView.aspx?id=OP_5C4_5384__000002_E11DB,0,0,
EYES ONLY OPTICIANS (MR LATORE),10022__000002_E82PB,OPT,87 Kingsland High Street,,London,,,E8 2PB,Tel: 020 7241 6567, - ,,,No ratings yet Rate it yourself - /Services/opticians/LeaveReview/DefaultView.aspx?id=10022__000002_E82PB,0,0,
Betterspecs Opticians,OP_5K7_8885__000002_NW52AE,OPT,210 Kentish Town Road,Camden,London,,,NW5 2AD,Tel: 020 7482 3859, - ,,,4 ratings Rate it yourself - /Services/opticians/LeaveReview/DefaultView.aspx?id=OP_5K7_8885__000002_NW52AE,,,
Paris Miki London Ltd,OP_5LC_5922__000001_W1R7HG,OPT,,Paris Miki London Ltd,19 Duke Street,London,,W1U 1DJ,Tel: 020 7935 1341, - ,,,No ratings yet Rate it yourself - /Services/opticians/LeaveReview/DefaultView.aspx?id=OP_5LC_5922__000001_W1R7HG,0,0,
Scrivens Opticians,OP_5K7_7423__000001_NW52JS,OPT,271 Kentish Town Road,271 Kentish Town Road,London,London,,NW5 2JS,Tel: 020 7485 2886, - ,,,46 ratings Rate it yourself - /Services/opticians/LeaveReview/DefaultView.aspx?id=OP_5K7_7423__000001_NW52JS,,,