Organisation Name,NACS Code,Organisation Type,Address1,Address2,Address3,Address4,Address5,PostCode,Telephone Number,Opening time,Value  (Opening time),Banding Classification  (Opening time),NHS.UK users rating,Value  (NHS.UK users rating),Banding Classification  (NHS.UK users rating),Car parking (Is there car parking at this organisation?)
Edmund Proctor & Associates,00000066__000002_DY102BX,OPT,Coppice Gate,Tanners Hill,Bewdley,Worcestershire,,DY12 2LP,Tel: 07701 281081, - ,,,No ratings yet Rate it yourself - /Services/opticians/LeaveReview/DefaultView.aspx?id=00000066__000002_DY102BX,0,0,
MC Perrigo,00000065__000002_DY122AW,OPT,71 Load Street,,Bewdley,Worcestershire,,DY12 2AW,Tel: 01299 403722, - ,,,No ratings yet Rate it yourself - /Services/opticians/LeaveReview/DefaultView.aspx?id=00000065__000002_DY122AW,0,0,
Cleobury Opticians,CO-5117,OPT,,16 Church Street,,Kidderminster,,DY14 8BX,, - ,,,No ratings yet Rate it yourself - /Services/opticians/LeaveReview/DefaultView.aspx?id=CO-5117,0,0,
Spectacle Wearhouse,OP_5DR_2669__000001_DY139EH,OPT,29 York Street,,Stourport-on-Severn,,,DY13 9EH,Tel: 01299 826688, - ,,,No ratings yet Rate it yourself - /Services/opticians/LeaveReview/DefaultView.aspx?id=OP_5DR_2669__000001_DY139EH,0,0,
Specsavers Opticians,5PL 00000__000001_DY139JW,OPT,45 The High Street,,Stourport On Severn,Worcestershire,,DY13 8BX,Tel: 01299 877999, - ,,,No ratings yet Rate it yourself - /Services/opticians/LeaveReview/DefaultView.aspx?id=5PL 00000__000001_DY139JW,0,0,
Specsavers Opticians,OP_5DR_12005__000001_DY138BL,OPT,45 High Street,Stourport-on-Severn,Worcestershire,,,DY13 8BX,Tel: 01299 877999, - ,,,No ratings yet Rate it yourself - /Services/opticians/LeaveReview/DefaultView.aspx?id=OP_5DR_12005__000001_DY138BL,0,0,
Seymour & Easlea Ltd.,(5DR)__000001_DY138DJ,OPT,2a High Street,,Stourport On Severn,Worcestershire,,DY13 8DJ,Tel: 01299 877171, - ,,,No ratings yet Rate it yourself - /Services/opticians/LeaveReview/DefaultView.aspx?id=(5DR)__000001_DY138DJ,0,0,
Blink Vision,TP80T,OPT,,201-203 Park Lane,,Kidderminster,,DY11 6TQ,Tel: 0000000000, - ,,,No ratings yet Rate it yourself - /Services/opticians/LeaveReview/DefaultView.aspx?id=TP80T,0,0,
Boots-Kidderminster,DY10 1AA_19172,OPT,,"Unit 15, Weavers Wharf Retail Park",,Kidderminster,Worcestershire,DY10 1AA,Tel: 01562 824474, - ,,,No ratings yet Rate it yourself - /Services/opticians/LeaveReview/DefaultView.aspx?id=DY10 1AA_19172,0,0,
The Factory Opticians,00000064__000001_DY101HJ,OPT,Dixon Street,,Kidderminster,Worcestershire,,DY10 1HJ,Tel: 01562 747087, - ,,,No ratings yet Rate it yourself - /Services/opticians/LeaveReview/DefaultView.aspx?id=00000064__000001_DY101HJ,0,0,
Clive G Stephens,OP_5DR_4342__000001_DY102AD,OPT,2 Church Street,,Kidderminster,,,DY10 2AD,Tel: 01562 822803, - ,,,No ratings yet Rate it yourself - /Services/opticians/LeaveReview/DefaultView.aspx?id=OP_5DR_4342__000001_DY102AD,0,0,
Chapman & Myers Opticians,OP_5DR_11705__000001_DY101EJ,OPT,,5 Vicar Street,Kidderminster,Worcestershire,,DY10 1DE,Tel: 01562 822276, - ,,,No ratings yet Rate it yourself - /Services/opticians/LeaveReview/DefaultView.aspx?id=OP_5DR_11705__000001_DY101EJ,0,0,
Vision Express Ltd,000000063__000001_DY102DQ,OPT,6 High Street,,Kidderminster,Worcestershire,,DY10 2DQ,Tel: 01562 824846, - ,,,No ratings yet Rate it yourself - /Services/opticians/LeaveReview/DefaultView.aspx?id=000000063__000001_DY102DQ,0,0,
P Crawford,OP_5DR_3243__000001_DY101BB,OPT,8 Oxford Street,,Kidderminster,,,DY10 1BB,Tel: 01562 822577, - ,,,No ratings yet Rate it yourself - /Services/opticians/LeaveReview/DefaultView.aspx?id=OP_5DR_3243__000001_DY101BB,0,0,
Specsavers Opticians,OP_5DR_9273__000002_DY102DG,OPT,2 Coventry Street,Swan Centre,Kidderminster,,,DY10 2DG,Tel: 01562 823 552, - ,,,No ratings yet Rate it yourself - /Services/opticians/LeaveReview/DefaultView.aspx?id=OP_5DR_9273__000002_DY102DG,0,0,
Eyecare Kidderminster Ltd,M2B9S,OPT,,"Unit 1 in Morrisons Supermarket, Green Street",,Kidderminster,,DY10 1AZ,, - ,,,No ratings yet Rate it yourself - /Services/opticians/LeaveReview/DefaultView.aspx?id=M2B9S,0,0,
Kinver Opticians,OP_5MN_1681__000001_DY76HE,OPT,51a High Street,Kinver,,Stourbridge,,DY7 6HE,Tel: 01384 872035, - ,,,No ratings yet Rate it yourself - /Services/opticians/LeaveReview/DefaultView.aspx?id=OP_5MN_1681__000001_DY76HE,0,0,
A C Jelley,OP_5MT_4555__000001_WR158BA,OPT,14 Teme Street,,Tenbury Wells,,,WR15 8BA,Tel: 01584 811445, - ,,,No ratings yet Rate it yourself - /Services/opticians/LeaveReview/DefaultView.aspx?id=OP_5MT_4555__000001_WR158BA,0,0,
Robinson & Sproson,OP_5DR_12006__000001_DY90NW,OPT,143 - 145 Worcester Road,Hagley,West Midlands,Hagley,,DY9 0NW,Tel: 01562 882444, - ,,,No ratings yet Rate it yourself - /Services/opticians/LeaveReview/DefaultView.aspx?id=OP_5DR_12006__000001_DY90NW,0,0,
Vivid Optical Ltd,06266214,OPT,,Faraday Drive,,"Bridgnorth, Shropshire",,WV15 5BA,, - ,,,No ratings yet Rate it yourself - /Services/opticians/LeaveReview/DefaultView.aspx?id=06266214,0,0,
J & S Bangay,OP_5HT_3598__000001_DY83QG,OPT,60 Bridgnorth Road,Wollaston,,Stourbridge,West Midlands,DY8 3QG,Tel: 01384 396585, - ,,,No ratings yet Rate it yourself - /Services/opticians/LeaveReview/DefaultView.aspx?id=OP_5HT_3598__000001_DY83QG,0,0,yes
Evenett Opticians Ltd,OP_5M2_8312__000001_WV164AW,OPT,3 Listley Street,,Bridgnorth,Shropshire,,WV16 4AW,Tel: 01746 763330, - ,,,No ratings yet Rate it yourself - /Services/opticians/LeaveReview/DefaultView.aspx?id=OP_5M2_8312__000001_WV164AW,0,0,
Trevor Phillips Opticians,OP_5M2_4743__000001_WV164EG,OPT,8 Waterloo Terrace,,Bridgnorth,Shropshire,,WV16 4EG,Tel: 01746 766227, - ,,,No ratings yet Rate it yourself - /Services/opticians/LeaveReview/DefaultView.aspx?id=OP_5M2_4743__000001_WV164EG,0,0,
Julian Hill Opticians,OP_5HT_4772__000002_DY81QU,OPT,108 Hagley Road,Oldswinford,Stourbridge,,,DY8 1QU,Tel: 01384 374 232, - ,,,No ratings yet Rate it yourself - /Services/opticians/LeaveReview/DefaultView.aspx?id=OP_5HT_4772__000002_DY81QU,0,0,
Hagley Eyecare Studio,201220160917,OPT,,Unit 42 The Old Woodyard,,Hagley,,DY9 9LQ,, - ,,,No ratings yet Rate it yourself - /Services/opticians/LeaveReview/DefaultView.aspx?id=201220160917,0,0,
Biddle + Liage Opticians,OP_5M2_790__000001_WV164QN,OPT,,59 High Street,,Bridgnorth,Shropshire,WV16 4DX,Tel: 01746 762895, - ,,,No ratings yet Rate it yourself - /Services/opticians/LeaveReview/DefaultView.aspx?id=OP_5M2_790__000001_WV164QN,0,0,
P W Optics Ltd,TP8NN,OPT,,Unit 2 Market Street,,Stourbridge,West Midlands,DY8 1YD,Tel: 01384 936020, - ,,,No ratings yet Rate it yourself - /Services/opticians/LeaveReview/DefaultView.aspx?id=TP8NN,0,0,yes
Robert Ellin Opticians,OP_5MT_4223__000002_WR98QS,OPT,41 Ombersley Street East,,Droitwich,,,WR9 8QS,Tel: 01905 773054, - ,,,No ratings yet Rate it yourself - /Services/opticians/LeaveReview/DefaultView.aspx?id=OP_5MT_4223__000002_WR98QS,0,0,
Eyewise Opticians,OP_5HT_4692__000001_DY81YD,OPT,,7 Market Street,Stourbridge,West Midlands,,DY8 1AB,Tel: 01384 395333, - ,,,No ratings yet Rate it yourself - /Services/opticians/LeaveReview/DefaultView.aspx?id=OP_5HT_4692__000001_DY81YD,0,0,
Bridgnorth Specsavers,OP5M2_3320__000001_WV164DX,OPT,60 High Street,,Bridgnorth,Shropshire,,WV16 4DB,Tel: 01746 713950, - ,,,No ratings yet Rate it yourself - /Services/opticians/LeaveReview/DefaultView.aspx?id=OP5M2_3320__000001_WV164DX,0,0,
Boots-Droitwich,OP_5MT_11993__000003_WR98HE,OPT,52 St Andrews Square,,,Droitwich,Worcestershire,WR9 8HE,Tel: 01905 774 661, - ,,,No ratings yet Rate it yourself - /Services/opticians/LeaveReview/DefaultView.aspx?id=OP_5MT_11993__000003_WR98HE,0,0,
Specsavers Opticians,00000067__000005_WR98HE,OPT,10 St.andrews Square,,Droitwich,Worcestershire,,WR9 8HE,Tel: 01905 790660, - ,,,No ratings yet Rate it yourself - /Services/opticians/LeaveReview/DefaultView.aspx?id=00000067__000005_WR98HE,0,0,
The Factory Opticians,000000061__000004_WR98HE,OPT,St.andrews Square,,Droitwich,Worcestershire,,WR9 8HE,Tel: 01905 795541, - ,,,No ratings yet Rate it yourself - /Services/opticians/LeaveReview/DefaultView.aspx?id=000000061__000004_WR98HE,0,0,
Boots-Stourbridge,OP_5HT_6791__000001_DY81DT,OPT,119 High Street,,,Stourbridge,West Midlands,DY8 1DT,Tel: 01384 440 594, - ,,,No ratings yet Rate it yourself - /Services/opticians/LeaveReview/DefaultView.aspx?id=OP_5HT_6791__000001_DY81DT,0,0,
Specsavers Opticians,OP_5HT_7393__000001_DY81DX,OPT,71 High Street,,Stourbridge,,,DY8 1DX,Tel: 01384 440464, - ,,,No ratings yet Rate it yourself - /Services/opticians/LeaveReview/DefaultView.aspx?id=OP_5HT_7393__000001_DY81DX,0,0,
Docker & Wilson Ltd,OP_5HT_3049__000001_DY81ED,OPT,84 High Street,,Stourbridge,,,DY8 1ED,Tel: 01384 394300, - ,,,No ratings yet Rate it yourself - /Services/opticians/LeaveReview/DefaultView.aspx?id=OP_5HT_3049__000001_DY81ED,0,0,
Special Look's Opticians,00299__000002_DY98LP,OPT,84a Pedmore Road,Lye,Stourbridge,West Midlands,,DY9 8LP,Tel: 01384 340 101, - ,,,No ratings yet Rate it yourself - /Services/opticians/LeaveReview/DefaultView.aspx?id=00299__000002_DY98LP,0,0,
Waller & Waller,OP_5MT_11085__000001_WR98DY,OPT,18 St. andrews Street,Droitwich,Worcestershire,,,WR9 8DY,Tel: 01905 772729, - ,,,No ratings yet Rate it yourself - /Services/opticians/LeaveReview/DefaultView.aspx?id=OP_5MT_11085__000001_WR98DY,0,0,
John Hamer Opticians,OP_5HT_3163__000002_DY85PD,OPT,11 Wordsley Green Shopping Centre,Wordsley Green,Stourbridge,,,DY8 5PD,Tel: 01384 401 201, - ,,,No ratings yet Rate it yourself - /Services/opticians/LeaveReview/DefaultView.aspx?id=OP_5HT_3163__000002_DY85PD,0,0,
Nic Sproson - The Optician,OP_5MT_8842__000001_WR11JA,OPT,52 Barbourne Road,,,Worcester,Worcestershire,WR1 1JA,Tel: 01905 27327, - ,,,No ratings yet Rate it yourself - /Services/opticians/LeaveReview/DefaultView.aspx?id=OP_5MT_8842__000001_WR11JA,0,0,
Pinder & Moore Optometrists,OP_5HT_448__000001_DY69LE,OPT,58 Market Street,Mill House,Kingswinford,West Midlands,,DY6 9LE,Tel: 01384 274426, - ,,,No ratings yet Rate it yourself - /Services/opticians/LeaveReview/DefaultView.aspx?id=OP_5HT_448__000001_DY69LE,0,0,
Krystal Vision,OP_5HT_14937__000001_DY69JU,OPT,34 Market Street,Kingswinford,West Midlands,,,DY6 9JU,Tel: 01384 271971, - ,,,No ratings yet Rate it yourself - /Services/opticians/LeaveReview/DefaultView.aspx?id=OP_5HT_14937__000001_DY69JU,0,0,
R A Lawley Ltd,OP_5HT_3004__000001_DY69JA,OPT,3-3a The Cross,Summer Hill,Kingswinford,,,DY6 9JA,Tel: 01384 271 888, - ,,,No ratings yet Rate it yourself - /Services/opticians/LeaveReview/DefaultView.aspx?id=OP_5HT_3004__000001_DY69JA,0,0,
The Eyecare Centre Ltd,OP_5HT_14936__000001_DY68AA,OPT,796 High Street,Kingswinford,West Midlands,,,DY6 8AA,Tel: 01384 292505, - ,,,No ratings yet Rate it yourself - /Services/opticians/LeaveReview/DefaultView.aspx?id=OP_5HT_14936__000001_DY68AA,0,0,
Special Look's Opticians,00292__000002_DY60JJ,OPT,52 Enville Road,,Wall Heath,West Midlands,,DY6 0JT,Tel: 01384 294617, - ,,,No ratings yet Rate it yourself - /Services/opticians/LeaveReview/DefaultView.aspx?id=00292__000002_DY60JJ,0,0,
Scrivens Opticians & Hearing Care,OP_5CN_5439__000001_HR74EB,OPT,,10 Broad Street,,Bromyard,Herefordshire,HR7 4BT,Tel: 01885 482492, - ,,,No ratings yet Rate it yourself - /Services/opticians/LeaveReview/DefaultView.aspx?id=OP_5CN_5439__000001_HR74EB,0,0,
Robert Hill Opticians,OP_5HT_8972__000001_DY98LB,OPT,39 High Street,Lye,,Stourbridge,West Midlands,DY9 8LF,Tel: 01384 422270, - ,,,No ratings yet Rate it yourself - /Services/opticians/LeaveReview/DefaultView.aspx?id=OP_5HT_8972__000001_DY98LB,0,0,
Sanjeev Singh Sanghera,5MX083,OPT,,39 High Street,Lye,Stourbridge,,DY9 8LF,Tel: 01384 422270, - ,,,No ratings yet Rate it yourself - /Services/opticians/LeaveReview/DefaultView.aspx?id=5MX083,0,0,
Vision Express (UK) Ltd,OP_5MT_12893__000001_WR13LE,OPT,1-2 Friary Walk,,Worcester,,,WR1 3LE,Tel: 01905 616699, - ,,,No ratings yet Rate it yourself - /Services/opticians/LeaveReview/DefaultView.aspx?id=OP_5MT_12893__000001_WR13LE,0,0,
Budgetspex Ltd,5M2149__000003_DY90NW,OPT,8 Baird House Second Avenue,Pensett Trading Estate,Kingswinford,West Midlands,,DY6 7YA,Tel: 0871 2503601, - ,,,No ratings yet Rate it yourself - /Services/opticians/LeaveReview/DefaultView.aspx?id=5M2149__000003_DY90NW,0,0,
Opticial Express,OP_12345_WR1 3LH,OPT,,6/9 Broad Street,,Worcester,,WR1 3LH,, - ,,,No ratings yet Rate it yourself - /Services/opticians/LeaveReview/DefaultView.aspx?id=OP_12345_WR1 3LH,0,0,
Specs Express,OP_5MT_8820__000001_WR12PS,OPT,10 St. Swithins Street,,Worcester,,,WR1 2PS,Tel: 01905 613037, - ,,,No ratings yet Rate it yourself - /Services/opticians/LeaveReview/DefaultView.aspx?id=OP_5MT_8820__000001_WR12PS,0,0,
Mr DK Stephens t/a Brauchli Opticians,0000000__000001_WR49RW,OPT,7 St Swithens Street,,Worcester,Worcestershire,,WR1 2PY,Tel: 01905 26193, - ,,,No ratings yet Rate it yourself - /Services/opticians/LeaveReview/DefaultView.aspx?id=0000000__000001_WR49RW,0,0,
Geoffrey Roberts,OP_5MT_14399__000001_WR25AJ,OPT,38 St Johns,,Worcester,Worcestershire,,WR2 5AJ,Tel: 01905 423217, - ,,,No ratings yet Rate it yourself - /Services/opticians/LeaveReview/DefaultView.aspx?id=OP_5MT_14399__000001_WR25AJ,0,0,
Boots-Worcester - High St (in Boots UK),OP_5MT_7617__000001_WR13LD,OPT,72-74 High Street,,,Worcester,Worcestershire,WR1 2EU,Tel: 01905 25613, - ,,,No ratings yet Rate it yourself - /Services/opticians/LeaveReview/DefaultView.aspx?id=OP_5MT_7617__000001_WR13LD,0,0,
Dominic Tunnell Opticians ,OP_5MT_3702__000001_WR12DH,OPT,6 Mealcheapen Street,6 Mealcheapen Street,Worcester,Worcester,,WR1 2DH,Tel: 01905 613020, - ,,,No ratings yet Rate it yourself - /Services/opticians/LeaveReview/DefaultView.aspx?id=OP_5MT_3702__000001_WR12DH,0,0,
Actons Opticians,OP_5MT_8086__000002_WR12DR,OPT,10 Cornmarket,,Worcester,,,WR1 2DR,Tel: 01905 22156, - ,,,No ratings yet Rate it yourself - /Services/opticians/LeaveReview/DefaultView.aspx?id=OP_5MT_8086__000002_WR12DR,0,0,
J S Edmunds,OP_5HT_7829__000001_DY53AU,OPT,101 High Street,,Brierley Hill,,,DY5 3AU,Tel: 01384 77025, - ,,,No ratings yet Rate it yourself - /Services/opticians/LeaveReview/DefaultView.aspx?id=OP_5HT_7829__000001_DY53AU,0,0,
Hamptons Optical Ltd.,00000052__000001_B618DJ,OPT,Crown House,11 Crown Close,Bromsgrove,Worcestershire,,B61 8DJ,, - ,,,No ratings yet Rate it yourself - /Services/opticians/LeaveReview/DefaultView.aspx?id=00000052__000001_B618DJ,0,0,
Pickford Opticians,OP_5HT_12084__000001_DY53BU,OPT,177 High Street,,Brierley Hill,,,DY5 3BU,Tel: 01384 77326, - ,,,No ratings yet Rate it yourself - /Services/opticians/LeaveReview/DefaultView.aspx?id=OP_5HT_12084__000001_DY53BU,0,0,
Specsavers Opticians,OP_5MT_2071__000001_WR13LY,OPT,Specsavers,9-13 Pump Street,,Worcester,Worcestershire,WR1 2QX,Tel: 01905 729 779, - ,,,No ratings yet Rate it yourself - /Services/opticians/LeaveReview/DefaultView.aspx?id=OP_5MT_2071__000001_WR13LY,0,0,
Stephen John Opticians,OP_5MT_7555__000001_WR12AQ,OPT,2 Charles Street,,,Worcester,Warwickshire,WR1 2AQ,Tel: 01905 745454, - ,,,No ratings yet Rate it yourself - /Services/opticians/LeaveReview/DefaultView.aspx?id=OP_5MT_7555__000001_WR12AQ,0,0,
Boots-Bromsgrove,OP_5MR_276__000002_B618EX,OPT,64 High Street,Bromsgrove,,Worcestershire,Worcestershire,B61 8EX,Tel: 01527 872 583, - ,,,No ratings yet Rate it yourself - /Services/opticians/LeaveReview/DefaultView.aspx?id=OP_5MR_276__000002_B618EX,0,0,
Eyecare Opticians Parkside,B61 0AZ,OPT,BHI Parkside Medical Centre,Stourbridge Road,,Bromsgrove,,B61 0AZ,Tel: 01527 888599, - ,,,No ratings yet Rate it yourself - /Services/opticians/LeaveReview/DefaultView.aspx?id=B61 0AZ,0,0,
Specsavers Opticians,OP_5MR_12187__000001_B618DD,OPT,131 High Street,Bromsgrove,Worcestershire,,,B61 8AE,Tel: 01527 579 815, - ,,,No ratings yet Rate it yourself - /Services/opticians/LeaveReview/DefaultView.aspx?id=OP_5MR_12187__000001_B618DD,0,0,
Chapman Opticians,OP_5MR_8077__000002_B618AQ,OPT,103 High Street,,Bromsgrove,,,B61 8AE,Tel: 01527 836290, - ,,,No ratings yet Rate it yourself - /Services/opticians/LeaveReview/DefaultView.aspx?id=OP_5MR_8077__000002_B618AQ,0,0,
Vision Express (UK) Ltd,OP_5HT_290__000003_DY51SY,OPT,Units U44-U45,The Merry Hill Centre,Brierley Hill,West Midlands,,DY5 1SY,Tel: 01384 481 616, - ,,,No ratings yet Rate it yourself - /Services/opticians/LeaveReview/DefaultView.aspx?id=OP_5HT_290__000003_DY51SY,0,0,
Ludlow Specsavers,OP5M2_147__000002_SY81AA,OPT,10 Bull Ring,,Ludlow,Shropshire,,SY8 1AD,Tel: 01584 871210, - ,,,No ratings yet Rate it yourself - /Services/opticians/LeaveReview/DefaultView.aspx?id=OP5M2_147__000002_SY81AA,0,0,
Vision Express,OP_5M2_9308__000001_SY81BS,OPT,,6-7 High Street,,Ludlow,Shropshire,SY8 1BS,Tel: 01584 872771, - ,,,No ratings yet Rate it yourself - /Services/opticians/LeaveReview/DefaultView.aspx?id=OP_5M2_9308__000001_SY81BS,0,0,
Peter Meredith Optometrist,OP5M268__000001_SY82PG,OPT,,9 Church Street,Ludlow,Shropshire,,SY8 1AP,Tel: 01584 876266, - ,,,No ratings yet Rate it yourself - /Services/opticians/LeaveReview/DefaultView.aspx?id=OP5M268__000001_SY82PG,0,0,
Boots Opticians and Hearing Care,OP_5HT_242__000002_DY51SY,OPT,The Merry Hill Centre,Brierley Hill,Dudley,West Midlands,,DY5 1QT,Tel: 01384 74817, - ,,,No ratings yet Rate it yourself - /Services/opticians/LeaveReview/DefaultView.aspx?id=OP_5HT_242__000002_DY51SY,0,0,
Optical Express,OP_5HT_1213__000001_DY51SS,OPT,U83,Upper Mall,Merry Hill Shopping Centre,Brierley Hill,West Midlands,DY5 1SS,Tel: 0800 023 2020, - ,,,No ratings yet Rate it yourself - /Services/opticians/LeaveReview/DefaultView.aspx?id=OP_5HT_1213__000001_DY51SS,0,0,
Boots-Brierley Hill - Merry Hill Centre (next to Boots UK),OP_5HT_2764__000001_DY51QX,OPT,Unit 66,Merry Hill Centre,,Brierley Hill,West Midlands,DY5 1QX,Tel: 01384 74817, - ,,,No ratings yet Rate it yourself - /Services/opticians/LeaveReview/DefaultView.aspx?id=OP_5HT_2764__000001_DY51QX,0,0,
Perrigo Opticians,OP_5MN_4235__000001_WV59JB,OPT,"The Willows, Maypole Street",Wombourne,Wolverhampton,,,WV5 9JB,Tel: 01902 893732, - ,,,No ratings yet Rate it yourself - /Services/opticians/LeaveReview/DefaultView.aspx?id=OP_5MN_4235__000001_WV59JB,0,0,
Taylor Biddle Opticians Wombourne,CO-3769,OPT,,34 Windmill Bank,,WOMBOURNE,,WV5 9JD,, - ,,,No ratings yet Rate it yourself - /Services/opticians/LeaveReview/DefaultView.aspx?id=CO-3769,0,0,
Eye Society,OP_5MH_10164__000002_B645HH,OPT,33 High Street,,Cradley Heath,,,B64 5HL,Tel: 01384 633336, - ,,,No ratings yet Rate it yourself - /Services/opticians/LeaveReview/DefaultView.aspx?id=OP_5MH_10164__000002_B645HH,0,0,
Arnold Opticians,OP_5MH_10243__000001_B645HG,OPT,17-18 High Street,,Cradley Heath,,,B64 5HG,Tel: 01384 561969, - ,,,No ratings yet Rate it yourself - /Services/opticians/LeaveReview/DefaultView.aspx?id=OP_5MH_10243__000001_B645HG,0,0,
DUDLEY WOOD OPTICIANS,OPT_DY20BH_1,OPT,,2 Bush Road,,Dudley,,DY2 0BH,Tel: 01384 412 600, - ,,,No ratings yet Rate it yourself - /Services/opticians/LeaveReview/DefaultView.aspx?id=OPT_DY20BH_1,0,0,
R Meredith,OP_5MH_7811__000001_B645HP,OPT,6 High Street,,Cradley Heath,,,B64 5HP,Tel: 01384 566 770, - ,,,No ratings yet Rate it yourself - /Services/opticians/LeaveReview/DefaultView.aspx?id=OP_5MH_7811__000001_B645HP,0,0,
The Eyecare Centre Ltd,OP_5HV_13510__000001_DY32UB,OPT,42 Louise Street,Gornal Wood,Dudley,West Midlands,,DY3 2UB,Tel: 01384 256 248, - ,,,No ratings yet Rate it yourself - /Services/opticians/LeaveReview/DefaultView.aspx?id=OP_5HV_13510__000001_DY32UB,0,0,
Scrivens Ltd,OP_5HT_5770__000001_B634AL,OPT,5 Hagley Mall,The Cornbow Centre,,Halesowen,,B63 4AL,Tel: 0121 501 1010, - ,,,No ratings yet Rate it yourself - /Services/opticians/LeaveReview/DefaultView.aspx?id=OP_5HT_5770__000001_B634AL,0,0,
Chapman & Myers Opticians,OP_5HT_437__000001_B634AB,OPT,14 Hagley Mall,The Cornbow Centre,,Halesowen,,B63 4AL,Tel: 0121 585 7065, - ,,,No ratings yet Rate it yourself - /Services/opticians/LeaveReview/DefaultView.aspx?id=OP_5HT_437__000001_B634AB,0,0,
Specsavers ,OP_5HT_14938__000002_B634AL,OPT,36 Hagley Mall,The Cornbow Centre,Halesowen,,,B63 4AL,Tel: 0121 504 4940, - ,,,No ratings yet Rate it yourself - /Services/opticians/LeaveReview/DefaultView.aspx?id=OP_5HT_14938__000002_B634AL,0,0,
Boots-Halesowen,OP_5HT_690__000001_B633AS,OPT,2 Hagley Street,Halesowen,,West Midlands,,B63 3AS,Tel: 0121 550 1610, - ,,,No ratings yet Rate it yourself - /Services/opticians/LeaveReview/DefaultView.aspx?id=OP_5HT_690__000001_B633AS,0,0,
Eye Society Opticians,OP_5HT_3430__000002_B633AW,OPT,,4 Peckingham Street,,Halesowen,West Midlands,B63 3AW,Tel: 0121 585 5347, - ,,,No ratings yet Rate it yourself - /Services/opticians/LeaveReview/DefaultView.aspx?id=OP_5HT_3430__000002_B633AW,0,0,
Specs-at-Home,OP5M267__000001_TF136LF,OPT,The Thatch Cottage,Shipton,Much Wenlock,Shropshire,,TF13 6LF,Tel: 01746 785141, - ,,,No ratings yet Rate it yourself - /Services/opticians/LeaveReview/DefaultView.aspx?id=OP5M267__000001_TF136LF,0,0,
David Wright Opticians,OP_5HV_3943__000001_DY29PS,OPT,88 Halesowen Road,Netherton,Dudley,West Midlands,,DY2 9PS,Tel: 01384 238084, - ,,,No ratings yet Rate it yourself - /Services/opticians/LeaveReview/DefaultView.aspx?id=OP_5HV_3943__000001_DY29PS,0,0,
D Wright,OP_5MH_3944__000001_B646HU,OPT,178 Halesowen Road,,Cradley Heath,,,B64 6HU,Tel: 01384 568622, - ,,,No ratings yet Rate it yourself - /Services/opticians/LeaveReview/DefaultView.aspx?id=OP_5MH_3944__000001_B646HU,0,0,
Troth Opticians,00000051__000003_B459JR,OPT,135 New Road,Rubery,Birmingham,,,B45 9JR,Tel: 0121 453 2146, - ,,,No ratings yet Rate it yourself - /Services/opticians/LeaveReview/DefaultView.aspx?id=00000051__000003_B459JR,0,0,
Williams Optometrists,OP_5MR_9056__000002_B459JW,OPT,161 New Road,Rubery,Birmingham,,,B45 9JW,Tel: 0121 453 2581, - ,,,No ratings yet Rate it yourself - /Services/opticians/LeaveReview/DefaultView.aspx?id=OP_5MR_9056__000002_B459JW,0,0,
Spex4U Limited,OL5PL01__000005_B459JA,OPT,174 New Road,Rubery,,Birmingham,Worcestershire,B45 9JA,Tel: 0121 453 7179, - ,,,No ratings yet Rate it yourself - /Services/opticians/LeaveReview/DefaultView.aspx?id=OL5PL01__000005_B459JA,0,0,
Taylor Made Specs,OP_DY32DA_34272,OPT,,"6 The Arcade, Kent Street",,Upper Gornal,,DY3 2DA,Tel: 01902 664783, - ,,,No ratings yet Rate it yourself - /Services/opticians/LeaveReview/DefaultView.aspx?id=OP_DY32DA_34272,0,0,
Eye Health Clinic,01-23489,OPT,,168 High Street (corner of stafford street),,Dudley,,DY1 1QD,Tel: 01384 936438, - ,,,No ratings yet Rate it yourself - /Services/opticians/LeaveReview/DefaultView.aspx?id=01-23489,0,0,yes
Bonham & Butler Opticians ,OP_5HV_13508__000001_DY11ED,OPT,216 Wolverhampton Street,,Dudley,West Midlands,,DY1 1ED,Tel: 01384 253696, - ,,,No ratings yet Rate it yourself - /Services/opticians/LeaveReview/DefaultView.aspx?id=OP_5HV_13508__000001_DY11ED,0,0,
Dollond & Aitchison,OP_5HV_3000__000002_DY11PD,OPT,219 High Street,Dudley,West Midlands,,,DY1 1PD,Tel: 01384 253859, - ,,,No ratings yet Rate it yourself - /Services/opticians/LeaveReview/DefaultView.aspx?id=OP_5HV_3000__000002_DY11PD,0,0,
4 Sight,OP_5HV_5402__000001_DY27BL,OPT,15 Churchill Shopping Centre,,Dudley,,,DY2 7BL,Tel: 01384 242444, - ,,,No ratings yet Rate it yourself - /Services/opticians/LeaveReview/DefaultView.aspx?id=OP_5HV_5402__000001_DY27BL,0,0,
Specsavers Opticians,OP_5HV_8264__000001_DY11LF,OPT,13 Castle Street,,Dudley,,,DY1 1LF,Tel: 01384 214 851, - ,,,No ratings yet Rate it yourself - /Services/opticians/LeaveReview/DefaultView.aspx?id=OP_5HV_8264__000001_DY11LF,0,0,
A.J. Moore,OP_5HV_13509__000001_DY11LQ,OPT,"264, Castle Street",,Dudley,West Midlands,,DY1 1LQ,Tel: 01384 252903, - ,,,No ratings yet Rate it yourself - /Services/opticians/LeaveReview/DefaultView.aspx?id=OP_5HV_13509__000001_DY11LQ,0,0,