Organisation Name,NACS Code,Organisation Type,Address1,Address2,Address3,Address4,Address5,PostCode,Telephone Number,Opening time,Value  (Opening time),Banding Classification  (Opening time),NHS.UK users rating,Value  (NHS.UK users rating),Banding Classification  (NHS.UK users rating),Car parking (Is there car parking at this organisation?)
Matheson Optometrists,OP_5DF_14849__000001_GU345HG,OPT,47 Winchester Road,Four Marks,Alton,,,GU34 5HG,Tel: 01420 560082, - ,,,No ratings yet Rate it yourself - /Services/opticians/LeaveReview/DefaultView.aspx?id=OP_5DF_14849__000001_GU345HG,0,0,
Morgan-Owen & Coates Optometrist,OP_5FD_9132__000001_GU323EL,OPT,37 Lavant Street,,Petersfield,Hampshire,,GU32 3EL,Tel: 01730 264258, - ,,,No ratings yet Rate it yourself - /Services/opticians/LeaveReview/DefaultView.aspx?id=OP_5FD_9132__000001_GU323EL,0,0,
Owen Leigh Optometry,OP_5FD_14836__000001_GU323LA,OPT,28 The Spain,,Petersfield,Hampshire,,GU32 3LA,Tel: 01730 710174, - ,,,No ratings yet Rate it yourself - /Services/opticians/LeaveReview/DefaultView.aspx?id=OP_5FD_14836__000001_GU323LA,0,0,
A Matheson,GU32 3DT__000001_GU323DT,OPT,17 Chapel Street,,Petersfield,Hants,,GU32 3DT,Tel: 01730 261442, - ,,,No ratings yet Rate it yourself - /Services/opticians/LeaveReview/DefaultView.aspx?id=GU32 3DT__000001_GU323DT,0,0,
Matheson Optometrists,OP_5E9_572__000001_SO249AG,OPT,1-3 West Street,,,Alresford,,SO24 9AG,Tel: 01962 732336, - ,,,2 ratings Rate it yourself - /Services/opticians/LeaveReview/DefaultView.aspx?id=OP_5E9_572__000001_SO249AG,,,
Specsavers Opticians,OP_GU323HJ_46229,OPT,Specsavers Opticians,3-4 The Square,,Petersfield,Hampshire,GU32 3HJ,Tel: 01730 710820, - ,,,No ratings yet Rate it yourself - /Services/opticians/LeaveReview/DefaultView.aspx?id=OP_GU323HJ_46229,0,0,
Rawlings Opticians,OP_5E9_6187__000001_SO249AT,OPT,Bay Tree House,26 West Street,Alresford,Hampshire,,SO24 9AT,Tel: 01962 733269, - ,,,2 ratings Rate it yourself - /Services/opticians/LeaveReview/DefaultView.aspx?id=OP_5E9_6187__000001_SO249AT,,,
Vision Express,GU32 3JA__000001_GU323JA,OPT,,14 Rams Walk,,Petersfield,Hampshire,GU32 3JA,Tel: 01730 235 977, - ,,,No ratings yet Rate it yourself - /Services/opticians/LeaveReview/DefaultView.aspx?id=GU32 3JA__000001_GU323JA,0,0,
Richard C. Arnold Optometrists,OP_5FD_10298__000001_GU323JU,OPT,3-4 Exchange Building,High Street,,Petersfield,,GU32 3JU,Tel: 01730 263302, - ,,,No ratings yet Rate it yourself - /Services/opticians/LeaveReview/DefaultView.aspx?id=OP_5FD_10298__000001_GU323JU,0,0,
Helen Hill ,OP_5FD_8448__000001_PO80JS,OPT,39 Drift Road,Clanfield,Waterlooville,,,PO8 0JS,Tel: 023 9257 1028, - ,,,No ratings yet Rate it yourself - /Services/opticians/LeaveReview/DefaultView.aspx?id=OP_5FD_8448__000001_PO80JS,0,0,
Leightons Opticians & Hearing Care,OP_5DF_1179__000001_GU341EN,OPT,,90 High Street,,Alton,Hampshire,GU34 1EN,Tel: 01420 83070, - ,,,No ratings yet Rate it yourself - /Services/opticians/LeaveReview/DefaultView.aspx?id=OP_5DF_1179__000001_GU341EN,0,0,
Specsavers Alton,564738__000002_GU341AW,OPT,,58 High Street,,Alton,,GU34 1ET,Tel: 01420 593600, - ,,,No ratings yet Rate it yourself - /Services/opticians/LeaveReview/DefaultView.aspx?id=564738__000002_GU341AW,0,0,
Alton Eyecare,GU34 1HA__000001_GU341HA,OPT,23 Market Street,,Alton,Hants,,GU34 1HA,Tel: 01420 542363, - ,,,No ratings yet Rate it yourself - /Services/opticians/LeaveReview/DefaultView.aspx?id=GU34 1HA__000001_GU341HA,0,0,
Rawlings Opticians,OP_5DF_4855__000001_GU341AW,OPT,36 High Street,,Alton,Hampshire,,GU34 1BD,Tel: 01420 84230, - ,,,No ratings yet Rate it yourself - /Services/opticians/LeaveReview/DefaultView.aspx?id=OP_5DF_4855__000001_GU341AW,0,0,
Boots Opticians,OPT_GU341BN_1,OPT,,30 High Street,,Hampshire,,GU34 1BN,Tel: 0142084396, - ,,,No ratings yet Rate it yourself - /Services/opticians/LeaveReview/DefaultView.aspx?id=OPT_GU341BN_1,0,0,
Southcoast Opticians,OP_5FD_7643__000001_PO80BT,OPT,31 Highcroft Industrial Estate,Enterprise Road,Horndean,Waterlooville,Hampshire,PO8 0BT,Tel: 023 9259 9411, - ,,,No ratings yet Rate it yourself - /Services/opticians/LeaveReview/DefaultView.aspx?id=OP_5FD_7643__000001_PO80BT,0,0,
Ashleigh Sight Care,OP_5E9_14316__000003_SO321AB,OPT,,3 High Street,,Bishops Waltham,Hampshire,SO32 1AB,Tel: 01489 891182, - ,,,No ratings yet Rate it yourself - /Services/opticians/LeaveReview/DefaultView.aspx?id=OP_5E9_14316__000003_SO321AB,0,0,yes
Saxby's,OP_5E9_6269__000001_SO321AR,OPT,Saxby's,2 Houchin Street,Bishops Waltham,Southampton,,SO32 1AR,Tel: 01489 896330, - ,,,No ratings yet Rate it yourself - /Services/opticians/LeaveReview/DefaultView.aspx?id=OP_5E9_6269__000001_SO321AR,0,0,
Denmead Eyecare,OP_5FD_7293__000002_PO76NU,OPT,Hambledon Road,Denmead,Waterlooville,Denmead,,PO7 6NU,Tel: 023 9226 6536, - ,,,No ratings yet Rate it yourself - /Services/opticians/LeaveReview/DefaultView.aspx?id=OP_5FD_7293__000002_PO76NU,0,0,
Chandlers Opticians,OP_5DF_866__000002_GU350TN,OPT,5 Forest Centre,,Bordon,,,GU35 0TN,Tel: 01420 477444, - ,,,No ratings yet Rate it yourself - /Services/opticians/LeaveReview/DefaultView.aspx?id=OP_5DF_866__000002_GU350TN,0,0,
Richard C Arnold Optometrists,OP_5FD_3135__000002_PO88UJ,OPT,69 London Road,Cowplain,Waterlooville,,,PO8 8UJ,Tel: 023 9225 0641, - ,,,No ratings yet Rate it yourself - /Services/opticians/LeaveReview/DefaultView.aspx?id=OP_5FD_3135__000002_PO88UJ,0,0,
Bliinx Eyecare Studios,GU35 9LU__000001_GU359LU,OPT,Ganders Business Park,Kingsley,Bordon,Hampshire,,GU35 9LU,Tel: 01420 478899, - ,,,No ratings yet Rate it yourself - /Services/opticians/LeaveReview/DefaultView.aspx?id=GU35 9LU__000001_GU359LU,0,0,
Tesco Opticians,OP_SO237RS_29727,OPT,,Easton Lane,,Winchester,Hampshire,SO23 7RS,Tel: 0845 601 3479, - ,,,No ratings yet Rate it yourself - /Services/opticians/LeaveReview/DefaultView.aspx?id=OP_SO237RS_29727,0,0,
Liphook Eyecare,OP_5DF_7292__000001_GU307DW,OPT,Liphook Eye Care,31 Station Road,Liphook,Hampshire,,GU30 7DW,Tel: 01428 725158, - ,,,No ratings yet Rate it yourself - /Services/opticians/LeaveReview/DefaultView.aspx?id=OP_5DF_7292__000001_GU307DW,0,0,
Scrivens Opticians,OP_5FD_11109__000001_PO77HG,OPT,29 Wellington Way,,,Waterlooville,Hampshire,PO7 7ED,Tel: 023 9226 2054, - ,,,No ratings yet Rate it yourself - /Services/opticians/LeaveReview/DefaultView.aspx?id=OP_5FD_11109__000001_PO77HG,0,0,
Specsavers,OP_5FD_14838__000001_PO77DU,OPT,310 London Road,,Waterlooville,Hampshire,,PO7 7DU,Tel: 023 9225 9073, - ,,,No ratings yet Rate it yourself - /Services/opticians/LeaveReview/DefaultView.aspx?id=OP_5FD_14838__000001_PO77DU,0,0,
Boots-Winchester - High St,OP_5E9_1446__000001_SO239AY,OPT,144 High Street,,Winchester,Winchester,Hampshire,SO23 9AY,Tel: 01962 854553, - ,,,No ratings yet Rate it yourself - /Services/opticians/LeaveReview/DefaultView.aspx?id=OP_5E9_1446__000001_SO239AY,0,0,
Large & Large Opticians,OP_5FD_3002__000001_PO77HE,OPT,8 Clock House,,Waterlooville,,,PO7 7HE,Tel: 023 9226 2971, - ,,,No ratings yet Rate it yourself - /Services/opticians/LeaveReview/DefaultView.aspx?id=OP_5FD_3002__000001_PO77HE,0,0,
Specsavers,OP_5E9_643__000001_SO238AF,OPT,The Brooks Centre,,Winchester,Hampshire,,SO23 8QY,Tel: 01962 844833, - ,,,1 rating Rate it yourself - /Services/opticians/LeaveReview/DefaultView.aspx?id=OP_5E9_643__000001_SO238AF,,,
Leightons Opticians & Hearing Care,OP_5E9_158__000001_SO238AH,OPT,,67 St. Georges Street,,Winchester,Hampshire,SO23 8AH,Tel: 01962 852961, - ,,,No ratings yet Rate it yourself - /Services/opticians/LeaveReview/DefaultView.aspx?id=OP_5E9_158__000001_SO238AH,0,0,
Jonathan C Hobbs Opticians,OP_5FD_5687__000002_PO77EX,OPT,63/65 London Road,,Waterlooville,,,PO7 7EX,Tel: 023 9225 4131, - ,,,No ratings yet Rate it yourself - /Services/opticians/LeaveReview/DefaultView.aspx?id=OP_5FD_5687__000002_PO77EX,0,0,
Sue Wassall Optometrist,OP_5E9_3716__000001_PO175JW,OPT,"Knights Chambers, The Square",Wickham,Fareham,,,PO17 5JW,Tel: 01329 832706, - ,,,No ratings yet Rate it yourself - /Services/opticians/LeaveReview/DefaultView.aspx?id=OP_5E9_3716__000001_PO175JW,0,0,
Vision Express,OP_5E9_2258__000002_SO239BL,OPT,,40 High Street,,Winchester,Hampshire,SO23 9BL,Tel: 01962 856850, - ,,,No ratings yet Rate it yourself - /Services/opticians/LeaveReview/DefaultView.aspx?id=OP_5E9_2258__000002_SO239BL,0,0,
Specsavers Opticians,OPT_SO239AH_1,OPT,,106a High Street,,Winchester,,SO23 9AH,, - ,,,No ratings yet Rate it yourself - /Services/opticians/LeaveReview/DefaultView.aspx?id=OPT_SO239AH_1,0,0,
Rawlings Opticians,OP_5E9_615__000003_SO239BX,OPT,60-61 High Street,,Winchester,Hampshire,,SO23 9BX,Tel: 01962 853082, - ,,,1 rating Rate it yourself - /Services/opticians/LeaveReview/DefaultView.aspx?id=OP_5E9_615__000003_SO239BX,,,
Eyesite Opticians,OP_5E9_12451__000001_SO239BX,OPT,Southgate Corner,65 High Street,,Winchester,Hampshire,SO23 9BX,Tel: 01962 864446, - ,,,No ratings yet Rate it yourself - /Services/opticians/LeaveReview/DefaultView.aspx?id=OP_5E9_12451__000001_SO239BX,0,0,
Peter Collins Opticians,OPT_PO77DJ_1,OPT,,"6 The Precinct, London Road",,Waterlooville,,PO7 7DJ,, - ,,,No ratings yet Rate it yourself - /Services/opticians/LeaveReview/DefaultView.aspx?id=OPT_PO77DJ_1,0,0,
Matheson Optometrists,PO7 5LJ__000002_PO75LJ,OPT,20 London Road,Purbrook,Waterlooville,Hampshire,,PO7 5LJ,Tel: 02392 250605, - ,,,No ratings yet Rate it yourself - /Services/opticians/LeaveReview/DefaultView.aspx?id=PO7 5LJ__000002_PO75LJ,0,0,
Jonathan C Hobbs Opticians,OP_5FD_8446__000002_PO95AL,OPT,4 Grewell Road,Leigh Park,Havant,,,PO9 5AL,Tel: 023 9247 5844, - ,,,No ratings yet Rate it yourself - /Services/opticians/LeaveReview/DefaultView.aspx?id=OP_5FD_8446__000002_PO95AL,0,0,
ASDA Opticians,OP_5FD_14834__000001_PO93QW,OPT,Larchwood Avenue,Bedhampton,Havant,Hampshire,,PO9 3QW,Tel: 02392 445800, - ,,,1 rating Rate it yourself - /Services/opticians/LeaveReview/DefaultView.aspx?id=OP_5FD_14834__000001_PO93QW,,,
Rex Wingate & Partners,OP_5FE_4799__000002_PO64HG,OPT,177 Allaway Avenue,,Portsmouth,,,PO6 4HG,Tel: 023 9264 1222, - ,,,No ratings yet Rate it yourself - /Services/opticians/LeaveReview/DefaultView.aspx?id=OP_5FE_4799__000002_PO64HG,0,0,
Scrivens Opticians,OP_5FD_11108__000002_PO91PG,OPT,3 West Street,,,Havant,Hampshire,PO9 1UN,Tel: 023 9248 3445, - ,,,1 rating Rate it yourself - /Services/opticians/LeaveReview/DefaultView.aspx?id=OP_5FD_11108__000002_PO91PG,,,
Forrest Optometrists,OP_5FE_8799__000001_PO62AA,OPT,145 Havant Road,145 Havant Road,Portsmouth,Drayton,,PO6 2AA,Tel: 023 9237 6883, - ,,,No ratings yet Rate it yourself - /Services/opticians/LeaveReview/DefaultView.aspx?id=OP_5FE_8799__000001_PO62AA,0,0,
Specsavers,OP_5FD_8859__000003_PO91PG,OPT,36-38 West Street,,Havant,,,PO9 1PG,Tel: 023 9249 8490, - ,,,No ratings yet Rate it yourself - /Services/opticians/LeaveReview/DefaultView.aspx?id=OP_5FD_8859__000003_PO91PG,0,0,
Boots Opticians,OPT_PO91US_1,OPT,,Unit 43 Meridian Shopping Centre,,Havant,,PO9 1UW,Tel: 0239 2481464, - ,,,1 rating Rate it yourself - /Services/opticians/LeaveReview/DefaultView.aspx?id=OPT_PO91US_1,,,
Rex Wingate & Partners,OP_5FD_8208__000001_PO91PR,OPT,26 North Street,,Havant,,,PO9 1PR,Tel: 023 9248 4184, - ,,,No ratings yet Rate it yourself - /Services/opticians/LeaveReview/DefaultView.aspx?id=OP_5FD_8208__000001_PO91PR,0,0,
Specsavers,PO6 3AG__000005_PO63AG,OPT,46a High Street,Cosham,,Portsmouth,,PO6 3AG,Tel: 023 9220 5110, - ,,,No ratings yet Rate it yourself - /Services/opticians/LeaveReview/DefaultView.aspx?id=PO6 3AG__000005_PO63AG,0,0,
Specsavers Limited,OPT_PO157PD_1,OPT,,Unit 4G Whiteley Shopping Centre,,Fareham,,PO15 7PD,, - ,,,No ratings yet Rate it yourself - /Services/opticians/LeaveReview/DefaultView.aspx?id=OPT_PO157PD_1,0,0,
Tesco Opticians,PO6 4SR__000002_PO64SR,OPT,,Clement Atlee Way,,Portsmouth,Hampshire,PO6 4SR,Tel: 0845 601 3479, - ,,,No ratings yet Rate it yourself - /Services/opticians/LeaveReview/DefaultView.aspx?id=PO6 4SR__000002_PO64SR,0,0,
Tesco Opticians,OP_PO91TR_29726,OPT,,Solent Road,,Havant,Hampshire,PO9 1TR,Tel: 0845 601 3479, - ,,,No ratings yet Rate it yourself - /Services/opticians/LeaveReview/DefaultView.aspx?id=OP_PO91TR_29726,0,0,
Cameron Davies Opticians,OP_5LX_12387__000001_PO169UN,OPT,50 West Street,Portchester,Fareham,,,PO16 9UN,Tel: 023 9237 3015, - ,,,No ratings yet Rate it yourself - /Services/opticians/LeaveReview/DefaultView.aspx?id=OP_5LX_12387__000001_PO169UN,0,0,
Specsavers Opticians,,OPT,Sainsburys,Tollbar Way,Hedge End,Southampton,Hampshire,SO30 2UH,Tel: 01489 232 234, - ,,,N/A - Data not available,,,
M&S Opticians - Hedge End,H8W0C,OPT,,"Toll Bar Way, Hedge End",,Southampton,Hampshire,SO30 2UH,Tel: 01322 918085, - ,,,3 ratings Rate it yourself - /Services/opticians/LeaveReview/DefaultView.aspx?id=H8W0C,,,
Vision Express,OP_SO505RH_30046,OPT,,25 Market Street,,Eastleigh,Hampshire,SO50 5RH,Tel: 02380 650640, - ,,,No ratings yet Rate it yourself - /Services/opticians/LeaveReview/DefaultView.aspx?id=OP_SO505RH_30046,0,0,
Specsavers,OPT_SO505RG_1,OPT,,35-37 Market Street,,Eastleigh,Hampshire,SO50 5RG,Tel: 02380 620011, - ,,,1 rating Rate it yourself - /Services/opticians/LeaveReview/DefaultView.aspx?id=OPT_SO505RG_1,,,
Matheson Optometrists,OP_5DF_1789__000002_GU266HF,OPT,3-4 Victoria Terraces,"Crossways Road, Grayshott",Hindhead,,,GU26 6HJ,Tel: 01428 606069, - ,,,No ratings yet Rate it yourself - /Services/opticians/LeaveReview/DefaultView.aspx?id=OP_5DF_1789__000002_GU266HF,0,0,
Zaman Opticians Limited,OPT_GU266HJ_1,OPT,,"Edinburgh House,",Crossways Road,Grayshott,Surrey,GU26 6HJ,Tel: 01428 609707, - ,,,1 rating Rate it yourself - /Services/opticians/LeaveReview/DefaultView.aspx?id=OPT_GU266HJ_1,,,
Specsavers,TP97X,OPT,,"Sainsburys, Fitzherbert Road, Farlington,",,Portsmouth,,PO6 1RR,, - ,,,No ratings yet Rate it yourself - /Services/opticians/LeaveReview/DefaultView.aspx?id=TP97X,0,0,
Scrivens Opticians & Hearing Care,OP_5LY_14852__000001_SO304FQ,OPT,7 Lower Northam Road,Hedge End,,Southampton,Hampshire,SO30 4FN,Tel: 01489 782131, - ,,,No ratings yet Rate it yourself - /Services/opticians/LeaveReview/DefaultView.aspx?id=OP_5LY_14852__000001_SO304FQ,0,0,
Boots Opticians,OPT_SO505SF_1,OPT,,48 Swan Centre,,Eastleigh,,SO50 5SF,, - ,,,1 rating Rate it yourself - /Services/opticians/LeaveReview/DefaultView.aspx?id=OPT_SO505SF_1,,,
Rawlings Opticians,OP_5LY_14853__000002_SO304QU,OPT,10 St. Johns Centre,Hedge End,,Southampton,,SO30 4QU,Tel: 01489 788665, - ,,,No ratings yet Rate it yourself - /Services/opticians/LeaveReview/DefaultView.aspx?id=OP_5LY_14853__000002_SO304QU,0,0,
Direct Spex Ltd,PO16 0BG__000002_PO160BG,OPT,3 West Street,,Fareham,Hants,,PO16 0BG,Tel: 01329 285550, - ,,,No ratings yet Rate it yourself - /Services/opticians/LeaveReview/DefaultView.aspx?id=PO16 0BG__000002_PO160BG,0,0,
Boots-Fareham - Westbury Mall,OP_5LX_9627__000002_PO160PE,OPT,21 Westbury Mall,,,Fareham Shopping Centre,Hampshire,PO16 0PE,Tel: 01329 221822, - ,,,1 rating Rate it yourself - /Services/opticians/LeaveReview/DefaultView.aspx?id=OP_5LX_9627__000002_PO160PE,,,
Specsavers,OP_5LX_12694__000001_PO160BA,OPT,37 West Street,,Fareham,Hampshire,,PO16 0BA,Tel: 01329 826126, - ,,,No ratings yet Rate it yourself - /Services/opticians/LeaveReview/DefaultView.aspx?id=OP_5LX_12694__000001_PO160BA,0,0,
Leightons Opticians & Hearing Care,PO16 0AP__000001_PO160AP,OPT,81 West Street,,,Fareham,Hampshire,PO16 0AP,Tel: 01329 287 220, - ,,,No ratings yet Rate it yourself - /Services/opticians/LeaveReview/DefaultView.aspx?id=PO16 0AP__000001_PO160AP,0,0,
Vision Express,OP_5LX_14830__000001_PO160EP,OPT,13-14 Fareham Shopping Centre,,Fareham,Hampshire,,PO16 0EP,Tel: 01329 235700, - ,,,No ratings yet Rate it yourself - /Services/opticians/LeaveReview/DefaultView.aspx?id=OP_5LX_14830__000001_PO160EP,0,0,
Specsavers,OP_5LY_14851__000001_SO509EP,OPT,9 Leigh Road,,Eastleigh,Hampshire,,SO50 9EP,Tel: 023 8062 0011, - ,,,No ratings yet Rate it yourself - /Services/opticians/LeaveReview/DefaultView.aspx?id=OP_5LY_14851__000001_SO509EP,0,0,
Praills Opticians,PO16 0EN__000007_PO160EN,OPT,203d West Street,,Fareham,Hants,,PO16 0EN,Tel: 01329 280250, - ,,,No ratings yet Rate it yourself - /Services/opticians/LeaveReview/DefaultView.aspx?id=PO16 0EN__000007_PO160EN,0,0,
Paxton & Welham,PAX001__000001_GU299BY,OPT,Rumbolds Hill,,Midhurst,West Sussex,,GU29 9BY,Tel: 01730 813788, - ,,,No ratings yet Rate it yourself - /Services/opticians/LeaveReview/DefaultView.aspx?id=PAX001__000001_GU299BY,0,0,
Richard C Arnold Optometrists,OP_5L9_3134__000001_GU299PB,OPT,Red Lion Street,Church Hill,Midhurst,West Sussex,,GU29 9PB,Tel: 01730 814035, - ,,,No ratings yet Rate it yourself - /Services/opticians/LeaveReview/DefaultView.aspx?id=OP_5L9_3134__000001_GU299PB,0,0,
Leightons Opticians & Hearing Care,OP_5LY_14073__000001_SO532QD,OPT,,"4-5 The Mall, Winchester Road",Chandlers Ford,Southampton,Hampshire,SO53 2QD,Tel: 02380 266 181, - ,,,No ratings yet Rate it yourself - /Services/opticians/LeaveReview/DefaultView.aspx?id=OP_5LY_14073__000001_SO532QD,0,0,
Rawlings Opticians,OP_5LY_14074__000001_SO533DB,OPT,,"14 Fryern Arcade, Winchester Road",Chandlers Ford,Chandlers Ford,,SO53 2DQ,Tel: 023 8025 2428, - ,,,No ratings yet Rate it yourself - /Services/opticians/LeaveReview/DefaultView.aspx?id=OP_5LY_14074__000001_SO533DB,0,0,
Martin Steels Ltd,OP_5FD_3855__000002_PO107AW,OPT,4 The Old Flour Mill,Queen Street,,Emsworth,Hampshire,PO10 7BT,Tel: 01243 375141, - ,,,No ratings yet Rate it yourself - /Services/opticians/LeaveReview/DefaultView.aspx?id=OP_5FD_3855__000002_PO107AW,0,0,
Martin Steels Optometrists,N3O6K,OPT,,4 The Old Flour Mill,Queen Street,Emsworth,Hampshire,PO10 7BT,Tel: 01243375141, - ,,,No ratings yet Rate it yourself - /Services/opticians/LeaveReview/DefaultView.aspx?id=N3O6K,0,0,
Northern Parade Clinic,PO2 9NS__000001_PO29NS,OPT,Doyle Avenue,,Portsmouth,Hants,,PO2 9NS,Tel: 023 9266 2378, - ,,,No ratings yet Rate it yourself - /Services/opticians/LeaveReview/DefaultView.aspx?id=PO2 9NS__000001_PO29NS,0,0,
Leightons Opticians & Hearing Care,OP_5L5_12053__000001_GU271BZ,OPT,,37 Wey Hill,,Haslemere,Surrey,GU27 1BZ,Tel: 01428 643 975, - ,,,No ratings yet Rate it yourself - /Services/opticians/LeaveReview/DefaultView.aspx?id=OP_5L5_12053__000001_GU271BZ,0,0,
Rex Wingate & Partners,OP_5LX_732__000001_SO311BB,OPT,60-62 Botley Road,,Park Gate,Hampshire,,SO31 1BB,Tel: 01489 584169, - ,,,No ratings yet Rate it yourself - /Services/opticians/LeaveReview/DefaultView.aspx?id=OP_5LX_732__000001_SO311BB,0,0,
Wingate Rex & Partners,SO3 7BB__000001_SO37BB,OPT,60 Botley Road,Park Gate,Portsmouth,Hants,,SO3 7BB,Tel: 01489 584169, - ,,,No ratings yet Rate it yourself - /Services/opticians/LeaveReview/DefaultView.aspx?id=SO3 7BB__000001_SO37BB,0,0,
CGW Limited,OPT_SO533DA_1,OPT,,7 Bournemouth Road,,Chandlers Ford,,SO53 3DA,, - ,,,No ratings yet Rate it yourself - /Services/opticians/LeaveReview/DefaultView.aspx?id=OPT_SO533DA_1,0,0,
Hampson Opticians,OP_SO532FW_85744,OPT,,3A Hursley Road,,Chandlers Ford,,SO53 2FW,, - ,,,No ratings yet Rate it yourself - /Services/opticians/LeaveReview/DefaultView.aspx?id=OP_SO532FW_85744,0,0,
20/20 Vision (Super Optical) Ltd,OP_5LX_14829__000001_SO317GE,OPT,20 Bridge Road,,Park Gate,Hampshire,,SO31 7GE,Tel: 01489 573300, - ,,,No ratings yet Rate it yourself - /Services/opticians/LeaveReview/DefaultView.aspx?id=OP_5LX_14829__000001_SO317GE,0,0,
Anne Gill Eyecare,OPT_PO29JQ_1,OPT,,226 London Road,,Portsmouth,,PO2 9JQ,Tel: 023 9269 4442, - ,,,No ratings yet Rate it yourself - /Services/opticians/LeaveReview/DefaultView.aspx?id=OPT_PO29JQ_1,0,0,
Peter Bennett,SO53 3AF__000001_SO533AF,OPT,232 Bournemouth Road,Chandlers Ford,Eastleigh,Hants,,SO53 3AF,, - ,,,No ratings yet Rate it yourself - /Services/opticians/LeaveReview/DefaultView.aspx?id=SO53 3AF__000001_SO533AF,0,0,
Leightons Opticians & Hearing Care,OP_5DF_9286__000001_RG217DE,OPT,,9-11 Church Street,,Basingstoke,Hampshire,RG21 7QG,Tel: 01256 321068, - ,,,No ratings yet Rate it yourself - /Services/opticians/LeaveReview/DefaultView.aspx?id=OP_5DF_9286__000001_RG217DE,0,0,
Buyspecs Direct,OPT_RG211NX_1,OPT,,"Yard House, May Place",,Basingstoke,,RG21 1NX,, - ,,,No ratings yet Rate it yourself - /Services/opticians/LeaveReview/DefaultView.aspx?id=OPT_RG211NX_1,0,0,
Chandlers Eyecare,M4G1X,OPT,2 Charter Walk,West Street,,Haslemere,Surrey,GU27 2AD,Tel: 01428 652 512, - ,,,No ratings yet Rate it yourself - /Services/opticians/LeaveReview/DefaultView.aspx?id=M4G1X,0,0,
Venturi Optics Limited,OPT_GU272JB_1,OPT,,5 Petworth Road,,Haslemere,,GU27 2JB,, - ,,,No ratings yet Rate it yourself - /Services/opticians/LeaveReview/DefaultView.aspx?id=OPT_GU272JB_1,0,0,
Venturi Optics Limited,3928,OPT,,5 Petworth Road,,Haslemere,,GU27 2JB,, - ,,,No ratings yet Rate it yourself - /Services/opticians/LeaveReview/DefaultView.aspx?id=3928,0,0,
Tesco Opticians,SO31 8GN__000002_SO318GN,OPT,Hamble Lane,Bursledon,,Southampton,,SO31 8GN,Tel: 0345 6013479, - ,,,No ratings yet Rate it yourself - /Services/opticians/LeaveReview/DefaultView.aspx?id=SO31 8GN__000002_SO318GN,0,0,
Batemans Opticians,OP_5DF_270__000001_RG217LN,OPT,13 Kensington House,Festival Centre,,Basingstoke,Hampshire,RG21 7LN,Tel: 01256 321327, - ,,,No ratings yet Rate it yourself - /Services/opticians/LeaveReview/DefaultView.aspx?id=OP_5DF_270__000001_RG217LN,0,0,
Batemans  Opticians Ltd,OP_5L5_5818__000002_GU272LA,OPT,68 High Street,,,Haslemere,Surrey,GU27 2LA,Tel: 01428 642 224, - ,,,No ratings yet Rate it yourself - /Services/opticians/LeaveReview/DefaultView.aspx?id=OP_5L5_5818__000002_GU272LA,0,0,
The Opticians,OP_5G6_9543__000001_RG291LA,OPT,,113a High Street,,Odiham,Hampshire,RG29 1LA,Tel: 01256 703707, - ,,,No ratings yet Rate it yourself - /Services/opticians/LeaveReview/DefaultView.aspx?id=OP_5G6_9543__000001_RG291LA,0,0,
Asda Opticians,OPT_PO14 1TT,OPT,,Speedfields Park,,Fareham,,PO14 1TT,Tel: 01329 241885, - ,,,No ratings yet Rate it yourself - /Services/opticians/LeaveReview/DefaultView.aspx?id=OPT_PO14 1TT,0,0,
David Clulow Opticians,OP_5DF_8373__000001_RG217JY,OPT,25 Mayfair House,25 Mayfair House,,Basingstoke,Hampshire,RG21 7JY,Tel: 01256 332113, - ,,,No ratings yet Rate it yourself - /Services/opticians/LeaveReview/DefaultView.aspx?id=OP_5DF_8373__000001_RG217JY,0,0,
Portsea Island Opticians,OP_5FE_11047__000001_PO29DJ,OPT,144 London Road,,,Portmouth,Hampshire,PO2 9DQ,Tel: 023 9261 0710, - ,,,No ratings yet Rate it yourself - /Services/opticians/LeaveReview/DefaultView.aspx?id=OP_5FE_11047__000001_PO29DJ,0,0,
Vision Express,OP_5DF_12805__000001_RG217LD,OPT,"Unit 4, Chiswick House","Unit 4, Chiswick House",,Basingstoke,,RG21 7LD,Tel: 01256 814824, - ,,,No ratings yet Rate it yourself - /Services/opticians/LeaveReview/DefaultView.aspx?id=OP_5DF_12805__000001_RG217LD,0,0,
Specsavers,OP_5DF_1542__000001_RG217JR,OPT,5 Chiswick House,Festival Place,,Basingstoke,,RG21 7LD,Tel: 01256 479429, - ,,,98 ratings Rate it yourself - /Services/opticians/LeaveReview/DefaultView.aspx?id=OP_5DF_1542__000001_RG217JR,,,
ASDA Opticians,OP_5LY_14072__000002_SO533YJ,OPT,Bournemouth Road,Chandlers Ford,Eastleigh,Hampshire,,SO53 3YJ,Tel: 023 8026 8341, - ,,,147 ratings Rate it yourself - /Services/opticians/LeaveReview/DefaultView.aspx?id=OP_5LY_14072__000002_SO533YJ,,,
Prime Opticians,F6T5F,OPT,,"Unit 3a, Old Basing Mall",,Basingstoke,Hampshire,RG21 7AW,Tel: 01256 278 278, - ,,,No ratings yet Rate it yourself - /Services/opticians/LeaveReview/DefaultView.aspx?id=F6T5F,0,0,
Boots-Basingstoke - Old Basing Mall,OP_5DF_6102__000002_RG217LW,OPT,15 Old Basing Mall,,,Basingstoke,Hampshire,RG21 7LW,Tel: 01256 364943, - ,,,1 rating Rate it yourself - /Services/opticians/LeaveReview/DefaultView.aspx?id=OP_5DF_6102__000002_RG217LW,,,