Organisation Name,NACS Code,Organisation Type,Address1,Address2,Address3,Address4,Address5,PostCode,Telephone Number,Opening time,Value  (Opening time),Banding Classification  (Opening time),NHS.UK users rating,Value  (NHS.UK users rating),Banding Classification  (NHS.UK users rating),Car parking (Is there car parking at this organisation?)
Grace Haine Eyecare Ltd,OP_DT102LZ_34883,OPT,,1 Skye House,Ring Street,STALBRIDGE,Dorset,DT10 2LZ,Tel: 01963 362775, - ,,,No ratings yet Rate it yourself - /Services/opticians/LeaveReview/DefaultView.aspx?id=OP_DT102LZ_34883,0,0,yes
Robert Frith Opticians Ltd,OP_5CD_13759__000001_SP84AA,OPT,Fairfield House,36 High Street,,GILLINGHAM,Dorset,SP8 4AA,Tel: 01747 825122, - ,,,1 rating Rate it yourself - /Services/opticians/LeaveReview/DefaultView.aspx?id=OP_5CD_13759__000001_SP84AA,,,
Vision Express ,OP_5CD_7572__000001_DT101AW,OPT,2 Retsel House,Bridge Street,Sturminster Newton,,,DT10 1AW,Tel: 01258 472291, - ,,,No ratings yet Rate it yourself - /Services/opticians/LeaveReview/DefaultView.aspx?id=OP_5CD_7572__000001_DT101AW,0,0,
Robert Frith Opticians (Wessex) Ltd,OP_5CD_12558__000001_SP78AR,OPT,Wesley House,12 Bell Street,,SHAFTESBURY,Dorset,SP7 8AR,Tel: 01747 854761, - ,,,No ratings yet Rate it yourself - /Services/opticians/LeaveReview/DefaultView.aspx?id=OP_5CD_12558__000001_SP78AR,0,0,
S H Harrold (1937) Ltd,CO-2389__000001_SP78JE,OPT,,49 High Street,,SHAFTESBURY,Dorset,SP7 8JE,Tel: 01747 853553, - ,,,1 rating Rate it yourself - /Services/opticians/LeaveReview/DefaultView.aspx?id=CO-2389__000001_SP78JE,,,
EyeStyle Centre Opticians Ltd,OP_5CD_50__000001_SP78AA,OPT,56 High Street,,Shaftesbury,Shaftesbury,,SP7 8AA,Tel: 01747 851006, - ,,,No ratings yet Rate it yourself - /Services/opticians/LeaveReview/DefaultView.aspx?id=OP_5CD_50__000001_SP78AA,0,0,
L & M Wincanton Limited,OPT_BA99LA_1,OPT,,16 Market Place,,Wincanton,,BA9 9LA,, - ,,,No ratings yet Rate it yourself - /Services/opticians/LeaveReview/DefaultView.aspx?id=OPT_BA99LA_1,0,0,
L & M Wincanton Limited,OPT_BA99LA_2,OPT,,16 Market Place,,Wincanton,,BA9 9LA,, - ,,,No ratings yet Rate it yourself - /Services/opticians/LeaveReview/DefaultView.aspx?id=OPT_BA99LA_2,0,0,
Sarah Gibson Optometrist ,OP_5K1_6438__000001_BA99LP,OPT,Commerce House,Market Place,,Wincanton,Somerset,BA9 9LP,Tel: 01963 34333, - ,,,1 rating Rate it yourself - /Services/opticians/LeaveReview/DefaultView.aspx?id=OP_5K1_6438__000001_BA99LP,,,
Vision Express UK Ltd,OP_5CD_2784__000001_DT93AX,OPT,57 Cheap Street,,Sherborne,,,DT9 3AX,Tel: 01935 812105, - ,,,No ratings yet Rate it yourself - /Services/opticians/LeaveReview/DefaultView.aspx?id=OP_5CD_2784__000001_DT93AX,0,0,
Scrivens Ltd,OP_5CD_7192__000001_DT93BJ,OPT,44 Cheap Street,,,Sherbourne,Dorset,DT9 3PX,Tel: 01935 812971, - ,,,No ratings yet Rate it yourself - /Services/opticians/LeaveReview/DefaultView.aspx?id=OP_5CD_7192__000001_DT93BJ,0,0,
Matthews Opticians - Sherborne,OP_5CD_2683__000001_DT93NL,OPT,1 Tilton Court,Digby Road,,SHERBORNE,Dorset,DT9 3NL,Tel: 01935 813355, - ,,,No ratings yet Rate it yourself - /Services/opticians/LeaveReview/DefaultView.aspx?id=OP_5CD_2683__000001_DT93NL,0,0,
Home Care Community Opticians (J2NA Ltd),00281__000002_DT93RQ,OPT,Old Yarn Business Centre,Westbury,Sherborne,Dorset,,DT9 3RQ,Tel: 01935 813800, - ,,,No ratings yet Rate it yourself - /Services/opticians/LeaveReview/DefaultView.aspx?id=00281__000002_DT93RQ,0,0,
Robert Frith Optometrists,OP_5K1_1670__000002_BA77BG,OPT,Fore Street,Castle Cary,Somerset,Somerset,,BA7 7BG,Tel: 01963 351948, - ,,,No ratings yet Rate it yourself - /Services/opticians/LeaveReview/DefaultView.aspx?id=OP_5K1_1670__000002_BA77BG,0,0,
Robert Frith Opticians (Blandford) Ltd.,OP_5CD_2016__000001_DT117AH,OPT,,3 Market Place,,BLANDFORD FORUM,Dorset,DT11 7AH,Tel: 01258 452207, - ,,,No ratings yet Rate it yourself - /Services/opticians/LeaveReview/DefaultView.aspx?id=OP_5CD_2016__000001_DT117AH,0,0,
Scrivens Ltd,OP_5CD_2939__000001_DT117PY,OPT,,9 Market Place,,Blandford Forum,Dorset,DT11 7AF,Tel: 01258 452443, - ,,,No ratings yet Rate it yourself - /Services/opticians/LeaveReview/DefaultView.aspx?id=OP_5CD_2939__000001_DT117PY,0,0,
S H Harrold (1937) Ltd,OP_5CD_4949__000002_DT117DX,OPT,,61 East Street,,BLANDFORD FORUM,Dorset,DT11 7DX,Tel: 01258 458476, - ,,,1 rating Rate it yourself - /Services/opticians/LeaveReview/DefaultView.aspx?id=OP_5CD_4949__000002_DT117DX,,,
Specsavers,CO-5497,OPT,,44-48 East Street,,Blandford Forum,,DT11 7DR,, - ,,,No ratings yet Rate it yourself - /Services/opticians/LeaveReview/DefaultView.aspx?id=CO-5497,0,0,
Vision Express (UK) Ltd,OP_5K1_12679__000002_BA201LX,OPT,44-46 Middle Street,Yeovil,Somerset,,,BA20 1LX,Tel: 01935 472044, - ,,,No ratings yet Rate it yourself - /Services/opticians/LeaveReview/DefaultView.aspx?id=OP_5K1_12679__000002_BA201LX,0,0,
Specsavers Opticians,OP_5K1_38__000001_BA201LX,OPT,50-52 Middle Street,Yeovil,,Somerset,,BA20 1LX,Tel: 01935 410040, - ,,,1 rating Rate it yourself - /Services/opticians/LeaveReview/DefaultView.aspx?id=OP_5K1_38__000001_BA201LX,,,
Dollond & Aitchison,OP_5K1_113__000002_BA201LG,OPT,39-41 Middle Street,Yeovil,Somerset,,,BA20 1LG,Tel: 01935 423490, - ,,,No ratings yet Rate it yourself - /Services/opticians/LeaveReview/DefaultView.aspx?id=OP_5K1_113__000002_BA201LG,0,0,
Boots-Yeovil - Middle St,OP_5K1_2550__000003_BA201LG,OPT,,39-41 Middle Street,,Yeovil,Somerset,BA20 1LG,Tel: 01935 423 490, - ,,,No ratings yet Rate it yourself - /Services/opticians/LeaveReview/DefaultView.aspx?id=OP_5K1_2550__000003_BA201LG,0,0,
Robert Frith Optometrists Yeovil,OP_5K1_3238__000001_BA201EQ,OPT,Ryburn House,28 Princes Street,,Yeovil,Somerset,BA20 1EQ,Tel: 01935 474333, - ,,,2 ratings Rate it yourself - /Services/opticians/LeaveReview/DefaultView.aspx?id=OP_5K1_3238__000001_BA201EQ,,,
Tesco Opticians,OP_5QL-126__000002_BA201DL,OPT,Queensway Place,Huish,Yeovil,Somerset,,BA20 1DL,Tel: 01935 647438, - ,,,No ratings yet Rate it yourself - /Services/opticians/LeaveReview/DefaultView.aspx?id=OP_5QL-126__000002_BA201DL,0,0,
Haine & Smith Opticians,OP_5DH_11016__000001_BA129AN,OPT,,10 Market Place,,Warminster,Wiltshire,BA12 9AN,Tel: 01985 212034, - ,,,No ratings yet Rate it yourself - /Services/opticians/LeaveReview/DefaultView.aspx?id=OP_5DH_11016__000001_BA129AN,0,0,
Specsavers Opticians,OP_5DH_645__000005_BA129AY,OPT,Unit 2,1 Market Place,Warminster,Wiltshire,,BA12 9AY,Tel: 01985 219 016, - ,,,No ratings yet Rate it yourself - /Services/opticians/LeaveReview/DefaultView.aspx?id=OP_5DH_645__000005_BA129AY,0,0,
Batemans (Opticians) Ltd,OP_5DH_82__000001_BA129AY,OPT,21 Market Place,,,Warminster,Wiltshire,BA12 9AY,Tel: 01985 213347, - ,,,No ratings yet Rate it yourself - /Services/opticians/LeaveReview/DefaultView.aspx?id=OP_5DH_82__000001_BA129AY,0,0,
Boots Opticians Warminster,240417135350,OPT,,51 Market Place,,Warminster,,BA12 9AZ,, - ,,,No ratings yet Rate it yourself - /Services/opticians/LeaveReview/DefaultView.aspx?id=240417135350,0,0,
Boots-Frome,OP_5FX_12891__000001_BA111BN,OPT,3 Cheap Street,,,Frome,Somerset,BA11 1BN,Tel: 01373 462031, - ,,,No ratings yet Rate it yourself - /Services/opticians/LeaveReview/DefaultView.aspx?id=OP_5FX_12891__000001_BA111BN,0,0,
Eye-Tech Opticians,OP_5FX_13589__000001_BA111AH,OPT,25 Market Place,Frome,,Somerset,,BA11 1AH,Tel: 01373 462573, - ,,,No ratings yet Rate it yourself - /Services/opticians/LeaveReview/DefaultView.aspx?id=OP_5FX_13589__000001_BA111AH,0,0,
O'toid Opticians,01-19886,OPT,,5 The Bridge,,Frome,,BA11 1AR,Tel: 01373 467467, - ,,,No ratings yet Rate it yourself - /Services/opticians/LeaveReview/DefaultView.aspx?id=01-19886,0,0,
Specsavers Opticians,OP_5FX_7746__000002_BA111BS,OPT,19 Westway Centre,Frome,,Somerset,,BA11 1BS,Tel: 01373 451180, - ,,,No ratings yet Rate it yourself - /Services/opticians/LeaveReview/DefaultView.aspx?id=OP_5FX_7746__000002_BA111BS,0,0,
Christopher Young Optometrists,OP_5FX_2045__000001_BA45AS,OPT,46 High Street,Shepton Mallet,Somerset,,,BA4 5AS,Tel: 01749 345259, - ,,,1 rating Rate it yourself - /Services/opticians/LeaveReview/DefaultView.aspx?id=OP_5FX_2045__000001_BA45AS,,,
Optique 2000 Ltd,OP_5FN_6873__000001_BH211JN,OPT,7a West Street,,,WIMBORNE,Dorset,BH21 1JN,Tel: 01202 848808, - ,,,20 ratings Rate it yourself - /Services/opticians/LeaveReview/DefaultView.aspx?id=OP_5FN_6873__000001_BH211JN,,,
Haine & Smith Opticians,OP_5DH_2366__000005_BA133BN,OPT,,19 High Street,,Westbury,Wiltshire,BA13 3BN,Tel: 01373 822163, - ,,,No ratings yet Rate it yourself - /Services/opticians/LeaveReview/DefaultView.aspx?id=OP_5DH_2366__000005_BA133BN,0,0,
Scrivens Ltd,OP_5FN_5544__000001_BH211HT,OPT,1 High Street,,,Wimborne,Dorset,BH21 1HR,Tel: 01202 883827, - ,,,No ratings yet Rate it yourself - /Services/opticians/LeaveReview/DefaultView.aspx?id=OP_5FN_5544__000001_BH211HT,0,0,
Carter & Harding,OP_5DH_9220__000001_BA133DN,OPT,21 Maristow Street,,Westbury,,,BA13 3DN,Tel: 01373 822084, - ,,,No ratings yet Rate it yourself - /Services/opticians/LeaveReview/DefaultView.aspx?id=OP_5DH_9220__000001_BA133DN,0,0,
Peter Bowen Thomas Ltd,OP_5FN_8398__000001_BH211DX,OPT,43 East Street,,Wimborne,,,BH21 1DX,Tel: 01202 889131, - ,,,No ratings yet Rate it yourself - /Services/opticians/LeaveReview/DefaultView.aspx?id=OP_5FN_8398__000001_BH211DX,0,0,
Martock Opticians Ltd,OP_5K1_14660__000002_TA126JL,OPT,North Street,Martock,Somerset,,,TA12 6DH,Tel: 01935 824431, - ,,,2 ratings Rate it yourself - /Services/opticians/LeaveReview/DefaultView.aspx?id=OP_5K1_14660__000002_TA126JL,,,
I J Brown Partnership,OP_5FP_6510__000001_DT11UY,OPT,,63 High West Street,,DORCHESTER,Dorset,DT1 1UY,Tel: 01305 264922, - ,,,No ratings yet Rate it yourself - /Services/opticians/LeaveReview/DefaultView.aspx?id=OP_5FP_6510__000001_DT11UY,0,0,
Boots Opticians,CO-3673,OPT,,16 Cornhill,,Dorset,,DT1 1BQ,Tel: 01305 251573, - ,,,No ratings yet Rate it yourself - /Services/opticians/LeaveReview/DefaultView.aspx?id=CO-3673,0,0,
Sproston & Bowden Opticians Ltd,OP_5FP_7270__000001_DT11UW,OPT,23 High West Street,,Dorchester,,,DT1 1UW,Tel: 01305 264557, - ,,,No ratings yet Rate it yourself - /Services/opticians/LeaveReview/DefaultView.aspx?id=OP_5FP_7270__000001_DT11UW,0,0,
Insight ,OP_5FP_8741__000001_DT11BN,OPT,9 Tudor Arcade,South Street,,DORCHESTER,Dorset,DT1 1BN,Tel: 01305 260753, - ,,,4 ratings Rate it yourself - /Services/opticians/LeaveReview/DefaultView.aspx?id=OP_5FP_8741__000001_DT11BN,,,
Scrivens Ltd,OP_5FP_11251__000001_DT11BY,OPT,,41 South Street,,Dorchester,Dorset,DT1 1TW,Tel: 01305 264966, - ,,,No ratings yet Rate it yourself - /Services/opticians/LeaveReview/DefaultView.aspx?id=OP_5FP_11251__000001_DT11BY,0,0,
Specsavers (Dorchester Vision Plus Ltd),CO 1795__000002_DT11BS,OPT,20 South Street,,Dorchester,Dorset,,DT1 1BS,Tel: 01305 216910, - ,,,No ratings yet Rate it yourself - /Services/opticians/LeaveReview/DefaultView.aspx?id=CO 1795__000002_DT11BS,0,0,
Andrew Care Opticians,OP_5FP_14132__000002_DT11DE,OPT,,6 South Terrace,,DORCHESTER,Dorset,DT1 1DE,Tel: 01305 262225, - ,,,2 ratings Rate it yourself - /Services/opticians/LeaveReview/DefaultView.aspx?id=OP_5FP_14132__000002_DT11DE,,,
Robert Frith Opticians Ltd,,OPT,,31 Crown Street West,,Poundbury,Dorset,DT1 3FQ,Tel: 01305 264 922, - ,,,N/A - Data not available,,,
Care Opticians,SP10 3DG,OPT,,6 Heath Close,,Wimborne,Dorset,BH21 2LP,Tel: 01202 889472, - ,,,1 rating Rate it yourself - /Services/opticians/LeaveReview/DefaultView.aspx?id=SP10 3DG,,,
Robert Frith Optometrists ,OP_5FX_6962__000002_BA69DZ,OPT,74 High Street,Glastonbury,Somerset,,,BA6 9DZ,Tel: 01458 832212, - ,,,No ratings yet Rate it yourself - /Services/opticians/LeaveReview/DefaultView.aspx?id=OP_5FX_6962__000002_BA69DZ,0,0,
Wilton i Ltd,SP2 0DF,OPT,within The Old Orchard Surgery,South Street,,Wilton,,SP2 0JU,Tel: 01722 743122, - ,,,No ratings yet Rate it yourself - /Services/opticians/LeaveReview/DefaultView.aspx?id=SP2 0DF,0,0,
Peacock & Murphy,OP_5FN_5847__000001_BH216DR,OPT,27b Vicarage Road,,Verwood,Dorset,,BH31 6DR,Tel: 01202 825448, - ,,,No ratings yet Rate it yourself - /Services/opticians/LeaveReview/DefaultView.aspx?id=OP_5FN_5847__000001_BH216DR,0,0,
Eye Tech Opticians,OP_5FX_11123__000001_BA160EG,OPT,100 High Street,Street,,Somerset,,BA16 0EG,Tel: 01458 442178, - ,,,No ratings yet Rate it yourself - /Services/opticians/LeaveReview/DefaultView.aspx?id=OP_5FX_11123__000001_BA160EG,0,0,
Specsavers Opticians,OP_5QL_999__000002_BA160EZ,OPT,93 High Street,,,Street,,BA16 0EZ,Tel: 01458 449400, - ,,,No ratings yet Rate it yourself - /Services/opticians/LeaveReview/DefaultView.aspx?id=OP_5QL_999__000002_BA160EZ,0,0,
Boots-Street,OP_5FX_14659__000001_BA160EX,OPT,141A High Street,,,Street,Somerset,BA16 0EX,Tel: 01458 442434, - ,,,No ratings yet Rate it yourself - /Services/opticians/LeaveReview/DefaultView.aspx?id=OP_5FX_14659__000001_BA160EX,0,0,
Vision Express (UK) Ltd,OPL 1405QL__000001_BA52AE,OPT,43 High Street,,,Wells,,BA5 2AE,Tel: 01749 674111, - ,,,No ratings yet Rate it yourself - /Services/opticians/LeaveReview/DefaultView.aspx?id=OPL 1405QL__000001_BA52AE,0,0,
R A Mansfield Opticians,OP_5FX_4104__000001_BA52AG,OPT,65 High Street,Wells,Somerset,,,BA5 2AG,Tel: 01749 672229, - ,,,No ratings yet Rate it yourself - /Services/opticians/LeaveReview/DefaultView.aspx?id=OP_5FX_4104__000001_BA52AG,0,0,
Specsavers,OP_5FX_9046__000001_BA52SN,OPT,60a High Street,Wells,Somerset,,,BA5 2SN,Tel: 01749 673 694, - ,,,1 rating Rate it yourself - /Services/opticians/LeaveReview/DefaultView.aspx?id=OP_5FX_9046__000001_BA52SN,,,
David & Sandra Millican Opticians,OP_5FX_8575__000001_BA52AQ,OPT,75 High Street,Wells,Somerset,,,BA5 2AQ,Tel: 01749 673991, - ,,,No ratings yet Rate it yourself - /Services/opticians/LeaveReview/DefaultView.aspx?id=OP_5FX_8575__000001_BA52AQ,0,0,
Rogers Optical (trading as Boots Opticians),01-26179,OPT,,66 High Street,,Somerset,,BA5 2AJ,, - ,,,1 rating Rate it yourself - /Services/opticians/LeaveReview/DefaultView.aspx?id=01-26179,,,
Scrivens Ltd,OP_5KV_6309__000003_BH188DP,OPT,,169-171 The Broadway,,Broadstone,Dorset,BH18 8DS,Tel: 01202 692859, - ,,,2 ratings Rate it yourself - /Services/opticians/LeaveReview/DefaultView.aspx?id=OP_5KV_6309__000003_BH188DP,,,
S H Harrold (1937) Ltd,OP_5KV_6757__000001_BH151SY,OPT,184c Lower Blandford Road,,Broadstone,Dorset,,BH18 8DP,Tel: 01202 672878, - ,,,No ratings yet Rate it yourself - /Services/opticians/LeaveReview/DefaultView.aspx?id=OP_5KV_6757__000001_BH151SY,0,0,
Specsavers Home Visits,00025__000001_BH217SH,OPT,Unit 4a Arena Business Centre,9 Nimrod Way,Ferndown,Dorset,,BH21 7SH,Tel: 01202 862385, - ,,,9 ratings Rate it yourself - /Services/opticians/LeaveReview/DefaultView.aspx?id=00025__000001_BH217SH,,,
Lovat Short Optometrists,OP_5FL_14817__000002_BA33PL,OPT,2 The Street,Radstock,,Bath,,BA3 3PL,Tel: 01761 432169, - ,,,No ratings yet Rate it yourself - /Services/opticians/LeaveReview/DefaultView.aspx?id=OP_5FL_14817__000002_BA33PL,0,0,
Eye Tech Opticians,OP_5FL_8611__000001_BA32HQ,OPT,6 The Island,Midsomer Norton,Bath,,,BA3 2HQ,Tel: 01761 414136, - ,,,No ratings yet Rate it yourself - /Services/opticians/LeaveReview/DefaultView.aspx?id=OP_5FL_8611__000001_BA32HQ,0,0,
Edwards Opticians Ltd,OP_5FL_14818__000001_BA32HW,OPT,2 Mansbrook House,15 High Street,,Midsomer Norton,,BA3 2HW,Tel: 01761 413212, - ,,,No ratings yet Rate it yourself - /Services/opticians/LeaveReview/DefaultView.aspx?id=OP_5FL_14818__000001_BA32HW,0,0,
Scrivens Opticians ,OP_5FL_575__000001_BA32DW,OPT,,26 High Street,Bath,Midsomer Norton,,BA3 2DW,Tel: 01761 414774, - ,,,No ratings yet Rate it yourself - /Services/opticians/LeaveReview/DefaultView.aspx?id=OP_5FL_575__000001_BA32DW,0,0,
EyeStyle Centre Opticians Ltd,TP7HJ,OPT,,141-143 Station Road,,Dorset,,BH22 0HT,, - ,,,No ratings yet Rate it yourself - /Services/opticians/LeaveReview/DefaultView.aspx?id=TP7HJ,0,0,
Vision Express,OP_5K1_5143__000001_TA188DA,OPT,23 South Street,Crewkerne,,Somerset,,TA18 8DA,Tel: 01460 72333, - ,,,No ratings yet Rate it yourself - /Services/opticians/LeaveReview/DefaultView.aspx?id=OP_5K1_5143__000001_TA188DA,0,0,
Robert Frith Optometrists,OP_5K1_3632__000002_TA187JY,OPT,4 Market Street,4 Market Street,Somerset,Crewkerne,,TA18 7JY,Tel: 01460 72964, - ,,,1 rating Rate it yourself - /Services/opticians/LeaveReview/DefaultView.aspx?id=OP_5K1_3632__000002_TA187JY,,,
Earlam & Christopher,OP_5K1_3350__000001_TA109RH,OPT,38 North Street,Langport,Somerset,Langport,,TA10 9RH,Tel: 01458 250793, - ,,,No ratings yet Rate it yourself - /Services/opticians/LeaveReview/DefaultView.aspx?id=OP_5K1_3350__000001_TA109RH,0,0,
Still & Bedford,E0E1C,OPT,,61 Victoria Road,Ferndown,Bournemouth,Dorset,BH22 9HU,Tel: 01202 891727, - ,,,No ratings yet Rate it yourself - /Services/opticians/LeaveReview/DefaultView.aspx?id=E0E1C,0,0,
Knight Eyecare,,OPT,,61 Victoria Road,,Ferndown,Dorset,BH22 9HU,Tel: 01202 891 727, - ,,,N/A - Data not available,,,
Underwood Eyecare,OP_5FN_4238__000002_BH229TH,OPT,Underwood Eyecare,7 Pennys Walk,,Ferndown,Dorset,BH22 9TH,Tel: 01202 891955, - ,,,1 rating Rate it yourself - /Services/opticians/LeaveReview/DefaultView.aspx?id=OP_5FN_4238__000002_BH229TH,,,
Henderson's,OP_5FN_13758__000001_BH229HZ,OPT,54 Victoria Road,,Ferndown,Dorset,,BH22 9HZ,Tel: 01202 871711, - ,,,No ratings yet Rate it yourself - /Services/opticians/LeaveReview/DefaultView.aspx?id=OP_5FN_13758__000001_BH229HZ,0,0,
Christine Webster Opticians Ltd,OP_5FN_1098__000001_BH204AF,OPT,Victoria House,10a North Street,Wareham,Dorset,,BH20 4AF,Tel: 01929 556062, - ,,,1 rating Rate it yourself - /Services/opticians/LeaveReview/DefaultView.aspx?id=OP_5FN_1098__000001_BH204AF,,,
Mark Jones Eyecare,OP_5DJ_14125__000001_SP27SU,OPT,,21 Fisherton Street,,Salisbury,,SP2 7SU,Tel: 01722 322891, - ,,,1 rating Rate it yourself - /Services/opticians/LeaveReview/DefaultView.aspx?id=OP_5DJ_14125__000001_SP27SU,,,
Tesco Stores Ltd,OL-CO1998-5QN__000002_BH124NX,OPT,Yarrow Road,Mannings Heath,Poole,Dorset,,BH12 4NX,Tel: 01202 457438, - ,,,No ratings yet Rate it yourself - /Services/opticians/LeaveReview/DefaultView.aspx?id=OL-CO1998-5QN__000002_BH124NX,0,0,
Specsavers Opticians,OP_5DH_9973__000003_BA148AT,OPT,23 The Shires,Trowbridge,Wiltshire,,,BA14 8AT,Tel: 01225 775 434, - ,,,No ratings yet Rate it yourself - /Services/opticians/LeaveReview/DefaultView.aspx?id=OP_5DH_9973__000003_BA148AT,0,0,
Haine & Smith Opticians,OP_5DH_2822__000004_BA148AT,OPT,,5a The Shires,,Trowbridge,Wiltshire,BA14 8AT,Tel: 01225 776871, - ,,,No ratings yet Rate it yourself - /Services/opticians/LeaveReview/DefaultView.aspx?id=OP_5DH_2822__000004_BA148AT,0,0,
Batemans (Opticians) Ltd,OP_5DJ_3495__000001_SP12LX,OPT,6 Bridge Street,,Salisbury,,,SP1 2LX,Tel: 01722 322585, - ,,,No ratings yet Rate it yourself - /Services/opticians/LeaveReview/DefaultView.aspx?id=OP_5DJ_3495__000001_SP12LX,0,0,
Boots-Trowbridge,OP_5DH_36__000001_BA148EW,OPT,28-29 Fore Street,,,Trowbridge,Wiltshire,BA14 8EW,Tel: 01225 719055, - ,,,No ratings yet Rate it yourself - /Services/opticians/LeaveReview/DefaultView.aspx?id=OP_5DH_36__000001_BA148EW,0,0,
Boots-Salisbury - Silver St,SP1 2NG_29481,OPT,,41-49 Silver Street,,Salisbury,Wiltshire,SP1 2NG,Tel: 01722 412625, - ,,,4 ratings Rate it yourself - /Services/opticians/LeaveReview/DefaultView.aspx?id=SP1 2NG_29481,,,
Carter & Harding,OP_5DH_11493__000001_BA148HD,OPT,5a Fore Street,,Trowbridge,Wiltshire,,BA14 8HD,Tel: 01225 752143, - ,,,No ratings yet Rate it yourself - /Services/opticians/LeaveReview/DefaultView.aspx?id=OP_5DH_11493__000001_BA148HD,0,0,
Boots Opticians Limited,OP_5DJ_11593__000001_SP12AA,OPT,49-51 New Canel,,Salisbury,,,SP1 2AA,Tel: 01722 412625, - ,,,No ratings yet Rate it yourself - /Services/opticians/LeaveReview/DefaultView.aspx?id=OP_5DJ_11593__000001_SP12AA,0,0,
Vision Express (UK) Ltd,OP_5DJ_1147__000002_SP11EP,OPT,25-27 Butcher Row,,Salisbury,,,SP1 1EP,Tel: 01722 330056, - ,,,No ratings yet Rate it yourself - /Services/opticians/LeaveReview/DefaultView.aspx?id=OP_5DJ_1147__000002_SP11EP,0,0,
A.J Bass BSc FCOptom,OP_5A1_14086__000001_SP61AX,OPT,36 High Street,,Fordingbridge,Hampshire,,SP6 1AX,Tel: 01425 652663, - ,,,2 ratings Rate it yourself - /Services/opticians/LeaveReview/DefaultView.aspx?id=OP_5A1_14086__000001_SP61AX,,,
R D White Opticians,OP5DH__000003_BA148DE,OPT,38 Roundstone Street,,Trowbridge,Wiltshire,,BA14 8DE,Tel: 01225 753172, - ,,,No ratings yet Rate it yourself - /Services/opticians/LeaveReview/DefaultView.aspx?id=OP5DH__000003_BA148DE,0,0,
Silverthornes Opticians,OP_5DJ_14126__000001_SP12DD,OPT,50 Catherine Street,,Salisbury,Wiltshire,,SP1 2DD,Tel: 01722 322880, - ,,,No ratings yet Rate it yourself - /Services/opticians/LeaveReview/DefaultView.aspx?id=OP_5DJ_14126__000001_SP12DD,0,0,
Specsavers Opticians,OP_5DJ_9766__000001_SP12DG,OPT,1 Catherine Street,,Salisbury,,,SP1 2DF,Tel: 01722 412255, - ,,,No ratings yet Rate it yourself - /Services/opticians/LeaveReview/DefaultView.aspx?id=OP_5DJ_9766__000001_SP12DG,0,0,
Memory Opticians,OP_5DJ_8550__000002_SP12DF,OPT,13 Catherine Street,,Salisbury,,,SP1 2DF,Tel: 01722 410959, - ,,,No ratings yet Rate it yourself - /Services/opticians/LeaveReview/DefaultView.aspx?id=OP_5DJ_8550__000002_SP12DF,0,0,
Boots-Salisbury - Catherine St,OP_5DJ_10591__000001_SP12DF,OPT,17 Catherine Street,,,Salisbury,Wiltshire,SP1 2DF,Tel: 01722 322 522, - ,,,No ratings yet Rate it yourself - /Services/opticians/LeaveReview/DefaultView.aspx?id=OP_5DJ_10591__000001_SP12DF,0,0,
Asda Stores Ltd.,CO-2058__000001_BH151JQ,OPT,West Quay Road,,Poole,Dorset,,BH15 1JQ,Tel: 01202 207020, - ,,,No ratings yet Rate it yourself - /Services/opticians/LeaveReview/DefaultView.aspx?id=CO-2058__000001_BH151JQ,0,0,
Boots-Poole - Dolphin Centre,OP_5KV_538__000002_BH151SX,OPT,"190-196 High Street, Dolphin Centre",,,Poole,Dorset,BH15 1SX,Tel: 01202 679395, - ,,,3 ratings Rate it yourself - /Services/opticians/LeaveReview/DefaultView.aspx?id=OP_5KV_538__000002_BH151SX,,,
K C Opticians ,OP_BH107AZ_85049,OPT,,1553 Wimborne Road,Kinson,BOURNEMOUTH,Dorset,BH10 7AZ,Tel: 01202 571601, - ,,,No ratings yet Rate it yourself - /Services/opticians/LeaveReview/DefaultView.aspx?id=OP_BH107AZ_85049,0,0,
Vision Express (UK) Ltd,OP_5KV_6730__000001_BH151ST,OPT,37-38 Dolphin Shopping Centre,,Poole,,,BH15 1ST,Tel: 01202 661060, - ,,,No ratings yet Rate it yourself - /Services/opticians/LeaveReview/DefaultView.aspx?id=OP_5KV_6730__000001_BH151ST,0,0,
Leightons & Tempany,OP_5KV_646__000001_BH151AU,OPT,,157 High Street,,Poole,Dorset,BH15 1AU,Tel: 01202 678244, - ,,,No ratings yet Rate it yourself - /Services/opticians/LeaveReview/DefaultView.aspx?id=OP_5KV_646__000001_BH151AU,0,0,
Parley Optometrists,OP_5FN_391__000002_BH228EB,OPT,127 New Road,West Parley,,FERNDOWN,Dorset,BH22 8EB,Tel: 01202 575759, - ,,,1 rating Rate it yourself - /Services/opticians/LeaveReview/DefaultView.aspx?id=OP_5FN_391__000002_BH228EB,,,yes
Specsavers Opticians (Poole Visionplus Ltd),OP_5KV_4516__000001_BH151DF,OPT,,32/34 Kingsland Crescent,,Poole,Dorset,BH15 1TB,Tel: 01202 675789, - ,,,1 rating Rate it yourself - /Services/opticians/LeaveReview/DefaultView.aspx?id=OP_5KV_4516__000001_BH151DF,,,
Scrivens Ltd,OP_5KV_7844__000001_BH151TB,OPT,,145 High Street,,Poole,Dorset,BH15 1AS,Tel: 0121 456 8700, - ,,,No ratings yet Rate it yourself - /Services/opticians/LeaveReview/DefaultView.aspx?id=OP_5KV_7844__000001_BH151TB,0,0,
F P Whiffen Ltd,CO-2538__000002_BH140ES,OPT,2 Bournemouth Road,Lower Parkstone,,POOLE,Dorset,BH14 0ES,Tel: 01202 716661, - ,,,No ratings yet Rate it yourself - /Services/opticians/LeaveReview/DefaultView.aspx?id=CO-2538__000002_BH140ES,0,0,
Parkstone Eyecare,OP_5KV_5415__000001_BH140AA,OPT,434 Ashley Road,Parkstone,,POOLE,Dorset,BH14 0AA,Tel: 01202 741963, - ,,,1 rating Rate it yourself - /Services/opticians/LeaveReview/DefaultView.aspx?id=OP_5KV_5415__000001_BH140AA,,,