Organisation Name,NACS Code,Organisation Type,Address1,Address2,Address3,Address4,Address5,PostCode,Telephone Number,Opening time,Value  (Opening time),Banding Classification  (Opening time),NHS.UK users rating,Value  (NHS.UK users rating),Banding Classification  (NHS.UK users rating),Car parking (Is there car parking at this organisation?)
Mr Yacub (Dom Only),OP_5HP_14297__000003_BB20AF,OPT,Ammarah House,7 Assheton Road,Blackburn,,,BB2 6SF,Tel: 01254 611084, - ,,,No ratings yet Rate it yourself - /Services/opticians/LeaveReview/DefaultView.aspx?id=OP_5HP_14297__000003_BB20AF,0,0,
Davies Optical - Eye Tests at Home,OP_PR66JL_30040,OPT,,PO Box 596,,Chorley,Lancashire,PR6 6JL,Tel: 01772 628227, - ,,,No ratings yet Rate it yourself - /Services/opticians/LeaveReview/DefaultView.aspx?id=OP_PR66JL_30040,0,0,
Bromley Cross Opticians,01-19767-0913,OPT,,494 Darwen Rd,Bromley Cross,Bolton,Lancashire,BL7 9DX,Tel: 01204 771818, - ,,,6 ratings Rate it yourself - /Services/opticians/LeaveReview/DefaultView.aspx?id=01-19767-0913,,,
D G Optical,OPT_BL67AX_1,OPT,,33 Lee Lane,,Horwich,,BL6 7AX,Tel: 01204 691888, - ,,,No ratings yet Rate it yourself - /Services/opticians/LeaveReview/DefaultView.aspx?id=OPT_BL67AX_1,0,0,
Justin Kellett Opticians,OPT_BL67AA_1,OPT,,22 Winter Hey Lane,Horwich,Bolton,,BL6 7AA,Tel: 01204 691888, - ,,,No ratings yet Rate it yourself - /Services/opticians/LeaveReview/DefaultView.aspx?id=OPT_BL67AA_1,0,0,
Asda Vision Centre,OLCO20585HQ__000001_BL66HQ,OPT,The Linkway,Middlebrook,Horwich,Bolton,,BL6 6HQ,Tel: 01204 676812, - ,,,No ratings yet Rate it yourself - /Services/opticians/LeaveReview/DefaultView.aspx?id=OLCO20585HQ__000001_BL66HQ,0,0,
Boots-Bolton - Linkway,OP_5HQ_3085__000001_BL66JA,OPT,55 The Linkway,Horwich,Bolton,Bolton,Lancashire,BL6 6JA,Tel: 01204 669012, - ,,,No ratings yet Rate it yourself - /Services/opticians/LeaveReview/DefaultView.aspx?id=OP_5HQ_3085__000001_BL66JA,0,0,
J Bowden Ltd,OP_5HQ_2371__000002_BL16AB,OPT,552 Chorley Old Road,,Bolton,,,BL1 6AB,Tel: 01204 846219, - ,,,No ratings yet Rate it yourself - /Services/opticians/LeaveReview/DefaultView.aspx?id=OP_5HQ_2371__000002_BL16AB,0,0,
Univision Eye Centre,OLO1126805HQ__000001_BL18DF,OPT,341 Halliwell Rd,,Bolton,,,BL1 8DF,Tel: 01204 849900, - ,,,No ratings yet Rate it yourself - /Services/opticians/LeaveReview/DefaultView.aspx?id=OLO1126805HQ__000001_BL18DF,0,0,
Tesco Opticians,OLCO19985HQ__000002_BL66JS,OPT,Mansell Way,Horwich,Bolton,,,BL6 6JS,Tel: 01204 517638, - ,,,No ratings yet Rate it yourself - /Services/opticians/LeaveReview/DefaultView.aspx?id=OLCO19985HQ__000002_BL66JS,0,0,
Harwood Eyecare Opticians,TP9JR,OPT,,117 Lea Gate,,Bolton,,BL2 4BQ,Tel: 01204 771717, - ,,,No ratings yet Rate it yourself - /Services/opticians/LeaveReview/DefaultView.aspx?id=TP9JR,0,0,
RKEYECARE,S1A5V,OPT,BOLTON ARENA,"114,firstfloor,",Bolton arena,"horwich,     bolton",Greater Manchester,BL6 6LB,Tel: 07504645060, - ,,,No ratings yet Rate it yourself - /Services/opticians/LeaveReview/DefaultView.aspx?id=S1A5V,0,0,
The Eye People,OP_5HQ_5096__000001_BL18HE,OPT,179 Blackburn Road,,Bolton,,,BL1 8HE,Tel: 01204 557300, - ,,,No ratings yet Rate it yourself - /Services/opticians/LeaveReview/DefaultView.aspx?id=OP_5HQ_5096__000001_BL18HE,0,0,
I & M Eyecare,OP_5HQ_0154__000001_BL13BW,OPT,232 Chorley Old Road,,Bolton,,,BL1 3BW,Tel: 01204 849595, - ,,,No ratings yet Rate it yourself - /Services/opticians/LeaveReview/DefaultView.aspx?id=OP_5HQ_0154__000001_BL13BW,0,0,
Yates & Suddell,OP_5JX_3316__000002_BL09AD,OPT,,35 Bridge Street,Ramsbottom,Bury,Lancashire,BL0 9AD,Tel: 01706 822393, - ,,,No ratings yet Rate it yourself - /Services/opticians/LeaveReview/DefaultView.aspx?id=OP_5JX_3316__000002_BL09AD,0,0,
The Spectacle Studio Ltd,OP_5JX_6696__000001_BL09AD,OPT,45 Bridge Street,Ramsbottom,Bury,Lancashire,,BL0 9AD,Tel: 01706 822 200, - ,,,No ratings yet Rate it yourself - /Services/opticians/LeaveReview/DefaultView.aspx?id=OP_5JX_6696__000001_BL09AD,0,0,
Leightons Optometrists,OP_5JX_4666__000001_BL09SH,OPT,7 The Precinct,Longsight Road,Holcombe Brook,Holcombe Brook,,BL0 9SH,Tel: 01204 888100, - ,,,No ratings yet Rate it yourself - /Services/opticians/LeaveReview/DefaultView.aspx?id=OP_5JX_4666__000001_BL09SH,0,0,
Andrew Fletcher Opticians,CO135HQ__000001_BL14QR,OPT,13 Chorley New Road,,Bolton,,,BL1 4QR,Tel: 01204 520921, - ,,,4 ratings Rate it yourself - /Services/opticians/LeaveReview/DefaultView.aspx?id=CO135HQ__000001_BL14QR,,,
The Eyeworks,OPT0110__000002_BL22LS,OPT,53 Thicketford Road,,,Bolton,,BL2 2LS,Tel: 01204 559056, - ,,,1 rating Rate it yourself - /Services/opticians/LeaveReview/DefaultView.aspx?id=OPT0110__000002_BL22LS,,,
Manchester 2 domicilary Specsavers Healthcall,01-20941,OPT,,15 Larkhill Avenue,,Standish,,WN6 0DP,, - ,,,No ratings yet Rate it yourself - /Services/opticians/LeaveReview/DefaultView.aspx?id=01-20941,0,0,
Suzanne Dennis Optometrist Ltd,OP_5HG_10822__000002_WN60HR,OPT,,10 Pole Street,Standish,Wigan,Greater Manchester,WN6 0HP,Tel: 01257 424300, - ,,,No ratings yet Rate it yourself - /Services/opticians/LeaveReview/DefaultView.aspx?id=OP_5HG_10822__000002_WN60HR,0,0,
Vision Express,OP_5HQ_6882__000002_BL12AL,OPT,23-29 Upper Mall,,Bolton,,,BL1 2AL,Tel: 01204 532323, - ,,,No ratings yet Rate it yourself - /Services/opticians/LeaveReview/DefaultView.aspx?id=OP_5HQ_6882__000002_BL12AL,0,0,
Scrivens Opticians & Hearing Care,BL1 2AP_12543,OPT,,18 Knowsley Street,,Bolton,Lancashire,BL1 2AP,Tel: 01204 523531, - ,,,No ratings yet Rate it yourself - /Services/opticians/LeaveReview/DefaultView.aspx?id=BL1 2AP_12543,0,0,
Eyewear Brands,OP_5HQ_6883__000001_BL11HH,OPT,15 Deansgate,,Bolton,Lancashire,,BL1 1HH,Tel: 01204 520055, - ,,,No ratings yet Rate it yourself - /Services/opticians/LeaveReview/DefaultView.aspx?id=OP_5HQ_6883__000001_BL11HH,0,0,
One Vision Opticians,OP_5HQ_10008__000001_BL11DD,OPT,22 Mealhouse Lane,,Bolton,,,BL1 1DD,Tel: 01204 384305, - ,,,No ratings yet Rate it yourself - /Services/opticians/LeaveReview/DefaultView.aspx?id=OP_5HQ_10008__000001_BL11DD,0,0,
Boots-Bolton - The Gates,OP_5HQ_6690__000001_BL11BL,OPT,Unit 12-15 The Gates Shopping Centre,Meal House Lane,Bolton,Greater Manchester,,BL1 1DF,Tel: 01204 363555, - ,,,No ratings yet Rate it yourself - /Services/opticians/LeaveReview/DefaultView.aspx?id=OP_5HQ_6690__000001_BL11BL,0,0,
Specsavers Opticians,OP_5HQ_6211__000001_BL11BQ,OPT,27 - 29 Victoria Square,,Bolton,,,BL1 1RJ,Tel: 01204 521122, - ,,,No ratings yet Rate it yourself - /Services/opticians/LeaveReview/DefaultView.aspx?id=OP_5HQ_6211__000001_BL11BQ,0,0,
The Spectacle Centre,OLO1173035HQ__000001_BL11TQ,OPT,Ashburner Street,,Bolton,,,BL1 1TQ,Tel: 01204 366003, - ,,,No ratings yet Rate it yourself - /Services/opticians/LeaveReview/DefaultView.aspx?id=OLO1173035HQ__000001_BL11TQ,0,0,
Deane Eye Clinic,OLO1205515HQ__000002_BL35DP,OPT,222 Deane Rd,Deane,Bolton,,,BL3 5DP,Tel: 01204 524785, - ,,,No ratings yet Rate it yourself - /Services/opticians/LeaveReview/DefaultView.aspx?id=OLO1205515HQ__000002_BL35DP,0,0,
Sensory Care,5HP 8396,OPT,Sensory Care,75 Junction Road,,Bolton,,BL3 4NF,Tel: 0161 727 9900, - ,,,No ratings yet Rate it yourself - /Services/opticians/LeaveReview/DefaultView.aspx?id=5HP 8396,0,0,
I Care at Home,OPT_BL21BJ_1,OPT,4a Caroline House,125 Bradshawgate,,Bolton,,BL2 1BJ,Tel: 08002461462, - ,,,1 rating Rate it yourself - /Services/opticians/LeaveReview/DefaultView.aspx?id=OPT_BL21BJ_1,,,
Deane Clinic Opticians,OLO31435HQ__000004_BL34LU,OPT,Horsfield Street,Deane,Bolton,,,BL3 4LU,Tel: 01204 64089, - ,,,No ratings yet Rate it yourself - /Services/opticians/LeaveReview/DefaultView.aspx?id=OLO31435HQ__000004_BL34LU,0,0,
Bolton Eye Clinic  ,OPT_BL11PQ_1,OPT,Instore Unit 1,Morrisons,Blackhorse Street,Bolton,,BL1 1PQ,Tel: 01204 772550, - ,,,20 ratings Rate it yourself - /Services/opticians/LeaveReview/DefaultView.aspx?id=OPT_BL11PQ_1,,,
Cloughs Opticians,OP_5HQ_1426__000001_BL36AB,OPT,140 Newport Street,,Bolton,,,BL3 6AB,Tel: 01204 523594, - ,,,2 ratings Rate it yourself - /Services/opticians/LeaveReview/DefaultView.aspx?id=OP_5HQ_1426__000001_BL36AB,,,
Eyezone,OP_5HQ_356__000001_BL36LS,OPT,378 Derby Street,,Bolton,,,BL3 6LS,Tel: 01204 654400, - ,,,No ratings yet Rate it yourself - /Services/opticians/LeaveReview/DefaultView.aspx?id=OP_5HQ_356__000001_BL36LS,0,0,
Eyesite Express,O112B1__000002_BL33NH,OPT,22 St Helens Road,Deane,Bolton,,,BL3 3NH,Tel: 01204 650102, - ,,,No ratings yet Rate it yourself - /Services/opticians/LeaveReview/DefaultView.aspx?id=O112B1__000002_BL33NH,0,0,
J W Caldicott,OP_5HQ_1371__000001_BL33NH,OPT,50 St. Helens Road,,Bolton,,,BL3 3NH,Tel: 01204 61954, - ,,,1 rating Rate it yourself - /Services/opticians/LeaveReview/DefaultView.aspx?id=OP_5HQ_1371__000001_BL33NH,,,
Shanti Eyecare,OLO1171875HQ__000002_BL33PH,OPT,160 St Helens Rd,,Bolton,,,BL3 3PH,Tel: 01204 666213, - ,,,No ratings yet Rate it yourself - /Services/opticians/LeaveReview/DefaultView.aspx?id=OLO1171875HQ__000002_BL33PH,0,0,
Greenhalgh Opticians,OP_5HQ_3339__000002_BL26PA,OPT,834 Bury Road,,Bolton,,,BL2 6PA,Tel: 01204 370760, - ,,,No ratings yet Rate it yourself - /Services/opticians/LeaveReview/DefaultView.aspx?id=OP_5HQ_3339__000002_BL26PA,0,0,
Hepworth & Hall,OP_5HG_2587__000001_WN12DF,OPT,55 Mesnes Road,Swinley,Wigan,,,WN1 2DF,Tel: 01942 245600, - ,,,No ratings yet Rate it yourself - /Services/opticians/LeaveReview/DefaultView.aspx?id=OP_5HG_2587__000001_WN12DF,0,0,
Spectacle Services Opticians,OPT_BL53AQ_1,OPT,,10 Marsden Street,Westhoughton,Bolton,,BL5 3AQ,Tel: 01942 843888, - ,,,No ratings yet Rate it yourself - /Services/opticians/LeaveReview/DefaultView.aspx?id=OPT_BL53AQ_1,0,0,
Carlton & Stanley,P1055__000001_WN68EA,OPT,2 Broad O'Th Lane,Shevington,Wigan,England - Uk,,WN6 8EA,Tel: 01257 255167, - ,,,No ratings yet Rate it yourself - /Services/opticians/LeaveReview/DefaultView.aspx?id=P1055__000001_WN68EA,0,0,
Vision  Express UK Ltd,OP_5HG_6908__000001_WN11AS,OPT,Unit 63/64  Ashton Gallery,The Galleries Shopping Centre,Wigan,Lancashire,,WN1 1AF,Tel: 01942 495660, - ,,,No ratings yet Rate it yourself - /Services/opticians/LeaveReview/DefaultView.aspx?id=OP_5HG_6908__000001_WN11AS,0,0,
The Spectacle Centre,00010__000004_WN13NH,OPT,Unit 9/10 Market Hall,,Wigan,,,WN1 1PW,Tel: 01942 236816, - ,,,No ratings yet Rate it yourself - /Services/opticians/LeaveReview/DefaultView.aspx?id=00010__000004_WN13NH,0,0,
Jacksons Opticians,OP_5HG_363__000001_WN11UW,OPT,44 Standish Gate,,,Wigan,Lancashire,WN1 1UW,Tel: 01942 242188, - ,,,2 ratings Rate it yourself - /Services/opticians/LeaveReview/DefaultView.aspx?id=OP_5HG_363__000001_WN11UW,,,no
Roberts Opticians,00012__000004_WN11HX,OPT,42 Market Street,,Wigan,,,WN1 1HX,Tel: 01942 247632, - ,,,No ratings yet Rate it yourself - /Services/opticians/LeaveReview/DefaultView.aspx?id=00012__000004_WN11HX,0,0,
I Site Opticians,OP_5HG^3322__000005_WN11HX,OPT,42a Market Street,,Wigan,,,WN1 1HX,Tel: 01942 234499, - ,,,No ratings yet Rate it yourself - /Services/opticians/LeaveReview/DefaultView.aspx?id=OP_5HG^3322__000005_WN11HX,0,0,
Specsavers Opticians,OP_5HG_9259__000001_WN11JS,OPT,3-5 Standishgate,,,WIGAN,,WN1 1UE,Tel: 01942 824 480, - ,,,No ratings yet Rate it yourself - /Services/opticians/LeaveReview/DefaultView.aspx?id=OP_5HG_9259__000001_WN11JS,0,0,
Boots-Wigan,WN1 1PJ_19173,OPT,,50 Market Place,,Wigan,Lancashire,WN1 1PJ,Tel: 01942 242015, - ,,,No ratings yet Rate it yourself - /Services/opticians/LeaveReview/DefaultView.aspx?id=WN1 1PJ_19173,0,0,
Greenhalgh Opticians,OP_5HG_8343__000001_WN23AE,OPT,59 Market Street,Hindley,Wigan,,,WN2 3AE,Tel: 01942 255556, - ,,,No ratings yet Rate it yourself - /Services/opticians/LeaveReview/DefaultView.aspx?id=OP_5HG_8343__000001_WN23AE,0,0,
J M Bluston Opticians,OP_5HQ_13084__000001_BL31HN,OPT,38 Market Street,Little Lever,,Bolton,,BL3 1HN,Tel: 01204 575441, - ,,,2 ratings Rate it yourself - /Services/opticians/LeaveReview/DefaultView.aspx?id=OP_5HQ_13084__000001_BL31HN,,,
Barnes-Hazel (Opticians) Ltd,OP_5HG_7878__000002_WN23AY,OPT,102 Market Street,Hindley,Wigan,,,WN2 3AY,Tel: 01942 255695, - ,,,No ratings yet Rate it yourself - /Services/opticians/LeaveReview/DefaultView.aspx?id=OP_5HG_7878__000002_WN23AY,0,0,
Boots Opticians,OPT_WN50UH_1,OPT,,37 Loire Drive,Robin Park,Wigan,,WN5 0UH,Tel: 01942 212773, - ,,,1 rating Rate it yourself - /Services/opticians/LeaveReview/DefaultView.aspx?id=OPT_WN50UH_1,,,
Asda Opticians,OP_5HG_14359__000002_WN50XA,OPT,Asda Stores Ltd,Soho Street,,Newtown,,WN5 0XA,Tel: 01942 243522, - ,,,No ratings yet Rate it yourself - /Services/opticians/LeaveReview/DefaultView.aspx?id=OP_5HG_14359__000002_WN50XA,0,0,
Rose & Tarrant Opticians,OP_5JX_13736__000001_BL90AD,OPT,,14 Crompton Street,Lancashire,Bury,Lancashire,BL9 0AD,Tel: 0161 764 4420, - ,,,1 rating Rate it yourself - /Services/opticians/LeaveReview/DefaultView.aspx?id=OP_5JX_13736__000001_BL90AD,,,
Specscart (Union Street),TP9EC,OPT,Specscart Bury,10 Union Street,,Bury,Greater Manchester,BL9 0NY,Tel: 01613125767, - ,,,No ratings yet Rate it yourself - /Services/opticians/LeaveReview/DefaultView.aspx?id=TP9EC,0,0,
Specsavers Opticians,OP_5JX_717__000001_BL90BX,OPT,39/41,The Haymarket,Millgate Shopping Centre,Bury,Lancashire,BL9 0BX,Tel: 0161 763 3916, - ,,,No ratings yet Rate it yourself - /Services/opticians/LeaveReview/DefaultView.aspx?id=OP_5JX_717__000001_BL90BX,0,0,
Vision Express Ltd,OP_5JX_BL90JN__000001_BL90JN,OPT,19 Central Street,The Rock,Bury,,,BL9 0JN,Tel: 0161 797 6639, - ,,,No ratings yet Rate it yourself - /Services/opticians/LeaveReview/DefaultView.aspx?id=OP_5JX_BL90JN__000001_BL90JN,0,0,
Boots-Bury - Union Arcade,OP_5JX_10975__000001_BL90QF,OPT,Unit 7 Union Arcade,Millgate Shopping Centre,,Bury,Lancashire,BL9 0QF,Tel: 0161 705 1157, - ,,,No ratings yet Rate it yourself - /Services/opticians/LeaveReview/DefaultView.aspx?id=OP_5JX_10975__000001_BL90QF,0,0,
Yates & Suddell,OP_5JX_100__000001_BL90QG,OPT,,15-19 Minden Parade,,Bury,Greater Manchester,BL9 0QG,Tel: 0161 7642209, - ,,,No ratings yet Rate it yourself - /Services/opticians/LeaveReview/DefaultView.aspx?id=OP_5JX_100__000001_BL90QG,0,0,
The Optical Shop,,OPT,,15 Princess Parade,Mill Gate Shopping Centre,Bury,Greater Manchester,BL9 0QL,Tel: 0161 2225020, - ,,,N/A - Data not available,,,
Martin Berry Ltd,OP_5HQ_2317__000001_BL49AE,OPT,116 Market Street,Farnworth,Bolton,,,BL4 9AE,Tel: 01204 572838, - ,,,No ratings yet Rate it yourself - /Services/opticians/LeaveReview/DefaultView.aspx?id=OP_5HQ_2317__000001_BL49AE,0,0,
Optical Direct Ltd,OLO1185525HQ__000003_BL49DR,OPT,Brackley Street,Farnworth,Bolton,,,BL4 9DR,Tel: 01204 707470, - ,,,No ratings yet Rate it yourself - /Services/opticians/LeaveReview/DefaultView.aspx?id=OLO1185525HQ__000003_BL49DR,0,0,
Spurretts Opticians,OP_5HQ_5178__000002_BL49DR,OPT,21 Brackley Street,,,"Farnworth, Bolton",Lancashire,BL4 9DS,Tel: 01204 706971, - ,,,1 rating Rate it yourself - /Services/opticians/LeaveReview/DefaultView.aspx?id=OP_5HQ_5178__000002_BL49DR,,,
Hepworth & Hall,OP_5HG_8254__000001_WN59EA,OPT,73 Ormskirk Road,,Wigan,,,WN5 9EA,Tel: 01942 323162, - ,,,No ratings yet Rate it yourself - /Services/opticians/LeaveReview/DefaultView.aspx?id=OP_5HG_8254__000001_WN59EA,0,0,
Revolution Eyecare Opticians,OLCO32025HQ__000001_BL49DJ,OPT,,26 Higher Market Street,Farnworth,Bolton,,BL4 9AJ,Tel: 01204 570800, - ,,,No ratings yet Rate it yourself - /Services/opticians/LeaveReview/DefaultView.aspx?id=OLCO32025HQ__000001_BL49DJ,0,0,
Hepworth & Hall,OP_5HG_1274__000002_M469DE,OPT,15 Church Street,Atherton,Manchester,,,M46 9DE,Tel: 01942 876200, - ,,,7 ratings Rate it yourself - /Services/opticians/LeaveReview/DefaultView.aspx?id=OP_5HG_1274__000002_M469DE,,,
seddons opticians,OP_5HG_4366__000001_M290DN,OPT,14 Market Street,Atherton,Manchester,,,M46 0DN,Tel: 01942 883377, - ,,,1 rating Rate it yourself - /Services/opticians/LeaveReview/DefaultView.aspx?id=OP_5HG_4366__000001_M290DN,,,
District Opticians,5F533__000001_M280AU,OPT,14 Hulton District Centre,Little Hulton,Manchester,,,M28 0AU,Tel: 0161 703 7171, - ,,,1 rating Rate it yourself - /Services/opticians/LeaveReview/DefaultView.aspx?id=5F533__000001_M280AU,,,
S Gore Opticians,OP_5HG_0001__000001_WN58QA,OPT,703 Ormskirk Road,Pemberton,Wigan,,,WN5 8AQ,Tel: 01942 214808, - ,,,No ratings yet Rate it yourself - /Services/opticians/LeaveReview/DefaultView.aspx?id=OP_5HG_0001__000001_WN58QA,0,0,
Hepworth & Hall,OP_5HG_2586__000001_WN58AX,OPT,806 Ormskirk Road,,Wigan,,,WN5 8AX,Tel: 01942 225301, - ,,,No ratings yet Rate it yourself - /Services/opticians/LeaveReview/DefaultView.aspx?id=OP_5HG_2586__000001_WN58AX,0,0,
Maxwell Kay Opticians Ltd,OP_5JX_2911__000001_M261NQ,OPT,26 Blackburn Street,Radcliffe,Manchester,,,M26 1NQ,Tel: 0161 723 3397, - ,,,No ratings yet Rate it yourself - /Services/opticians/LeaveReview/DefaultView.aspx?id=OP_5JX_2911__000001_M261NQ,0,0,
Asda Stores Ltd,OP_5JX_11062__000002_BL98RS,OPT,Asda Store,Pilsworth Road,Pilsworth,Bury,,BL9 8RS,Tel: 0161 3512520, - ,,,No ratings yet Rate it yourself - /Services/opticians/LeaveReview/DefaultView.aspx?id=OP_5JX_11062__000002_BL98RS,0,0,
"Tesco Opticians (Walkden Branch, Manchester)",5F5-1998__000002_M283BT,OPT,Ellesmere Shopping Centre,Walkden,,Manchester,,M28 3BT,Tel: 0345 601 3479, - ,,,No ratings yet Rate it yourself - /Services/opticians/LeaveReview/DefaultView.aspx?id=5F5-1998__000002_M283BT,0,0,
J W Caldicott,OP_5HG_14361__000001_M298FJ,OPT,114 Elliot Street,Tyldesley,Manchester,,,M29 8FJ,Tel: 01942 882396, - ,,,No ratings yet Rate it yourself - /Services/opticians/LeaveReview/DefaultView.aspx?id=OP_5HG_14361__000001_M298FJ,0,0,
seddons opticians,OP_5HG_4365__000002_M298DS,OPT,182 Elliott Street,Tyldesley,Manchester,,,M29 8DS,Tel: 01942 883398, - ,,,No ratings yet Rate it yourself - /Services/opticians/LeaveReview/DefaultView.aspx?id=OP_5HG_4365__000002_M298DS,0,0,
Specscart (Ellesmere Shopping Centre),TP8GJ,OPT,,"Unit 79, Ellesmere Shopping Centre, Bolton Road",,Manchester,Greater Manchester,M28 3ZD,Tel: 01613125767, - ,,,No ratings yet Rate it yourself - /Services/opticians/LeaveReview/DefaultView.aspx?id=TP8GJ,0,0,
Yates & Suddell,OP_5F5_8326__000002_M283ZD,OPT,Unit 79,144 Lady Harriet Walk,Walkden,Manchester,,M28 3ZH,Tel: 0161 702 9000, - ,,,No ratings yet Rate it yourself - /Services/opticians/LeaveReview/DefaultView.aspx?id=OP_5F5_8326__000002_M283ZD,0,0,
Craven & Murray Opticians Ltd,OP_5NQ_00003__000001_OL115XE,OPT,675 Edenfield Road,Norden,Rochdale,Lancashire,,OL11 5XE,Tel: 01706 641138, - ,,,No ratings yet Rate it yourself - /Services/opticians/LeaveReview/DefaultView.aspx?id=OP_5NQ_00003__000001_OL115XE,0,0,
Addison R,OP_5F5_14704__000001_M286AE,OPT,3 Bridgewater Road,Walkden,,Manchester,,M28 3JE,Tel: 0161 790 2000, - ,,,No ratings yet Rate it yourself - /Services/opticians/LeaveReview/DefaultView.aspx?id=OP_5F5_14704__000001_M286AE,0,0,
Lyne J,OP_5F5_9055__000001_M283KT,OPT,Walkden Eye Centre,14 Hodge Road,Walkden,Manchester,,M28 3AT,Tel: 0161 790 2367, - ,,,No ratings yet Rate it yourself - /Services/opticians/LeaveReview/DefaultView.aspx?id=OP_5F5_9055__000001_M283KT,0,0,
Gibson and Thomson Opticians,TP3P7,OPT,,1 Market Place,,Garstang,,PR3 1ZA,Tel: 01995 605621, - ,,,No ratings yet Rate it yourself - /Services/opticians/LeaveReview/DefaultView.aspx?id=TP3P7,0,0,
Specs Direct Opticians,OP_5JX_13738__000001_M456BG,OPT,8 Elms Square,Whitefield,Manchester,,,M45 7TA,Tel: 0161 767 9740, - ,,,No ratings yet Rate it yourself - /Services/opticians/LeaveReview/DefaultView.aspx?id=OP_5JX_13738__000001_M456BG,0,0,
Instore Optician,CO-5188,OPT,,"Morrisons, 5 Stanley Road",,Whitefield,Greater Manchester,M45 8QH,Tel: 0161 2220 920, - ,,,2 ratings Rate it yourself - /Services/opticians/LeaveReview/DefaultView.aspx?id=CO-5188,,,
Stotts Opticians,OP_5JX_5509__000001_BL98JN,OPT,113 Parr Lane,Unsworth,Bury,,,BL9 8JN,Tel: 0161 796 6170, - ,,,No ratings yet Rate it yourself - /Services/opticians/LeaveReview/DefaultView.aspx?id=OP_5JX_5509__000001_BL98JN,0,0,
The Eye Centre (Heywood) Ltd,OPT_OL104LY_1,OPT,,58 Market Street,,Heywood,Lancashire,OL10 4LY,Tel: 01706 620432, - ,,,1 rating Rate it yourself - /Services/opticians/LeaveReview/DefaultView.aspx?id=OPT_OL104LY_1,,,
seddons opticians,OP_5HG_4367__000001_WN74AU,OPT,20a Railway Road,,Leigh,,,WN7 4AX,Tel: 01942 671768, - ,,,No ratings yet Rate it yourself - /Services/opticians/LeaveReview/DefaultView.aspx?id=OP_5HG_4367__000001_WN74AU,0,0,
Shaw's Opticians,OP_5F4_1008__000002_OL101HX,OPT,39 Market Street,39 Market Street,Heywood,Heywood,,OL10 1HX,Tel: 01706 369369, - ,,,1 rating Rate it yourself - /Services/opticians/LeaveReview/DefaultView.aspx?id=OP_5F4_1008__000002_OL101HX,,,
Bridgford  Opticians,OP_5HG_13707__000001_WN73LZ,OPT,43 Railway Road,43 Railway Road,Lancashire,Leigh,,WN7 4AA,Tel: 01942 673337, - ,,,No ratings yet Rate it yourself - /Services/opticians/LeaveReview/DefaultView.aspx?id=OP_5HG_13707__000001_WN73LZ,0,0,
Specsavers Opticians,OP_5HG_2877__000002_WN74NB,OPT,47-49 Bradshawgate,,Leigh,,,WN7 4NB,Tel: 01942 682 160, - ,,,No ratings yet Rate it yourself - /Services/opticians/LeaveReview/DefaultView.aspx?id=OP_5HG_2877__000002_WN74NB,0,0,
David H Myers Opticians,OP_5F9_11267__000001_PR98BP,OPT,3 Preston New Road,Churchtown,Southport,,,PR9 8BP,Tel: 01704 227744, - ,,,1 rating Rate it yourself - /Services/opticians/LeaveReview/DefaultView.aspx?id=OP_5F9_11267__000001_PR98BP,,,
Vision Express,OP_5HG_9254__000002_WN74PG,OPT,,10 Spinning Gate,,Leigh,,WN7 4PG,Tel: 01942 261 541, - ,,,No ratings yet Rate it yourself - /Services/opticians/LeaveReview/DefaultView.aspx?id=OP_5HG_9254__000002_WN74PG,0,0,
Gill Opticians,OP_5HG_11525__000001_WN74PG,OPT,"Unit 27, Spinning Gate Shopping Centre",Ellesmere Street,,Leigh,Lancashire,WN7 4PG,Tel: 01942 608624, - ,,,No ratings yet Rate it yourself - /Services/opticians/LeaveReview/DefaultView.aspx?id=OP_5HG_11525__000001_WN74PG,0,0,
DG Opticians,OP_5F4_4583__000001_OL101AA,OPT,7 Hornby Street,,Heywood,,,OL10 1AA,Tel: 01706 369525, - ,,,No ratings yet Rate it yourself - /Services/opticians/LeaveReview/DefaultView.aspx?id=OP_5F4_4583__000001_OL101AA,0,0,
Simply Eyes Opticians,OP_5HG_13703__000002_WN40DH,OPT,10 Downall Green Road,Bryn,Wigan,,,WN4 0DH,Tel: 01942 722711, - ,,,No ratings yet Rate it yourself - /Services/opticians/LeaveReview/DefaultView.aspx?id=OP_5HG_13703__000002_WN40DH,0,0,
Prais Opticians,OP_5F5_6323__000002_M281FB,OPT,,9 Standfield Centre,Worsley,Manchester,,M28 1FB,Tel: 0161 790 3248, - ,,,No ratings yet Rate it yourself - /Services/opticians/LeaveReview/DefaultView.aspx?id=OP_5F5_6323__000002_M281FB,0,0,
Maudsley Opticians,OP_5F5_14703__000001_M272EW,OPT,718 Bolton Road,Pendlebury,,Manchester,,M27 6EW,Tel: 0161 794 2661, - ,,,No ratings yet Rate it yourself - /Services/opticians/LeaveReview/DefaultView.aspx?id=OP_5F5_14703__000001_M272EW,0,0,
Value Vision Glasses Home Dispensing Service,FY8 4HL,OPT,,26 Greenhey,,Lytham,,FY8 4HL,Tel: 01253 732709, - ,,,No ratings yet Rate it yourself - /Services/opticians/LeaveReview/DefaultView.aspx?id=FY8 4HL,0,0,
Value Vision ,OP_5F5_14707__000003_M274BH,OPT,,27 The Parade,Swinton,Manchester,,M27 4BH,Tel: 0161 794 3532, - ,,,9 ratings Rate it yourself - /Services/opticians/LeaveReview/DefaultView.aspx?id=OP_5F5_14707__000003_M274BH,,,
Specsavers Opticians,OP_5F5_8729__000002_M274BH,OPT,15 The Parade,Swinton,,Manchester,Lancashire,M27 4BH,Tel: 0161 794 1887, - ,,,No ratings yet Rate it yourself - /Services/opticians/LeaveReview/DefaultView.aspx?id=OP_5F5_8729__000002_M274BH,0,0,yes
The Village Optician Ltd,OP_5JX_493__000001_M251AX,OPT,470 Bury New Road,Prestwich,Manchester,,,M25 1AX,Tel: 0161 773 0069, - ,,,No ratings yet Rate it yourself - /Services/opticians/LeaveReview/DefaultView.aspx?id=OP_5JX_493__000001_M251AX,0,0,