Organisation Name,NACS Code,Organisation Type,Address1,Address2,Address3,Address4,Address5,PostCode,Telephone Number,Opening time,Value  (Opening time),Banding Classification  (Opening time),NHS.UK users rating,Value  (NHS.UK users rating),Banding Classification  (NHS.UK users rating),Car parking (Is there car parking at this organisation?)
P S Rutter,OP_5KH_3577__000001_DL82BJ,OPT,7 Southend,,,Bedale,Yorkshire(North Riding),DL8 2BJ,Tel: 01677 424142, - ,,,1 rating Rate it yourself - /Services/opticians/LeaveReview/DefaultView.aspx?id=OP_5KH_3577__000001_DL82BJ,,,
Orkney Opticians,OP_5E2_14407__000001_DL85AQ,OPT,1 High Street,,,Leyburn,Yorkshire(North Riding),DL8 5AQ,Tel: 01969 623001, - ,,,No ratings yet Rate it yourself - /Services/opticians/LeaveReview/DefaultView.aspx?id=OP_5E2_14407__000001_DL85AQ,0,0,
Cowen & Morgan,OP_5KJ_11943__000001_HG42BQ,OPT,22 Westgate,,Ripon,,,HG4 2BQ,Tel: 01765 600561, - ,,,No ratings yet Rate it yourself - /Services/opticians/LeaveReview/DefaultView.aspx?id=OP_5KJ_11943__000001_HG42BQ,0,0,
Specsavers,OP_5KJ_2638__000001_HG41DY,OPT,,28-29 Market Place West,Ripon,North Yorkshire,,HG4 1BN,Tel: 01765 694777, - ,,,1 rating Rate it yourself - /Services/opticians/LeaveReview/DefaultView.aspx?id=OP_5KJ_2638__000001_HG41DY,,,
Scrivens,OP_5KJ_9181__000001_HG41BP,OPT,"Unit 1, 8 The Arcade",Market Place,,Ripon,Yorkshire(North Riding),HG4 1BP,Tel: 01765 602820, - ,,,No ratings yet Rate it yourself - /Services/opticians/LeaveReview/DefaultView.aspx?id=OP_5KJ_9181__000001_HG41BP,0,0,
Peacock & Row Opticians,OP_5KJ_1160__000001_HG41AG,OPT,,2 Moss Arcade,Ripon,Ripon,,HG4 1AG,Tel: 01765 603484, - ,,,No ratings yet Rate it yourself - /Services/opticians/LeaveReview/DefaultView.aspx?id=OP_5KJ_1160__000001_HG41AG,0,0,
Specsavers,1111-DL10 4HP,OPT,,2-4 King Street,,Richmond,North Yorkshire,DL10 4HP,Tel: 01748 829960, - ,,,No ratings yet Rate it yourself - /Services/opticians/LeaveReview/DefaultView.aspx?id=1111-DL10 4HP,0,0,
Cooper & Leatherbarrow,OP_5KH_4652__000001_DL104QA,OPT,17-19 Finkle Street,,,Richmond,North Yorkshire,DL10 4QA,Tel: 01748 823402, - ,,,No ratings yet Rate it yourself - /Services/opticians/LeaveReview/DefaultView.aspx?id=OP_5KH_4652__000001_DL104QA,0,0,
S & C L Wilkinson,OP_5KH_8953__000002_DL104HP,OPT,10 King Street,,Richmond,,,DL10 4HP,Tel: 01748 823133, - ,,,No ratings yet Rate it yourself - /Services/opticians/LeaveReview/DefaultView.aspx?id=OP_5KH_8953__000002_DL104HP,0,0,
McBride Opticians,OP_5KH_14774__000001_DL78SE,OPT,4 South Parade,Northallerton,North Yorkshire,,,DL7 8SE,Tel: 01609 772989, - ,,,No ratings yet Rate it yourself - /Services/opticians/LeaveReview/DefaultView.aspx?id=OP_5KH_14774__000001_DL78SE,0,0,
Alexander Optometrists,01-122315,OPT,,145-146 High Street,,Northallerton,,DL7 8PE,Tel: 01609 760606, - ,,,No ratings yet Rate it yourself - /Services/opticians/LeaveReview/DefaultView.aspx?id=01-122315,0,0,
Boots-Northallerton - High St (in Boots UK),OP_5KH_1596__000002_DL78LW,OPT,203-204 High Street,,,Northallerton,North Yorkshire,DL7 8LW,Tel: 01609 777461, - ,,,No ratings yet Rate it yourself - /Services/opticians/LeaveReview/DefaultView.aspx?id=OP_5KH_1596__000002_DL78LW,0,0,
Spectacle Warehouse,OP_5KH_11785__000001_DL78PP,OPT,108 High Street,,Northallerton,,,DL7 8PP,Tel: 01609 777225, - ,,,No ratings yet Rate it yourself - /Services/opticians/LeaveReview/DefaultView.aspx?id=OP_5KH_11785__000001_DL78PP,0,0,
Boots-Northallerton - High St,OP_5E2_14406__000002_DL78PP,OPT,84 High Street,,North Yorkshire,Northallerton,,DL7 8PP,Tel: 01609 772150, - ,,,No ratings yet Rate it yourself - /Services/opticians/LeaveReview/DefaultView.aspx?id=OP_5E2_14406__000002_DL78PP,0,0,
E G E Hall Opticians,OP_5KH_8543__000002_YO71HQ,OPT,13 Market Place,,,Thirsk,,YO7 1HQ,Tel: 01845 525996, - ,,,No ratings yet Rate it yourself - /Services/opticians/LeaveReview/DefaultView.aspx?id=OP_5KH_8543__000002_YO71HQ,0,0,
Cooper & Barr Opticians,TP8RH,OPT,,21 Market Place,,Thirsk,,YO7 1HD,Tel: 01845 202007, - ,,,No ratings yet Rate it yourself - /Services/opticians/LeaveReview/DefaultView.aspx?id=TP8RH,0,0,
Row Opticians,OP_5KH_8808__000001_YO71AA,OPT,4 Millgate,,Thirsk,,,YO7 1AA,Tel: 01845 523093, - ,,,No ratings yet Rate it yourself - /Services/opticians/LeaveReview/DefaultView.aspx?id=OP_5KH_8808__000001_YO71AA,0,0,
The Vale Opticians,OP_5KJ_12411__000002_YO519AW,OPT,22 High Street,,York,Boroughbridge,,YO51 9AW,Tel: 01423 323450, - ,,,No ratings yet Rate it yourself - /Services/opticians/LeaveReview/DefaultView.aspx?id=OP_5KJ_12411__000002_YO519AW,0,0,
Eyecatchers,OP_5KJ_5664__000001_HG14LF,OPT,87a Skipton Road,,Harrogate,,,HG1 4LF,Tel: 01423 568083, - ,,,3 ratings Rate it yourself - /Services/opticians/LeaveReview/DefaultView.aspx?id=OP_5KJ_5664__000001_HG14LF,,,yes
Asda Opticians,OPT_HG1 5DE,OPT,,BOWER ROAD,,HARROGATE,,HG1 5DE,Tel: 01423 704 512, - ,,,1 rating Rate it yourself - /Services/opticians/LeaveReview/DefaultView.aspx?id=OPT_HG1 5DE,,,
Page & Smith Opticians,OP_5KJ_3115__000001_HG12TG,OPT,,4 Royal Parade,Harrogate,Harrogate,Yorkshire(North Riding),HG1 2SZ,Tel: 01423 562 616, - ,,,No ratings yet Rate it yourself - /Services/opticians/LeaveReview/DefaultView.aspx?id=OP_5KJ_3115__000001_HG12TG,0,0,
Specsavers Opticians Harrogate,TP6N1,OPT,18 Beulah Street,18 BEULAH STREET,Harrogate,Harrogate,,HG1 1QH,Tel: 01423 564515, - ,,,4 ratings Rate it yourself - /Services/opticians/LeaveReview/DefaultView.aspx?id=TP6N1,,,
M Procter,OP_5KJ_12429__000001_HG12QU,OPT,3 Parliament Street,,Harrogate,Harrogate,,HG1 2QU,Tel: 01423 531700, - ,,,No ratings yet Rate it yourself - /Services/opticians/LeaveReview/DefaultView.aspx?id=OP_5KJ_12429__000001_HG12QU,0,0,
Boots-Harrogate - Cambridge St (in Boots UK),HG1 1RX_19172,OPT,,26 - 28 Cambridge Street,,Harrogate,,HG1 1RX,Tel: 01423 530 335, - ,,,1 rating Rate it yourself - /Services/opticians/LeaveReview/DefaultView.aspx?id=HG1 1RX_19172,,,
M&S Opticians,,OPT,M&S,18-20 Cambridge Street,,Harrogate,,HG1 1RX,Tel: 01423 802696, - ,,,N/A - Data not available,,,
Vision Express (UK) Ltd,OP_5KJ_10948__000002_HG11RH,OPT,5-5a Prospect Crescent,,Harrogate,,,HG1 1RH,Tel: 01423 523477, - ,,,No ratings yet Rate it yourself - /Services/opticians/LeaveReview/DefaultView.aspx?id=OP_5KJ_10948__000002_HG11RH,0,0,
Catherine Veen Opticians,OP_5KJ_8782__000001_HG11EB,OPT,6 Victoria Avenue,,,Harrogate,,HG1 1ED,Tel: 01423 520888, - ,,,1 rating Rate it yourself - /Services/opticians/LeaveReview/DefaultView.aspx?id=OP_5KJ_8782__000001_HG11EB,,,
Christopher Nixon Optometrists,OP_5KJ_4191__000001_HG27LQ,OPT,Kinnersley House,35 High Street,"Starbeck, Harrogate",,,HG2 7LQ,Tel: 01423 885764, - ,,,No ratings yet Rate it yourself - /Services/opticians/LeaveReview/DefaultView.aspx?id=OP_5KJ_4191__000001_HG27LQ,0,0,
Darryl Taylor Opticians,OP_5KJ_9963__000001_HG50EA,OPT,84 High Street,,Knaresborough,,,HG5 0EA,Tel: 01423 862142, - ,,,No ratings yet Rate it yourself - /Services/opticians/LeaveReview/DefaultView.aspx?id=OP_5KJ_9963__000001_HG50EA,0,0,
Samantha Parker Optometrist,OP_5KJ_12955__000002_HG50ET,OPT,13 Market Place,,Knaresborough,,,HG5 8AL,Tel: 01423 866475, - ,,,No ratings yet Rate it yourself - /Services/opticians/LeaveReview/DefaultView.aspx?id=OP_5KJ_12955__000002_HG50ET,0,0,
KINGSTON WHITE OPTICIANS,OP-12353-5NV__000001_HG50ER,OPT,2 Park  Place,,Knaresborough,,,HG5 0ER,, - ,,,No ratings yet Rate it yourself - /Services/opticians/LeaveReview/DefaultView.aspx?id=OP-12353-5NV__000001_HG50ER,0,0,
Wade Optometry Ltd,OP_5J9_8666__000001_DL37LP,OPT,26 Post House Wynd,Darlington,County Durham,.,,DL3 7LP,Tel: 01325 355482, - ,,,No ratings yet Rate it yourself - /Services/opticians/LeaveReview/DefaultView.aspx?id=OP_5J9_8666__000001_DL37LP,0,0,
Cooper & Leatherbarrow,OP_5J9_5655__000001_DL37AF,OPT,10 Duke Street,,,Darlington,Durham,DL3 7AF,Tel: 01325 463267, - ,,,1 rating Rate it yourself - /Services/opticians/LeaveReview/DefaultView.aspx?id=OP_5J9_5655__000001_DL37AF,,,yes
Boots-Darlington,OP_5J9_7098__000003_DL37QW,OPT,24A High Row,,,Darlington,Durham,DL3 7QW,Tel: 01325 466 019, - ,,,No ratings yet Rate it yourself - /Services/opticians/LeaveReview/DefaultView.aspx?id=OP_5J9_7098__000003_DL37QW,0,0,
Specsavers Opticians,OP_5J9_00/194__000004_DL37QW,OPT,32 High Row,,Darlington,County Durham,,DL3 7QW,Tel: 01325 461155, - ,,,1 rating Rate it yourself - /Services/opticians/LeaveReview/DefaultView.aspx?id=OP_5J9_00/194__000004_DL37QW,,,
"Wilkinson, S & C L",OP_5J9_00/131__000001_DL11PB,OPT,4 Stonebridge,,Darlington,County Durham,,DL1 1PB,Tel: 01325 463 479, - ,,,No ratings yet Rate it yourself - /Services/opticians/LeaveReview/DefaultView.aspx?id=OP_5J9_00/131__000001_DL11PB,0,0,
Vision Express (UK) Ltd,OP_5J9_1173__000001_DL11LS,OPT,Unit 53,Cornmill Centre,Darlington,County Durham,,DL1 1LS,Tel: 01325 363877, - ,,,No ratings yet Rate it yourself - /Services/opticians/LeaveReview/DefaultView.aspx?id=OP_5J9_1173__000001_DL11LS,0,0,
Dr T J Buckingham,OP_5AW_7766__000001_LS299DR,OPT,5 Church Street,,Ilkley,,,LS29 9DR,Tel: 01943 608191, - ,,,2 ratings Rate it yourself - /Services/opticians/LeaveReview/DefaultView.aspx?id=OP_5AW_7766__000001_LS299DR,,,
Vision Express (UK) Ltd,OP_5AW_10959__000001_LS298DE,OPT,18 Brook Street,,,Ilkley,West Yorkshire,LS29 8DE,Tel: 01943 608551, - ,,,No ratings yet Rate it yourself - /Services/opticians/LeaveReview/DefaultView.aspx?id=OP_5AW_10959__000001_LS298DE,0,0,
Boots Opticians,OPT_LS299LA_1,OPT,,"Unit 1, Dalesway House",South Hawksworth Street,Ilkley,West Yorkshire,LS29 9LA,Tel: 01943 605557 (ext. 1303), - ,,,No ratings yet Rate it yourself - /Services/opticians/LeaveReview/DefaultView.aspx?id=OPT_LS299LA_1,0,0,
Optimeyes Opticians,OP_5KJ_12137__000001_BD231DG,OPT,15b The Moors Shopping Centre,South Hawksworth Street,Ilkley,West Yorkshire,,LS29 9LB,Tel: 01943 604600, - ,,,No ratings yet Rate it yourself - /Services/opticians/LeaveReview/DefaultView.aspx?id=OP_5KJ_12137__000001_BD231DG,0,0,
Specsavers Opticians,BRA165/5NY__000002_LS299LB,OPT,"5, 6 and 7 The Moors Shopping Centre",,Ilkley,West Yorkshire,,LS29 9LB,Tel: 01943 811330, - ,,,No ratings yet Rate it yourself - /Services/opticians/LeaveReview/DefaultView.aspx?id=BRA165/5NY__000002_LS299LB,0,0,
Paul Verity Opticians,OP_5AW_2354__000001_LS299EE,OPT,50 The Grove,,Ilkley,West Yorkshire,,LS29 9EE,Tel: 01943 608533, - ,,,No ratings yet Rate it yourself - /Services/opticians/LeaveReview/DefaultView.aspx?id=OP_5AW_2354__000001_LS299EE,0,0,
Brosgill Opticians,OP_LS299NQ_46855,OPT,Brosgill Opticians,27 The Grove,,Ilkley,West Yorkshire,LS29 9NQ,Tel: 01943 816033, - ,,,No ratings yet Rate it yourself - /Services/opticians/LeaveReview/DefaultView.aspx?id=OP_LS299NQ_46855,0,0,
K Malyn Opticians,01-12658,OPT,,91 Long Street,,"Easingwold, York",North Yorkshire,YO61 3HY,Tel: 01347 824131, - ,,,No ratings yet Rate it yourself - /Services/opticians/LeaveReview/DefaultView.aspx?id=01-12658,0,0,
The Village Optician,DL3 9EL,OPT,,47 West Auckland Road,Cockerton,Darlington,,DL3 9EL,Tel: 01325 489 684, - ,,,2 ratings Rate it yourself - /Services/opticians/LeaveReview/DefaultView.aspx?id=DL3 9EL,,,
Page Opticians,OP_5E2_8050__000001_YO613JA,OPT,134 Long Street,Easingwold,York,,,YO61 3JA,Tel: 01347 822172, - ,,,No ratings yet Rate it yourself - /Services/opticians/LeaveReview/DefaultView.aspx?id=OP_5E2_8050__000001_YO613JA,0,0,
iVision Opticians,OP_5HM_418__000001_LS213AL,OPT,,2A Boroughgate,Otley,Leeds,,LS21 3AL,Tel: 01943 462423, - ,,,No ratings yet Rate it yourself - /Services/opticians/LeaveReview/DefaultView.aspx?id=OP_5HM_418__000001_LS213AL,0,0,
Nicole Bowden Optics Ltd,OP_5HM_14026__000001_LS213AQ,OPT,26 Market Place,Otley,,Leeds,West Yorkshire,LS21 3AQ,Tel: 01943 462114, - ,,,No ratings yet Rate it yourself - /Services/opticians/LeaveReview/DefaultView.aspx?id=OP_5HM_14026__000001_LS213AQ,0,0,
Fink Eyewear ,D-8561,OPT,,8 Market Street,,Leeds,,LS21 3AF,, - ,,,No ratings yet Rate it yourself - /Services/opticians/LeaveReview/DefaultView.aspx?id=D-8561,0,0,
Specsavers,LS21 3HN__000002_LS213HN,OPT,7-9 Kirkgate,Otley,Leeds,West Yorkshire,,LS21 3HN,Tel: 01943 858440, - ,,,No ratings yet Rate it yourself - /Services/opticians/LeaveReview/DefaultView.aspx?id=LS21 3HN__000002_LS213HN,0,0,
J Exley & Co,OP_5KJ_4842__000001_BD231DY,OPT,7 Otley Street,,Skipton,,,BD23 1DY,Tel: 01756 792416, - ,,,No ratings yet Rate it yourself - /Services/opticians/LeaveReview/DefaultView.aspx?id=OP_5KJ_4842__000001_BD231DY,0,0,
Clifford Benjamin Optometrists,OP_5KJ_13254__000002_BD232JE,OPT,23 Newmarket Street,Skipton,,,,BD23 2JE,Tel: 01756 792933, - ,,,No ratings yet Rate it yourself - /Services/opticians/LeaveReview/DefaultView.aspx?id=OP_5KJ_13254__000002_BD232JE,0,0,
Boots-Skipton - High St,OP_5KJ_12608__000001_BD231JP,OPT,52 High Street,,,Skipton,North Yorkshire,BD23 1JP,Tel: 01756 790988, - ,,,No ratings yet Rate it yourself - /Services/opticians/LeaveReview/DefaultView.aspx?id=OP_5KJ_12608__000001_BD231JP,0,0,
A&S Ghazi Opticians,,OPT,,9 Newmarket Street,,Skipton,,BD23 2HX,, - ,,,N/A - Data not available,,,
Bayfields Opticians,OP_5J8_00/140__000001_DL128ND,OPT,12 Market Place,,Barnard Castle,County Durham,,DL12 8ND,Tel: 01833 631 849, - ,,,No ratings yet Rate it yourself - /Services/opticians/LeaveReview/DefaultView.aspx?id=OP_5J8_00/140__000001_DL128ND,0,0,
Cooper & Leatherbarrow,OP_5J8_4651__000001_DL128BG,OPT,8a Galgate,,Barnard Castle,Durham,,DL12 8BG,Tel: 0000000000, - ,,,No ratings yet Rate it yourself - /Services/opticians/LeaveReview/DefaultView.aspx?id=OP_5J8_4651__000001_DL128BG,0,0,
Silsden Optics Limited,OPT_BD209JS_1,OPT,,17 Briggate,,Silsden,,BD20 9JS,, - ,,,No ratings yet Rate it yourself - /Services/opticians/LeaveReview/DefaultView.aspx?id=OPT_BD209JS_1,0,0,
Wade Optometry Ltd,OP_5E1_8665__000001_TS159BW,OPT,35 High Street,.,Yarm,.,,TS15 9BW,Tel: 01642 790990, - ,,,No ratings yet Rate it yourself - /Services/opticians/LeaveReview/DefaultView.aspx?id=OP_5E1_8665__000001_TS159BW,0,0,
Vision Express,TS15 9AH,OPT,,64 High Street,,Yarm,,TS15 9AH,, - ,,,No ratings yet Rate it yourself - /Services/opticians/LeaveReview/DefaultView.aspx?id=TS15 9AH,0,0,
Henderson Opticians,OP_5E1_9456__000001_TS159AY,OPT,Winpenny House,135 High Street,Yarm,,,TS15 9AY,Tel: 01642 783340, - ,,,No ratings yet Rate it yourself - /Services/opticians/LeaveReview/DefaultView.aspx?id=OP_5E1_9456__000001_TS159AY,0,0,
Mackenzie Shaw Ltd,OP_5HJ_4077__000001_LS224LL,OPT,14 Westgate,,Wetherby,,,LS22 6LL,Tel: 01937 583185, - ,,,1 rating Rate it yourself - /Services/opticians/LeaveReview/DefaultView.aspx?id=OP_5HJ_4077__000001_LS224LL,,,
Appleson Optometrists,OP_5HJ_14027__000001_LS226LN,OPT,Appleson Optometrists / Wetherby Eye Clinic,43 Market Place,Wetherby,Leeds,,LS22 6LN,Tel: 01937 583278, - ,,,171 ratings Rate it yourself - /Services/opticians/LeaveReview/DefaultView.aspx?id=OP_5HJ_14027__000001_LS226LN,,,
Cameron Beaumont Opticians,CO-5155,OPT,,2-4 North Street,,Wetherby,Yorkshire,LS22 6NN,Tel: 01937 585742, - ,,,No ratings yet Rate it yourself - /Services/opticians/LeaveReview/DefaultView.aspx?id=CO-5155,0,0,
Specsavers Opticians,OP_5J6_4803__000002_LS226FL,OPT,The Horsefair Centre,,,Wetherby,,LS22 6FL,Tel: 01937 545 370, - ,,,No ratings yet Rate it yourself - /Services/opticians/LeaveReview/DefaultView.aspx?id=OP_5J6_4803__000002_LS226FL,0,0,
Vision Express (UK) Ltd,OP_5HJ_6604__000001_LS224NE,OPT,,25A Market Place,,Wetherby,West Yorkshire,LS22 6LQ,Tel: 01937 581142, - ,,,No ratings yet Rate it yourself - /Services/opticians/LeaveReview/DefaultView.aspx?id=OP_5HJ_6604__000001_LS224NE,0,0,
Boots-Wetherby,LDS194__000004_LS226LQ,OPT,25B Market Place,,,Wetherby,West Yorkshire,LS22 6LQ,Tel: 01937 588635, - ,,,1 rating Rate it yourself - /Services/opticians/LeaveReview/DefaultView.aspx?id=LDS194__000004_LS226LQ,,,
Specsavers,OP_5HM_14162__000001_LS208PS,OPT,Morrisons Supermarket,89a Otley Road,Guiseley,LEEDS,,LS20 8PS,Tel: 01943 879977, - ,,,No ratings yet Rate it yourself - /Services/opticians/LeaveReview/DefaultView.aspx?id=OP_5HM_14162__000001_LS208PS,0,0,
Hepworth Opticians,TS17 0WA,OPT,,Myton Park,26 Myton Road,Ingleby Barwick,Yorkshire(North Riding),TS17 0WA,Tel: 01642 767734, - ,,,5 ratings Rate it yourself - /Services/opticians/LeaveReview/DefaultView.aspx?id=TS17 0WA,,,
D Winslow Opticians,OP_5KJ_1337__000001_BD208TU,OPT,1 Holme Lane,Crosshills,Keighley,,,BD20 8TU,Tel: 01535 635085, - ,,,No ratings yet Rate it yourself - /Services/opticians/LeaveReview/DefaultView.aspx?id=OP_5KJ_1337__000001_BD208TU,0,0,
McCormick & Gorman Opticians,OP_5E1_4148__000002_TS170RR,OPT,17 Greenside,Lowfields,Ingleby Barwick,,,TS17 0RR,Tel: 01642 764441, - ,,,No ratings yet Rate it yourself - /Services/opticians/LeaveReview/DefaultView.aspx?id=OP_5E1_4148__000002_TS170RR,0,0,
Clarus Opticians,OPT_BD213RL_1,OPT,,46 Cavendish Street,,Keighley,,BD21 3RL,Tel: 01535 930116, - ,,,No ratings yet Rate it yourself - /Services/opticians/LeaveReview/DefaultView.aspx?id=OPT_BD213RL_1,0,0,
Airedale Eyecare Ltd,OP_5AW_14317__000001_BD213QE,OPT,50 Towngate,,Keighley,,,BD21 3QE,Tel: 01535 690077, - ,,,No ratings yet Rate it yourself - /Services/opticians/LeaveReview/DefaultView.aspx?id=OP_5AW_14317__000001_BD213QE,0,0,
Eyecare Opticians,OP_5AW_14976__000001_BD212DF,OPT,24-26 Belgrave Road,,Keighley,bradford,,BD21 2DF,Tel: 01535 602200, - ,,,No ratings yet Rate it yourself - /Services/opticians/LeaveReview/DefaultView.aspx?id=OP_5AW_14976__000001_BD212DF,0,0,
Boots-Keighley - Bow St,OP_5AW_3281__000001_BD213QD,OPT,30 Bow Street,,,Keighley,West Yorkshire,BD21 3QD,Tel: 01535 610019, - ,,,No ratings yet Rate it yourself - /Services/opticians/LeaveReview/DefaultView.aspx?id=OP_5AW_3281__000001_BD213QD,0,0,
Michael J Leaver,OP_5AW_14055__000001_BD212AU,OPT,40 Devonshire Street,Keighley,West Yorkshire,,,BD21 2AU,Tel: 01535 602935, - ,,,No ratings yet Rate it yourself - /Services/opticians/LeaveReview/DefaultView.aspx?id=OP_5AW_14055__000001_BD212AU,0,0,
Knowle Park Opticians,QDD00173__000001_BD211HD,OPT,,42 Devonshire Street ,Keighley,West Yorkshire,,BD21 2AU,Tel: 01535 681100, - ,,,No ratings yet Rate it yourself - /Services/opticians/LeaveReview/DefaultView.aspx?id=QDD00173__000001_BD211HD,0,0,
Keighley Specsavers Ltd,OP_5AW_5725__000002_BD213PY,OPT,36 Queensway,Airedale Centre,Keighley,,,BD21 3PY,Tel: 01535 669997, - ,,,1 rating Rate it yourself - /Services/opticians/LeaveReview/DefaultView.aspx?id=OP_5AW_5725__000002_BD213PY,,,
Vision Express (UK) Ltd,OP_5AW_580__000001_BD213NN,OPT,,25 College Walk,Airedale Centre,Keighley,West Yorkshire,BD21 3QA,Tel: 01535 603098, - ,,,No ratings yet Rate it yourself - /Services/opticians/LeaveReview/DefaultView.aspx?id=OP_5AW_580__000001_BD213NN,0,0,
Cooper & Barr Opticians,OP_5KH_2940__000001_TS95AD,OPT,,35 High Street,Stokesley,Middlesbrough,,TS9 5AD,Tel: 01642 710832, - ,,,No ratings yet Rate it yourself - /Services/opticians/LeaveReview/DefaultView.aspx?id=OP_5KH_2940__000001_TS95AD,0,0,yes
Andrew Morgan Optometrist,OP_5HJ_14030__000002_LS236BW,OPT,170 High Street,Boston Spa,Leeds,,,LS23 6BW,Tel: 01937 849933, - ,,,2 ratings Rate it yourself - /Services/opticians/LeaveReview/DefaultView.aspx?id=OP_5HJ_14030__000002_LS236BW,,,
Mellis Eyecare,OP_5E1_14946__000001_TS170DD,OPT,Thornaby Medical Centre,Trenchard Avenue,Thornaby,Stockton-on-Tees,Cleveland,TS17 0DD,Tel: 01642 751048, - ,,,No ratings yet Rate it yourself - /Services/opticians/LeaveReview/DefaultView.aspx?id=OP_5E1_14946__000001_TS170DD,0,0,
Asda Opticians,OPT_TS17 9EN,OPT,,ALLENSWAY,,THORNABY,,TS17 9EN,Tel: 01642 768420, - ,,,1 rating Rate it yourself - /Services/opticians/LeaveReview/DefaultView.aspx?id=OPT_TS17 9EN,,,
Morton T D,OP_5E1_13806__000001_TS179EX,OPT,6 St Peters Houe,Thornaby Town Centre,,Thornaby,,TS17 9FF,Tel: 01642 760042, - ,,,No ratings yet Rate it yourself - /Services/opticians/LeaveReview/DefaultView.aspx?id=OP_5E1_13806__000001_TS179EX,0,0,
Specsavers Opticians,OP_5E1_2578__000001_TS181AF,OPT,73 High Street,,Stockton-on-Tees,,,TS18 1AF,Tel: 01642 602020, - ,,,1 rating Rate it yourself - /Services/opticians/LeaveReview/DefaultView.aspx?id=OP_5E1_2578__000001_TS181AF,,,
Vision Express (Stockton Ltd),OP_5E1_14004__000001_TS181RH,OPT,29 Wellington Square,Stockton On Tees,,,,TS18 1RH,Tel: 01642 628910, - ,,,No ratings yet Rate it yourself - /Services/opticians/LeaveReview/DefaultView.aspx?id=OP_5E1_14004__000001_TS181RH,0,0,
Boots-Stockton-On-Tees,OP_5E1_10640__000001_TS181SF,OPT,28 High Street,,,Stockton-On-Tees,Cleveland,TS18 1SF,Tel: 01642 676 656, - ,,,No ratings yet Rate it yourself - /Services/opticians/LeaveReview/DefaultView.aspx?id=OP_5E1_10640__000001_TS181SF,0,0,
Henderson Opticians,OP_5E1_2654__000001_TS182AA,OPT,4 Bishopton Lane,,Stockton-on-Tees,,,TS18 2AA,Tel: 01642 673071, - ,,,No ratings yet Rate it yourself - /Services/opticians/LeaveReview/DefaultView.aspx?id=OP_5E1_2654__000001_TS182AA,0,0,
ADS Eye Clinic,OP_5E1_6232__000001_TS182BW,OPT,,19 - 23 Norton Road,,Stockton-on-Tees,Cleveland,TS18 2BW,Tel: 01642 676327, - ,,,No ratings yet Rate it yourself - /Services/opticians/LeaveReview/DefaultView.aspx?id=OP_5E1_6232__000001_TS182BW,0,0,
Specsavers ,OP_5KM__000004_TS80TJ,OPT,Unit 9 Parkway Shopping Centre,Coulby Newham,Middlesbrough,,,TS8 0TJ,Tel: 01642 579 010, - ,,,No ratings yet Rate it yourself - /Services/opticians/LeaveReview/DefaultView.aspx?id=OP_5KM__000004_TS80TJ,0,0,
Asda Opticians,OPT_TS18 2PB,OPT,,PORTRACK LANE,,STOCKTON - ON - TEES,,TS18 2PB,Tel: 01642 623302, - ,,,No ratings yet Rate it yourself - /Services/opticians/LeaveReview/DefaultView.aspx?id=OPT_TS18 2PB,0,0,
Stokeld & Stephens Opticians,OP_5KM_2580__000002_TS78DX,OPT,42 Stokesley Road,Marton-In-Cleveland,Middlesbrough,,,TS7 8DX,Tel: 01642 322386, - ,,,No ratings yet Rate it yourself - /Services/opticians/LeaveReview/DefaultView.aspx?id=OP_5KM_2580__000002_TS78DX,0,0,
McCormick & Gorman Opticians,OP_5KM_4518__000001_TS55DY,OPT,7 Oxford Road,,Middlesbrough,,,TS5 5DY,Tel: 01642 814745, - ,,,No ratings yet Rate it yourself - /Services/opticians/LeaveReview/DefaultView.aspx?id=OP_5KM_4518__000001_TS55DY,0,0,
Boots-York - Clifton Moor,YO30 4XZ_18270,OPT,,7-8 Stirling Road,,Clifton Moor Centre,Yorkshire,YO30 4XZ,Tel: 01904 690337, - ,,,No ratings yet Rate it yourself - /Services/opticians/LeaveReview/DefaultView.aspx?id=YO30 4XZ_18270,0,0,
T D Morton Opticians,OP_5E1_4149__000001_TS201BQ,OPT,10 Leven Road,,Stockton-on-Tees,,,TS20 1BQ,Tel: 01642 554313, - ,,,No ratings yet Rate it yourself - /Services/opticians/LeaveReview/DefaultView.aspx?id=OP_5E1_4149__000001_TS201BQ,0,0,
Moorhouse Opticians Ltd,OP_5E2_2897__000001_LS249JB,OPT,13 Westgate,,Tadcaster,,,LS24 9JB,Tel: 01937 832257, - ,,,No ratings yet Rate it yourself - /Services/opticians/LeaveReview/DefaultView.aspx?id=OP_5E2_2897__000001_LS249JB,0,0,
Groves Opticians ,OP_5E2_14410__000002_YO304RZ,OPT,Tower Court Health Centre,Oakdale Road,Clifton Moor,,,YO30 4RZ,Tel: 01904 479555, - ,,,No ratings yet Rate it yourself - /Services/opticians/LeaveReview/DefaultView.aspx?id=OP_5E2_14410__000002_YO304RZ,0,0,
Eye Deal Optical,OP_5KM^01__000001_TS13QY,OPT,One Life Centre,Linthorpe Road,,Middlesbrough,North Yorkshire,TS1 3QY,Tel: 01642 246 193, - ,,,1 rating Rate it yourself - /Services/opticians/LeaveReview/DefaultView.aspx?id=OP_5KM^01__000001_TS13QY,,,
David Dowley Eyecare Opticians,OP_5E2_13997__000002_YO243BL,OPT,50 York Road,Acomb`,,York,North Yorkshire,YO24 4LZ,Tel: 01904 788811, - ,,,1 rating Rate it yourself - /Services/opticians/LeaveReview/DefaultView.aspx?id=OP_5E2_13997__000002_YO243BL,,,
Rayner Opticians,OP_5E2_10720__000003_YO244LZ,OPT,,50a York Road,Acomb,York,Yorkshire,YO24 4LZ,Tel: 01904 785233, - ,,,No ratings yet Rate it yourself - /Services/opticians/LeaveReview/DefaultView.aspx?id=OP_5E2_10720__000003_YO244LZ,0,0,