Organisation Name,NACS Code,Organisation Type,Address1,Address2,Address3,Address4,Address5,PostCode,Telephone Number,Opening time,Value  (Opening time),Banding Classification  (Opening time),NHS.UK users rating,Value  (NHS.UK users rating),Banding Classification  (NHS.UK users rating),Car parking (Is there car parking at this organisation?)
Lambrou Eye Studio,OP_5A7_5488__000002_BR68NN,OPT,350 Crofton Road,,Orpington,Bromley,,BR6 8NN,Tel: 01689 850 593, - ,,,2 ratings Rate it yourself - /Services/opticians/LeaveReview/DefaultView.aspx?id=OP_5A7_5488__000002_BR68NN,,,
Tesco Opticians,5A7:15__000002_BR60NH,OPT,9 Augustus Lane,Orpington,Orpington,Kent,,BR6 0NH,, - ,,,No ratings yet Rate it yourself - /Services/opticians/LeaveReview/DefaultView.aspx?id=5A7:15__000002_BR60NH,0,0,
William J Wilkinson Limited,OP_5A7_470__000001_BR60PD,OPT,277 High Street,,Orpington,,,BR6 0NW,Tel: 01689 820866, - ,,,No ratings yet Rate it yourself - /Services/opticians/LeaveReview/DefaultView.aspx?id=OP_5A7_470__000001_BR60PD,0,0,
Boots-Orpington - High St,OP_5A7_10401__000002_BR60LS,OPT,232 High Street,,,Orpington,Kent,BR6 0LS,Tel: 01689 820 848, - ,,,No ratings yet Rate it yourself - /Services/opticians/LeaveReview/DefaultView.aspx?id=OP_5A7_10401__000002_BR60LS,0,0,
Boots Opticians ,OP_5A7_6080__000002_BR60JN,OPT,194 High Street,,Orpington,,,BR6 0JN,Tel: 01689 891303, - ,,,No ratings yet Rate it yourself - /Services/opticians/LeaveReview/DefaultView.aspx?id=OP_5A7_6080__000002_BR60JN,0,0,
Specsavers Opticians,BR6 0TW__000001_BR60TW,OPT,,175 High Street,,Orpington,Kent,BR6 0LW,Tel: 01689 890 168, - ,,,No ratings yet Rate it yourself - /Services/opticians/LeaveReview/DefaultView.aspx?id=BR6 0TW__000001_BR60TW,0,0,
Boots-Petts Wood,BR5 1DE__000001_BR51DE,OPT,12 Chatsworth Parade,,,Petts Wood,Kent,BR5 1DF,Tel: 01689 823 250, - ,,,No ratings yet Rate it yourself - /Services/opticians/LeaveReview/DefaultView.aspx?id=BR5 1DE__000001_BR51DE,0,0,
Steven Harris Opticians,OP_5A7_831__000002_BR51NA,OPT,16 Station Square,Petts Wood,Orpington,Kent,,BR5 1NA,Tel: 01689 831726, - ,,,No ratings yet Rate it yourself - /Services/opticians/LeaveReview/DefaultView.aspx?id=OP_5A7_831__000002_BR51NA,0,0,
Boots-Hayes,BR2 7EH__000001_BR27EH,OPT,2 Station Buildings,Station Approach,Hayes,Kent,,BR2 7EN,Tel: 020 8462 5332, - ,,,No ratings yet Rate it yourself - /Services/opticians/LeaveReview/DefaultView.aspx?id=BR2 7EH__000001_BR27EH,0,0,
Vision Express (UK) Limited,BR5 3RP__000001_BR53RP,OPT,"Unit 9,",Nugent Shopping Park,Orpington,Kent,,BR5 3RP,Tel: 01689 875737, - ,,,No ratings yet Rate it yourself - /Services/opticians/LeaveReview/DefaultView.aspx?id=BR5 3RP__000001_BR53RP,0,0,
Boots-Bromley - The Glades,OP_5A7_7470__000001_BR11DD,OPT,40 The Glades,,,Bromley,Kent,BR1 2QG,Tel: 0208 460 4944, - ,,,5 ratings Rate it yourself - /Services/opticians/LeaveReview/DefaultView.aspx?id=OP_5A7_7470__000001_BR11DD,,,
Day Lewis Opticians,OP_5A7_1378__000001_TN163AY,OPT,116 Main Road,Biggin Hill,Westerham,,,TN16 3AY,Tel: 01959 572535, - ,,,No ratings yet Rate it yourself - /Services/opticians/LeaveReview/DefaultView.aspx?id=OP_5A7_1378__000001_TN163AY,0,0,
William J Wilkinson Limited,OP_5A7_4486__000001_BR11EA,OPT,42 High Street,,Bromley,,,BR1 1EA,Tel: 020 8464 5347, - ,,,No ratings yet Rate it yourself - /Services/opticians/LeaveReview/DefaultView.aspx?id=OP_5A7_4486__000001_BR11EA,0,0,
Specology Limited,OP_TN163BA_29288,OPT,,"Unit 9, 160-166 Main Road",,"Biggin Hill, Kent",,TN16 3BA,Tel: 01959 928001, - ,,,No ratings yet Rate it yourself - /Services/opticians/LeaveReview/DefaultView.aspx?id=OP_TN163BA_29288,0,0,
Glasses Lab,01-19725,OPT,,62 High Street,,Bromley,,BR1 1EG,Tel: 0208 466 1315, - ,,,No ratings yet Rate it yourself - /Services/opticians/LeaveReview/DefaultView.aspx?id=01-19725,0,0,
Boots-West Wickham,OP_5A7__000002_BR40PX,OPT,115 Station Road,,,West Wickham,Kent,BR4 0PX,Tel: 0208 777 2211, - ,,,1 rating Rate it yourself - /Services/opticians/LeaveReview/DefaultView.aspx?id=OP_5A7__000002_BR40PX,,,
Specsavers Opticians,19223__000002_BR40NH,OPT,15 High Street,,West Wickham,Kent,,BR4 0LP,Tel: 020 8916 8280, - ,,,No ratings yet Rate it yourself - /Services/opticians/LeaveReview/DefaultView.aspx?id=19223__000002_BR40NH,0,0,
Real Eyes The Eye Clinic,OP_5K9_9387__000002_CR00JB,OPT,26 Central Parade,New Addington,,Croydon,,CR0 0JB,Tel: 01689 842152, - ,,,No ratings yet Rate it yourself - /Services/opticians/LeaveReview/DefaultView.aspx?id=OP_5K9_9387__000002_CR00JB,0,0,
Vision Express (UK) Limited,OP_5A7_11781__000002_BR11DN,OPT,29 Glades Shopping Centre,High Street,Bromley,,,BR1 1DN,Tel: 020 8313 1545, - ,,,No ratings yet Rate it yourself - /Services/opticians/LeaveReview/DefaultView.aspx?id=OP_5A7_11781__000002_BR11DN,0,0,
The Bromley Eye Centre,2BR1 1DD__000003_BR11DD,OPT,"Unit 48, The Glades",,Bromley,Kent,,BR1 1DD,Tel: 020 8466 8333, - ,,,1 rating Rate it yourself - /Services/opticians/LeaveReview/DefaultView.aspx?id=2BR1 1DD__000003_BR11DD,,,
Oakmead Opticians,02991__000002_BR75LX,OPT,Sunnyways,Prince Imperial Way,Chislehurst,Kent,,BR7 5LX,, - ,,,1 rating Rate it yourself - /Services/opticians/LeaveReview/DefaultView.aspx?id=02991__000002_BR75LX,,,
M&S Opticians,,OPT,,123 High Street,,Bromley,,BR1 1JL,Tel: 0203 0054415, - ,,,N/A - Data not available,,,
Specsavers Opticians,OP_5A7_1174__000003_BR11EY,OPT,146 High Street,,Bromley,,,BR1 1EZ,Tel: 020 8466 9666, - ,,,No ratings yet Rate it yourself - /Services/opticians/LeaveReview/DefaultView.aspx?id=OP_5A7_1174__000003_BR11EY,0,0,
J C Setton Opticians,OP_5A7_1927__000001_BR40NH,OPT,58 High Street,,West Wickham,,,BR4 0NH,Tel: 020 8777 1106, - ,,,No ratings yet Rate it yourself - /Services/opticians/LeaveReview/DefaultView.aspx?id=OP_5A7_1927__000001_BR40NH,0,0,
AK Bennett Opticians,OP_5A7_1909__000001_BR40LS,OPT,65 High Street,65 High Street,West Wickham,Bromley,Kent,BR4 0LS,Tel: 020 8777 1337, - ,,,1 rating Rate it yourself - /Services/opticians/LeaveReview/DefaultView.aspx?id=OP_5A7_1909__000001_BR40LS,,,
Linklater & Warren Opticians,RL_04122014_CO-4763,OPT,,30a High Street,,Chislehurst,Kent,BR7 5AN,Tel: 020 8295 5131, - ,,,2 ratings Rate it yourself - /Services/opticians/LeaveReview/DefaultView.aspx?id=RL_04122014_CO-4763,,,no
Colletts Opticians Ltd,OP_5AX_2176__000001_DA146ND,OPT,103 Main Road,Sidcup,Kent,,,DA14 6ND,Tel: 0208 300 3222, - ,,,No ratings yet Rate it yourself - /Services/opticians/LeaveReview/DefaultView.aspx?id=OP_5AX_2176__000001_DA146ND,0,0,
Specsavers Opticians,OP_5AX_14708__000001_DA146ED,OPT,53 High Street,Sidcup,Kent,,,DA14 6ED,Tel: 0208 308 3500, - ,,,No ratings yet Rate it yourself - /Services/opticians/LeaveReview/DefaultView.aspx?id=OP_5AX_14708__000001_DA146ED,0,0,
Specsavers Opticians Swanley,OPT_BR87TQ_1,OPT,,Unit 39 The Shopping Centre,,Swanley,Kent,BR8 7TQ,Tel: 01322 614827, - ,,,1 rating Rate it yourself - /Services/opticians/LeaveReview/DefaultView.aspx?id=OPT_BR87TQ_1,,,
Robert Murrell incorporating Armstrong and North,W4X1M,OPT,,17 Swanley Centre,,Swanley,Kent,BR8 7TG,Tel: 01322 663231, - ,,,No ratings yet Rate it yourself - /Services/opticians/LeaveReview/DefaultView.aspx?id=W4X1M,0,0,
Grove Park opticians,OP_5LF__000003_SE120EF,OPT,384 Baring Road,Grove Park,London,,,SE12 0EF,, - ,,,No ratings yet Rate it yourself - /Services/opticians/LeaveReview/DefaultView.aspx?id=OP_5LF__000003_SE120EF,0,0,
Steven Harris Opticians,OP_5A7_2625__000001_BR33NP,OPT,2-6 Village Way,,Beckenham,,,BR3 3NP,Tel: 020 8650 6172, - ,,,2 ratings Rate it yourself - /Services/opticians/LeaveReview/DefaultView.aspx?id=OP_5A7_2625__000001_BR33NP,,,
Asda Opticians (Swanley),OPT_BR8 7UN,OPT,,London Road,,Swanley,,BR8 7UN,Tel: 01322 661963, - ,,,3 ratings Rate it yourself - /Services/opticians/LeaveReview/DefaultView.aspx?id=OPT_BR8 7UN,,,
Boots Opticians,OP_5A7_112__000002_BR31ED,OPT,64 High Street,,Beckenham,Beckenham,,BR3 1EN,Tel: 020 8650 0033, - ,,,No ratings yet Rate it yourself - /Services/opticians/LeaveReview/DefaultView.aspx?id=OP_5A7_112__000002_BR31ED,0,0,
Boots-Beckenham,BR3 1EN_98721,OPT,,64 High Street,,Beckenham,Kent,BR3 1EN,Tel: 0208 650 0033, - ,,,No ratings yet Rate it yourself - /Services/opticians/LeaveReview/DefaultView.aspx?id=BR3 1EN_98721,0,0,
Specsavers Opticians,BR3 1EW__000002_BR31EW,OPT,176 High Street,,Beckenham,Kent,,BR3 1EW,Tel: 020 8658 5252, - ,,,2 ratings Rate it yourself - /Services/opticians/LeaveReview/DefaultView.aspx?id=BR3 1EW__000002_BR31EW,,,
Ellis & Edwards Opticians,BR3 1DZ__000001_BR31DZ,OPT,254 High Street,,Beckenham,Kent,,BR3 1DZ,Tel: 020 8658 2313, - ,,,No ratings yet Rate it yourself - /Services/opticians/LeaveReview/DefaultView.aspx?id=BR3 1DZ__000001_BR31DZ,0,0,
Points Of View Opticians,OP_5LF_10152__000002_BR14PQ,OPT,495a Bromley Road,,Bromley,Kent,,BR1 4PQ,Tel: 020 8697 2321, - ,,,No ratings yet Rate it yourself - /Services/opticians/LeaveReview/DefaultView.aspx?id=OP_5LF_10152__000002_BR14PQ,0,0,
Dermott Optical Limited,5A7:20__000001_BR33RB,OPT,147 Croydon Road,,Beckenham,Kent,,BR3 3RB,Tel: 020 8663 3323, - ,,,No ratings yet Rate it yourself - /Services/opticians/LeaveReview/DefaultView.aspx?id=5A7:20__000001_BR33RB,0,0,
Brian Ashby Opticians Ltd,TP425,OPT,,"24 West Park, Mottingham",,London,,SE9 4RQ,Tel: 020 8851 7422, - ,,,No ratings yet Rate it yourself - /Services/opticians/LeaveReview/DefaultView.aspx?id=TP425,0,0,
Basil H Bloom Optometrist,OP_5K9_2344__000002_CR28LH,OPT,121 Addington Road,,,South Croydon,,CR2 8LH,Tel: 020 8657 2000, - ,,,No ratings yet Rate it yourself - /Services/opticians/LeaveReview/DefaultView.aspx?id=OP_5K9_2344__000002_CR28LH,0,0,
Broadgreen Eye Centre,OP - 5N5__000001_CR07TH,OPT,254 London Road,,West Croydon,Surrey,,CR0 7TH,, - ,,,No ratings yet Rate it yourself - /Services/opticians/LeaveReview/DefaultView.aspx?id=OP - 5N5__000001_CR07TH,0,0,
Leadbeater & Harris Opticians,OP_5K9_414__000001_CR06RF,OPT,305 Lower Addiscombe Road,,,Croydon,Surrey,CR0 6RF,Tel: 020 8654 5559, - ,,,No ratings yet Rate it yourself - /Services/opticians/LeaveReview/DefaultView.aspx?id=OP_5K9_414__000001_CR06RF,0,0,
Colletts Opticians Ltd,OP_5A8_5844__000001_SE95DA,OPT,43 Passey Place,Eltham,London,,,SE9 5DA,Tel: 020 8850 3415, - ,,,No ratings yet Rate it yourself - /Services/opticians/LeaveReview/DefaultView.aspx?id=OP_5A8_5844__000001_SE95DA,0,0,
Specsavers Opticians,OP_5A8_9996__000001_SE91BJ,OPT,126 Eltham High Street,,Eltham,London,,SE9 1BJ,Tel: 020 8850 8800, - ,,,2 ratings Rate it yourself - /Services/opticians/LeaveReview/DefaultView.aspx?id=OP_5A8_9996__000001_SE91BJ,,,
Specsavers Opticians,16797__000002_SE207PF,OPT,191 High Street,,Penge,London,,SE20 7PF,Tel: 020 8659 4040, - ,,,No ratings yet Rate it yourself - /Services/opticians/LeaveReview/DefaultView.aspx?id=16797__000002_SE207PF,0,0,
Boots-London - Eltham,OP_5A8_14685__000001_SE91TD,OPT,93 Eltham High Street,,Eltham,London,,SE9 1TD,Tel: 0208 850 1783, - ,,,No ratings yet Rate it yourself - /Services/opticians/LeaveReview/DefaultView.aspx?id=OP_5A8_14685__000001_SE91TD,0,0,
Westerham Eye Care,TN16 1RF,OPT,,18 High Street,,Westerham,,TN16 1RF,Tel: 01959447611, - ,,,1 rating Rate it yourself - /Services/opticians/LeaveReview/DefaultView.aspx?id=TN16 1RF,,,
Baileys Opticians,OP_5K9_7651__000002_CR29LA,OPT,1 Limpsfield Road,Sanderstead,,South Croydon,,CR2 9LA,Tel: 020 8657 3525, - ,,,No ratings yet Rate it yourself - /Services/opticians/LeaveReview/DefaultView.aspx?id=OP_5K9_7651__000002_CR29LA,0,0,
S Gothelf & Associates,OP_5AX_10318__000001_DA159NB,OPT,10 Wellington Parade,,Sidcup,Kent,,DA15 9NB,Tel: 0208 303 3935, - ,,,2 ratings Rate it yourself - /Services/opticians/LeaveReview/DefaultView.aspx?id=OP_5AX_10318__000001_DA159NB,,,
Maxivise Eyecare Centre,OP_5A7_1649__000001_SE207HB,OPT,,88 High Street,London,Penge,,SE20 7HB,Tel: 020 8659 4342, - ,,,No ratings yet Rate it yourself - /Services/opticians/LeaveReview/DefaultView.aspx?id=OP_5A7_1649__000001_SE207HB,0,0,
R.W.H. Clements,OP_5K9_5641__000001_SE254UG,OPT,1 Portland Road,,,London,,SE25 4UG,Tel: 020 8654 4171, - ,,,No ratings yet Rate it yourself - /Services/opticians/LeaveReview/DefaultView.aspx?id=OP_5K9_5641__000001_SE254UG,0,0,
Day Lewis Opticians (Riverhead),OP_5FF_8001__000001_TN132BH,OPT,1 London Road,,Sevenoaks,Riverhead,,TN13 2BH,Tel: 01732 451039, - ,,,No ratings yet Rate it yourself - /Services/opticians/LeaveReview/DefaultView.aspx?id=OP_5FF_8001__000001_TN132BH,0,0,
Visual Eyes Opticians,OP_5K9_14395__000001_CR06BB,OPT,144 Cherry Orchard Road,Croydon,,,,CR0 6BB,Tel: 020 8688 0047, - ,,,No ratings yet Rate it yourself - /Services/opticians/LeaveReview/DefaultView.aspx?id=OP_5K9_14395__000001_CR06BB,0,0,
Croydon Vision Care,TP8EP,OPT,Croydon Vision Care,Opticians,44 Lower Addiscombe Road,Croydon,Surrey,CR0 6AA,Tel: 0203 645 1456, - ,,,No ratings yet Rate it yourself - /Services/opticians/LeaveReview/DefaultView.aspx?id=TP8EP,0,0,
Jay Opticians,OP_5LF_10821__000002_SE265EX,OPT,23 Sydenham Road,,London,,,SE26 5EX,Tel: 020 8778 7956, - ,,,No ratings yet Rate it yourself - /Services/opticians/LeaveReview/DefaultView.aspx?id=OP_5LF_10821__000002_SE265EX,0,0,
R Woodfall Opticians,OP_5LF_6203__000003_SE265QW,OPT,6 Sydenham Road,,London,,,SE26 5QW,Tel: 020 8778 4557, - ,,,1 rating Rate it yourself - /Services/opticians/LeaveReview/DefaultView.aspx?id=OP_5LF_6203__000003_SE265QW,,,
Ronald Brown Opticians,OP_5LF_1993__000002_SE64HQ,OPT,154 Rushey Green,,Catford,London,,SE6 4HQ,Tel: 020 8690 6788, - ,,,1 rating Rate it yourself - /Services/opticians/LeaveReview/DefaultView.aspx?id=OP_5LF_1993__000002_SE64HQ,,,
Catford Specsavers,5LF 41__000003_SE64HQ,OPT,,130-134 Rushey Green,Catford,London,,SE6 4HQ,Tel: 02083142370, - ,,,1 rating Rate it yourself - /Services/opticians/LeaveReview/DefaultView.aspx?id=5LF 41__000003_SE64HQ,,,
K Rowland Ltd,OP_5LF_8908__000003_SE64HW,OPT,112 Rushey Green,,London,Catford,,SE6 4HW,Tel: 020 8690 7734, - ,,,No ratings yet Rate it yourself - /Services/opticians/LeaveReview/DefaultView.aspx?id=OP_5LF_8908__000003_SE64HW,0,0,
Healthcall Optical Services Ltd,OP_5K9_11724__000001_CR26EB,OPT,The Pavillions,31-33 Brighton Road,South Croydon,,,CR2 6EB,Tel: 0845 601 7241, - ,,,No ratings yet Rate it yourself - /Services/opticians/LeaveReview/DefaultView.aspx?id=OP_5K9_11724__000001_CR26EB,0,0,
Optical Express,OP_5K9_7722__000001_CR01UY,OPT,Woolwich House,43 George Street,,Croydon,Surrey,CR0 1LB,Tel: 0800 023 2020, - ,,,No ratings yet Rate it yourself - /Services/opticians/LeaveReview/DefaultView.aspx?id=OP_5K9_7722__000001_CR01UY,0,0,
Young's Opticians,OP_5K9_4107__000001_CR01YG,OPT,12 St. Georges Walk,,,Croydon,,CR0 1YG,Tel: 020 8686 0676, - ,,,2 ratings Rate it yourself - /Services/opticians/LeaveReview/DefaultView.aspx?id=OP_5K9_4107__000001_CR01YG,,,
Arthur Hayes Opticians,OP_5K9_10535__000001_CR01UX,OPT,1070 Whitgift Centre,,,Croydon,,CR0 1UX,Tel: 020 8686 0707, - ,,,No ratings yet Rate it yourself - /Services/opticians/LeaveReview/DefaultView.aspx?id=OP_5K9_10535__000001_CR01UX,0,0,
Whitgift Foundation,OP_5K9_1004__000001_CR91SS,OPT,North End,,Croydon,,,CR9 1SS,Tel: 020 8681 2876, - ,,,No ratings yet Rate it yourself - /Services/opticians/LeaveReview/DefaultView.aspx?id=OP_5K9_1004__000001_CR91SS,0,0,
R F Linklater & Partners,OP_5AX_8989__000001_DA161TG,OPT,136 High Street,,Welling,Kent,,DA16 1TJ,Tel: 0208 303 4963, - ,,,1 rating Rate it yourself - /Services/opticians/LeaveReview/DefaultView.aspx?id=OP_5AX_8989__000001_DA161TG,,,
Croydon Optical Ltd,OP_5K9_13029__000001_CR01XB,OPT,1143 Whitgift Centre,,,Croydon,,CR0 1XB,Tel: 020 8680 2828, - ,,,No ratings yet Rate it yourself - /Services/opticians/LeaveReview/DefaultView.aspx?id=OP_5K9_13029__000001_CR01XB,0,0,
Steven Harris Opticians,OP_5AX_14681__000001_DA163PG,OPT,101 Bellegrove Road,,Welling,Kent,,DA16 3PG,Tel: 0208 304 2423, - ,,,No ratings yet Rate it yourself - /Services/opticians/LeaveReview/DefaultView.aspx?id=OP_5AX_14681__000001_DA163PG,0,0,
Rawling and Sons,OP_5K9_14389__000001_CR01YA,OPT,8 High Street,Croydon,,Surrey,,CR0 1YA,Tel: 020 8688 1040, - ,,,No ratings yet Rate it yourself - /Services/opticians/LeaveReview/DefaultView.aspx?id=OP_5K9_14389__000001_CR01YA,0,0,
Second Sight,OP_5AX_2062__000002_DA163PG,OPT,81 Welling High Street,,Welling,Kent,,DA16 1TY,Tel: 0208 301 4586, - ,,,1 rating Rate it yourself - /Services/opticians/LeaveReview/DefaultView.aspx?id=OP_5AX_2062__000002_DA163PG,,,
Boots-Croydon - Whitgift Centre,OP_5K9_2997__000001_CR91SN,OPT,12-18 Whitgift Centre,,,Croydon,Surrey,CR9 1SN,Tel: 0208 680 2733, - ,,,5 ratings Rate it yourself - /Services/opticians/LeaveReview/DefaultView.aspx?id=OP_5K9_2997__000001_CR91SN,,,
Vision Express ,OP_5K9_12585__000001_CR01TJ,OPT,73 North End,,,Croydon,,CR0 1TJ,Tel: 020 8649 7280, - ,,,1 rating Rate it yourself - /Services/opticians/LeaveReview/DefaultView.aspx?id=OP_5K9_12585__000001_CR01TJ,,,
For Eyes (Optimistry Ltd),OPT_CR01TB_1,OPT,,55 Frith Road,,Croydon,Surrey,CR0 1TB,Tel: 020 8662 8012, - ,,,1 rating Rate it yourself - /Services/opticians/LeaveReview/DefaultView.aspx?id=OPT_CR01TB_1,,,
Specsavers Opticians,OP_5K9_765__000001_CR01UD,OPT,112 North End,Croydon,,Surrey,,CR0 1UD,Tel: 020 8681 8688, - ,,,No ratings yet Rate it yourself - /Services/opticians/LeaveReview/DefaultView.aspx?id=OP_5K9_765__000001_CR01UD,0,0,
Specsavers Opticians,OP_5K9_916__000001_CR01RH,OPT,19 Church Street,,,Croydon,,CR0 1RH,Tel: 0208 760 0574, - ,,,No ratings yet Rate it yourself - /Services/opticians/LeaveReview/DefaultView.aspx?id=OP_5K9_916__000001_CR01RH,0,0,
Vision Express Ltd,OP_5AX_5408__000003_DA67JJ,OPT,5 The Mall,Broadway Shopping Centre,Bexleyheath,Kent,,DA6 7JJ,Tel: 0208 298 9629, - ,,,No ratings yet Rate it yourself - /Services/opticians/LeaveReview/DefaultView.aspx?id=OP_5AX_5408__000003_DA67JJ,0,0,
Boots-Bexleyheath,OP_5AX_10393__000002_DA67JJ,OPT,25 The Mall,Broadway Shopping Centre,Bexleyheath,Kent,,DA6 7JJ,Tel: 020 8301 5656, - ,,,1 rating Rate it yourself - /Services/opticians/LeaveReview/DefaultView.aspx?id=OP_5AX_10393__000002_DA67JJ,,,
Specsavers Opticians,OP_5AX_227__000001_DA67DQ,OPT,116a Broadway,Bexleyheath,Kent,,,DA6 7DQ,Tel: 0208 298 9920, - ,,,No ratings yet Rate it yourself - /Services/opticians/LeaveReview/DefaultView.aspx?id=OP_5AX_227__000001_DA67DQ,0,0,
Linklater Optometrists,OP_5AX_10048__000002_DA67DQ,OPT,Linklaters Optometrists,120 Broadway,Bexleyheath,Kent,,DA6 7DQ,Tel: 0208 303 4014, - ,,,3 ratings Rate it yourself - /Services/opticians/LeaveReview/DefaultView.aspx?id=OP_5AX_10048__000002_DA67DQ,,,no
Kerr Eyecare,OP_5K9_9062__000001_CR02RE,OPT,37 London Road,,,West Croydon,Surrey,CR0 2RE,Tel: 020 8688 5076, - ,,,6 ratings Rate it yourself - /Services/opticians/LeaveReview/DefaultView.aspx?id=OP_5K9_9062__000001_CR02RE,,,
Hatton Opticians,OP_5LF_234__000001_SE232ND,OPT,4 Westbourne Terrace,,London,,,SE23 2ND,Tel: 020 8699 5575, - ,,,No ratings yet Rate it yourself - /Services/opticians/LeaveReview/DefaultView.aspx?id=OP_5LF_234__000001_SE232ND,0,0,
Miller & Son (Opticians) Ltd,OP_5K9_9904__000001_SE192ET,OPT,28-30 Church Road,,London,,,SE19 2ET,Tel: 020 8653 1366, - ,,,No ratings yet Rate it yourself - /Services/opticians/LeaveReview/DefaultView.aspx?id=OP_5K9_9904__000001_SE192ET,0,0,
Jonathan Kerr Optometrists,TP454,OPT,80 Station Road East,80 Station Road East,Oxted,Surrey,,RH8 0PG,Tel: 01883 722 808, - ,,,No ratings yet Rate it yourself - /Services/opticians/LeaveReview/DefaultView.aspx?id=TP454,0,0,
Boots-Thornton Heath,OP_5K9_742__000001_CR78RY,OPT,87 High Street,,,Thornton Heath,Surrey,CR7 8RY,Tel: 0208 684 1155, - ,,,No ratings yet Rate it yourself - /Services/opticians/LeaveReview/DefaultView.aspx?id=OP_5K9_742__000001_CR78RY,0,0,yes
Batemans (Opticians) Ltd,OP_5KQ_10850__000001_RH80QE,OPT,,149 Station Road East,,Oxted,Surrey,RH8 0QE,Tel: 01883 715 510, - ,,,No ratings yet Rate it yourself - /Services/opticians/LeaveReview/DefaultView.aspx?id=OP_5KQ_10850__000001_RH80QE,0,0,
Thakar Opticians,OP_5KQ_14541__000001_RH80AX,OPT,,81 Station Road East,,Oxted,Surrey,RH8 0AX,Tel: 01883 714 696, - ,,,No ratings yet Rate it yourself - /Services/opticians/LeaveReview/DefaultView.aspx?id=OP_5KQ_14541__000001_RH80AX,0,0,
Specsavers Opticians (Oxted),OPT_RH80BD_1,OPT,,25 Station Road East,,Oxted,Surrey,RH8 0BD,Tel: 01883 772288, - ,,,1 rating Rate it yourself - /Services/opticians/LeaveReview/DefaultView.aspx?id=OPT_RH80BD_1,,,
Spex Direct,OP_5K9_10386__000001_CR04JA,OPT,21 Rectory Grove,,Croydon,,,CR0 4JA,Tel: 020 8407 1728, - ,,,No ratings yet Rate it yourself - /Services/opticians/LeaveReview/DefaultView.aspx?id=OP_5K9_10386__000001_CR04JA,0,0,
Crystal Eye Centre,OP_5K9_14393__000002_SE191XX,OPT,20 Westow Hill,Upper Norwood,,London,,SE19 1RX,Tel: 0208 766 7476, - ,,,No ratings yet Rate it yourself - /Services/opticians/LeaveReview/DefaultView.aspx?id=OP_5K9_14393__000002_SE191XX,0,0,
Marratt & Ellis,OP_5LF_10028__000001_SE233HF,OPT,50 London Road,,London,,,SE23 3HF,Tel: 020 8699 3196, - ,,,No ratings yet Rate it yourself - /Services/opticians/LeaveReview/DefaultView.aspx?id=OP_5LF_10028__000001_SE233HF,0,0,
Eyeland Visioncare,OP_5LF_7832__000001_SE136AA,OPT,195 Lewisham High Street,,London,,,SE13 6AA,Tel: 020 8852 0761, - ,,,No ratings yet Rate it yourself - /Services/opticians/LeaveReview/DefaultView.aspx?id=OP_5LF_7832__000001_SE136AA,0,0,
Specsavers Opticians,OP_5LF_8691__000001_SE136JL,OPT,174 Lewisham High Street,Lewisham,London,,,SE13 6JL,Tel: 020 8297 2777, - ,,,No ratings yet Rate it yourself - /Services/opticians/LeaveReview/DefaultView.aspx?id=OP_5LF_8691__000001_SE136JL,0,0,
Butcher Curnow Ophthalmic Opticians,OP_5LF_12480__000001_SE30BU,OPT,19 Tranquil Vale,,London,,,SE3 0BU,Tel: 020 8318 1732, - ,,,No ratings yet Rate it yourself - /Services/opticians/LeaveReview/DefaultView.aspx?id=OP_5LF_12480__000001_SE30BU,0,0,
Specsavers Crayford,G1O1G,OPT,Sainsbury's,Stadium Way,,Dartford,Kent,DA1 4HW,Tel: 01322 470662, - ,,,1 rating Rate it yourself - /Services/opticians/LeaveReview/DefaultView.aspx?id=G1O1G,,,
Infocus,Q4T1O,OPT,,13 Montpelier Vale,,Blackheath,,SE3 0TA,Tel: 020 8852 4406, - ,,,No ratings yet Rate it yourself - /Services/opticians/LeaveReview/DefaultView.aspx?id=Q4T1O,0,0,
Vision Express (UK) Ltd,OP_5LF_12228__000001_SE137EP,OPT,Unit 39,The Lewisham Centre,Lewisham,,,SE13 7EP,Tel: 0208 318 7147, - ,,,No ratings yet Rate it yourself - /Services/opticians/LeaveReview/DefaultView.aspx?id=OP_5LF_12228__000001_SE137EP,0,0,
Crayford Opticial Centre,OP_5AX_1701__000001_DA14ES,OPT,11a Crayford High Street,,Crayford,Kent,,DA1 4HH,Tel: 01322557700, - ,,,No ratings yet Rate it yourself - /Services/opticians/LeaveReview/DefaultView.aspx?id=OP_5AX_1701__000001_DA14ES,0,0,
Crofton Park Opticians,OP_5LF_2739__000002_SE42BY,OPT,384 Brockley Road,,London,,,SE4 2BY,Tel: 020 8692 8335, - ,,,2 ratings Rate it yourself - /Services/opticians/LeaveReview/DefaultView.aspx?id=OP_5LF_2739__000002_SE42BY,,,
Boots-Croydon - London Rd,OP_5K9_2446__000001_CR76AR,OPT,511 London Road,,Thornton Heath,Croydon,Surrey,CR7 6AR,Tel: 0208 689 5565, - ,,,2 ratings Rate it yourself - /Services/opticians/LeaveReview/DefaultView.aspx?id=OP_5K9_2446__000001_CR76AR,,,
William J Wilkinson (Sevenoaks),OP_5FF_3280__000001_TN131UX,OPT,143 High Street,,Kent,Sevenoaks,,TN13 1UX,Tel: 01732 453137, - ,,,1 rating Rate it yourself - /Services/opticians/LeaveReview/DefaultView.aspx?id=OP_5FF_3280__000001_TN131UX,,,
Balham Eyecare Centre,OPT_CR82AA_1,OPT,,4 High Street,Purley,Croydon,,CR8 2AA,Tel: 0207 998 3595, - ,,,No ratings yet Rate it yourself - /Services/opticians/LeaveReview/DefaultView.aspx?id=OPT_CR82AA_1,0,0,
Specsavers,01-14901,OPT,,943 Brighton Road,,Purley,,CR8 2UN,Tel: 0208 6605129, - ,,,No ratings yet Rate it yourself - /Services/opticians/LeaveReview/DefaultView.aspx?id=01-14901,0,0,