Organisation Name,NACS Code,Organisation Type,Address1,Address2,Address3,Address4,Address5,PostCode,Telephone Number,Opening time,Value  (Opening time),Banding Classification  (Opening time),NHS.UK users rating,Value  (NHS.UK users rating),Banding Classification  (NHS.UK users rating),Car parking (Is there car parking at this organisation?)
Armstrong and North Opticians,OP_5KY_2433__000002_GL114AA,OPT,24a Parsonage Street,,Dursley,Gloucestershire,,GL11 4AA,Tel: 01453 545816, - ,,,No ratings yet Rate it yourself - /Services/opticians/LeaveReview/DefaultView.aspx?id=OP_5KY_2433__000002_GL114AA,0,0,
Bailey Opticians,OP_5KY_3374__000001_GL102NG,OPT,15 High Street,Bailey Opticians,15 High Street,Stonehouse,Gloucestershire,GL10 2NG,Tel: 01453 823399, - ,,,No ratings yet Rate it yourself - /Services/opticians/LeaveReview/DefaultView.aspx?id=OP_5KY_3374__000001_GL102NG,0,0,
Finch Optical,L5C9G,OPT,,7 Old Market,,Nailsworth,Gloucestershire,GL6 0DU,Tel: 01453 834339, - ,,,No ratings yet Rate it yourself - /Services/opticians/LeaveReview/DefaultView.aspx?id=L5C9G,0,0,
Mobileyes,OP_GL127JE_30172,OPT,,70 Court Orchard,,Wotton Under edge,Gloucestershire,GL12 7JE,Tel: 01453 842061, - ,,,No ratings yet Rate it yourself - /Services/opticians/LeaveReview/DefaultView.aspx?id=OP_GL127JE_30172,0,0,
Armstrong and North Opticians,OP_5KY_361__000001_GL127ES,OPT,5 Long Street,,,Wotton-under-Edge,,GL12 7ES,Tel: 01453 842851, - ,,,1 rating Rate it yourself - /Services/opticians/LeaveReview/DefaultView.aspx?id=OP_5KY_361__000001_GL127ES,,,
Norville Opticians,OP_5KY_5619__000002_GL127DE,OPT,13 High Street,,Wotton-under-Edge,,,GL12 7DE,Tel: 01453 842129, - ,,,No ratings yet Rate it yourself - /Services/opticians/LeaveReview/DefaultView.aspx?id=OP_5KY_5619__000002_GL127DE,0,0,
Stroud Vision Centre,OP_5KY_9164__000001_GL53DX,OPT,3 George Street,,Stroud,Gloucestershire,,GL5 3DX,Tel: 01453 764103, - ,,,No ratings yet Rate it yourself - /Services/opticians/LeaveReview/DefaultView.aspx?id=OP_5KY_9164__000001_GL53DX,0,0,
Specsavers Opticians,OP_5KY_2376__000001_GL53DE,OPT,22 King Street,,Stroud,Gloucestershire,,GL5 3DE,Tel: 01453 766601, - ,,,1 rating Rate it yourself - /Services/opticians/LeaveReview/DefaultView.aspx?id=OP_5KY_2376__000001_GL53DE,,,
Boots-Stroud,OP_5KY_11005__000001_GL51AU,OPT,9-10 High Street,,Stroud,Gloucestershire,,GL5 1AU,Tel: 01453 764699, - ,,,No ratings yet Rate it yourself - /Services/opticians/LeaveReview/DefaultView.aspx?id=OP_5KY_11005__000001_GL51AU,0,0,
Armstrong and North Opticians,OP_5KY_1260__000001_GL139BP,OPT,Market Place,,Berkeley,Gloucestershire,,GL13 9BP,Tel: 01453 511436, - ,,,No ratings yet Rate it yourself - /Services/opticians/LeaveReview/DefaultView.aspx?id=OP_5KY_1260__000001_GL139BP,0,0,
Signet Armorlite Europe Limited (Kodak Lens Designer Outlet),OP_GL22DE_30173,OPT,,"Davy Way, Waterwells Business Park",,Quedgeley,Gloucestershire,GL2 2DE,Tel: 01452 887470, - ,,,No ratings yet Rate it yourself - /Services/opticians/LeaveReview/DefaultView.aspx?id=OP_GL22DE_30173,0,0,
Haine & Smith Opticians,OP_5KY_10964__000001_GL88JG,OPT,,5 Church Street,Tetbury,Gloucestershire,,GL8 8JG,Tel: 01666 503610, - ,,,No ratings yet Rate it yourself - /Services/opticians/LeaveReview/DefaultView.aspx?id=OP_5KY_10964__000001_GL88JG,0,0,
Poole Optometry,OP_5KY_10708__000002_GL88JG,OPT,2 Church Street,,Tetbury,Gloucestershire,,GL8 8JG,Tel: 01666 502913, - ,,,No ratings yet Rate it yourself - /Services/opticians/LeaveReview/DefaultView.aspx?id=OP_5KY_10708__000002_GL88JG,0,0,
"Tesco Opticians, Quedgeley",OP_GL24PF_30174,OPT,,Bristol Road,,Quedgeley,,GL2 4PF,Tel: 0345 677 9567, - ,,,No ratings yet Rate it yourself - /Services/opticians/LeaveReview/DefaultView.aspx?id=OP_GL24PF_30174,0,0,
John Weygang Optometrist - Quedgeley,,OPT,,100 Bristol Road,,Quedgeley,,GL2 4NA,Tel: 01452 721108, - ,,,N/A - Data not available,,,
Armstrong & North ,OP_5KX_8237__000001_GL155RF,OPT,36-38 Newerne Street,,,Lydney,Gloucestershire,GL15 5RF,Tel: 01594 844956, - ,,,No ratings yet Rate it yourself - /Services/opticians/LeaveReview/DefaultView.aspx?id=OP_5KX_8237__000001_GL155RF,0,0,
David Kear Opticians,OP_5KX_12478__000001_GL155HJ,OPT,David Kear Opticians,9 Hill Street,,Lydney,Gloucestershire,GL15 5HJ,Tel: 01594 846233 (ext. 843233), - ,,,No ratings yet Rate it yourself - /Services/opticians/LeaveReview/DefaultView.aspx?id=OP_5KX_12478__000001_GL155HJ,0,0,
John Weygang Optometrists,OP_5KX_1556__000001_GL45UA,OPT,4 Abbeymead Avenue,Abbeymead,Gloucester,Gloucestershire,,GL4 5UA,Tel: 01452 306807, - ,,,1 rating Rate it yourself - /Services/opticians/LeaveReview/DefaultView.aspx?id=OP_5KX_1556__000001_GL45UA,,,
Norville Opticians,OP_5A3_6669__000002_BS352AZ,OPT,6 Horseshoe Lane,Thornbury,Bristol,,,BS35 2AZ,Tel: 01454 418366, - ,,,No ratings yet Rate it yourself - /Services/opticians/LeaveReview/DefaultView.aspx?id=OP_5A3_6669__000002_BS352AZ,0,0,
Thornbury Eye Centre,OP_5A3_2095__000001_BS122BH,OPT,1 St. Mary's Way,1 St Marys Way,Bristol,Thornbury,,BS35 2BH,Tel: 01454 416929, - ,,,No ratings yet Rate it yourself - /Services/opticians/LeaveReview/DefaultView.aspx?id=OP_5A3_2095__000001_BS122BH,0,0,
Specsavers Thornbury,OP_BS352BH_85641,OPT,,12 St Mary's Way,,Thornbury,,BS35 2BH,Tel: 01454 414341, - ,,,1 rating Rate it yourself - /Services/opticians/LeaveReview/DefaultView.aspx?id=OP_BS352BH_85641,,,
Armstrong & North Opticians,OP_5A3_4376__000003_BS352AR,OPT,45 High Street,Thornbury,,Bristol,,BS35 2AR,Tel: 01454 419662, - ,,,1 rating Rate it yourself - /Services/opticians/LeaveReview/DefaultView.aspx?id=OP_5A3_4376__000003_BS352AR,,,
Johnson & Furze Optometrists and Opticians,OP_5A3_14815__000001_BS352BJ,OPT,7 Chapel Street,Thornbury,,Bristol,,BS35 2BJ,Tel: 01454 411760, - ,,,No ratings yet Rate it yourself - /Services/opticians/LeaveReview/DefaultView.aspx?id=OP_5A3_14815__000001_BS352BJ,0,0,
David Kear Opticians,OP_5KX_7702__000001_GL142NL,OPT,David Kear Opticians,1 Woodside Street,,Cinderford,Gloucestershire,GL14 2NL,Tel: 01594 823690, - ,,,1 rating Rate it yourself - /Services/opticians/LeaveReview/DefaultView.aspx?id=OP_5KX_7702__000001_GL142NL,,,
Ashton & Daniels,OP_5KX_8206__000001_GL142SU,OPT,63 High Street,,Cinderford,Gloucestershire,,GL14 2SU,Tel: 01594 823666, - ,,,No ratings yet Rate it yourself - /Services/opticians/LeaveReview/DefaultView.aspx?id=OP_5KX_8206__000001_GL142SU,0,0,
Vision Care for Homeless People ,W3O7X,OPT,Gloucester City Mission,72 Eastgate Street,,Gloucester,Gloucestershire,GL1 1QN,Tel: 07468 492341, - ,,,No ratings yet Rate it yourself - /Services/opticians/LeaveReview/DefaultView.aspx?id=W3O7X,0,0,
Boots Opticians - Gloucester (38-46 Eastgate Street),GL1 1PU_18173,OPT,,38-46 Eastgate Street,,Gloucester,Gloucestershire,GL1 1PU,Tel: 01452 419429, - ,,,1 rating Rate it yourself - /Services/opticians/LeaveReview/DefaultView.aspx?id=GL1 1PU_18173,,,
Vision Express,5KX  8928__000004_GL11XH,OPT,,Eastgate Centre,,Gloucester,Gloucestershire,GL1 1XH,Tel: 01452 421122, - ,,,2 ratings Rate it yourself - /Services/opticians/LeaveReview/DefaultView.aspx?id=5KX  8928__000004_GL11XH,,,
Specsavers Opticians,OP_5KX_13099__000003_GL11XH,OPT,4-6 Bell Walk,Eastgate Shopping Centre,Gloucester,Gloucestershire,,GL1 1XH,Tel: 01452 505163, - ,,,No ratings yet Rate it yourself - /Services/opticians/LeaveReview/DefaultView.aspx?id=OP_5KX_13099__000003_GL11XH,0,0,
Norville Opticians Gloucester,OP_5KX_1218__000001_GL11PN,OPT,65 Eastgate Street,,Gloucester,Gloucestershire,,GL1 1PN,Tel: 01452 522033, - ,,,2 ratings Rate it yourself - /Services/opticians/LeaveReview/DefaultView.aspx?id=OP_5KX_1218__000001_GL11PN,,,
Asda Stores Ltd,TP1JR,OPT,,Bruton Way,,Gloucester,,GL1 1DS,Tel: 01452 833012, - ,,,No ratings yet Rate it yourself - /Services/opticians/LeaveReview/DefaultView.aspx?id=TP1JR,0,0,
Boots Opticians - Gloucester (7 Eastgate Street),OP_5KX_10567__000001_GL11NS,OPT,7 Eastgate Street,,,Gloucester,Gloucestershire,GL1 1NS,Tel: 01452 524 175, - ,,,No ratings yet Rate it yourself - /Services/opticians/LeaveReview/DefaultView.aspx?id=OP_5KX_10567__000001_GL11NS,0,0,
John Weygang & Partners,OP_5KX_8694__000001_GL11DP,OPT,26 Clarence Street,26 Clarence Street,Gloucester,Gloucester,,GL1 1DP,Tel: 01452 522118, - ,,,No ratings yet Rate it yourself - /Services/opticians/LeaveReview/DefaultView.aspx?id=OP_5KX_8694__000001_GL11DP,0,0,
The Vision Centre,TP1L0,OPT,,50 Northgate Street,,Gloucester,,GL1 1SQ,Tel: 0145 2410494, - ,,,No ratings yet Rate it yourself - /Services/opticians/LeaveReview/DefaultView.aspx?id=TP1L0,0,0,
Armstrong & North Opticians,OP_5A3_9099__000002_BS376BA,OPT,23 High Street,Chipping Sodbury,,Bristol,,BS37 6BA,Tel: 01454 313865, - ,,,1 rating Rate it yourself - /Services/opticians/LeaveReview/DefaultView.aspx?id=OP_5A3_9099__000002_BS376BA,,,
"Tesco Opticians, Gloucester",OP_GL34AA_30175,OPT,,"Gloucester Business Park, Delta Way",,Gloucester,,GL3 4AA,Tel: 0345 601 3479, - ,,,No ratings yet Rate it yourself - /Services/opticians/LeaveReview/DefaultView.aspx?id=OP_GL34AA_30175,0,0,
Specsavers Opticians,OP_5A3_57__000003_BS374AP,OPT,,2-4 North Walk,Yate,Bristol,,BS37 4AR,Tel: 01454 325 473, - ,,,No ratings yet Rate it yourself - /Services/opticians/LeaveReview/DefaultView.aspx?id=OP_5A3_57__000003_BS374AP,0,0,
Armstrong & North Opticians,OP_5A3_8987__000004_BS374AP,OPT,2a North Walk,Yate,,Bristol,,BS37 4AP,Tel: 01454 313594, - ,,,No ratings yet Rate it yourself - /Services/opticians/LeaveReview/DefaultView.aspx?id=OP_5A3_8987__000004_BS374AP,0,0,
Gloucester Royal Hospital,OP_5KX_3397__000003_GL13NN,OPT,Great Western Road,,Gloucester,Gloucestershire,,GL1 3NN,Tel: 08454 222222, - ,,,2 ratings Rate it yourself - /Services/opticians/LeaveReview/DefaultView.aspx?id=OP_5KX_3397__000003_GL13NN,,,
John Weygang Optometrists,OP_5KX_3798__000001_GL33TL,OPT,39 Hucclecote Road,Hucclecote,Gloucester,Gloucestershire,,GL3 3TL,Tel: 01452 619100, - ,,,1 rating Rate it yourself - /Services/opticians/LeaveReview/DefaultView.aspx?id=OP_5KX_3798__000001_GL33TL,,,
Haine & Smith Opticians,OP_5K4_617__000002_SN169AU,OPT,,25 High Street,,Malmesbury,Wiltshire,SN16 9AA,Tel: 01666 824234, - ,,,No ratings yet Rate it yourself - /Services/opticians/LeaveReview/DefaultView.aspx?id=OP_5K4_617__000002_SN169AU,0,0,
Malmesbury Opticians,OP_5K4_1516__000001_SN169AG,OPT,57 High Street,57 High Street,Malmesbury,Malmesbury,,SN16 9AG,Tel: 01666 822444, - ,,,1 rating Rate it yourself - /Services/opticians/LeaveReview/DefaultView.aspx?id=OP_5K4_1516__000001_SN169AG,,,
John Weygang Optometrists,D4R1G,OPT,,"31 Morley Avenue, Churchdown",,Gloucester,,GL3 2BL,Tel: 01452 855484, - ,,,No ratings yet Rate it yourself - /Services/opticians/LeaveReview/DefaultView.aspx?id=D4R1G,0,0,
David Kear Opticians,OP_5KX_4608__000002_GL168HF,OPT,David Kear Opticians,10 High Street,,Coleford,Gloucestershire,GL16 8HF,Tel: 01594 832968, - ,,,No ratings yet Rate it yourself - /Services/opticians/LeaveReview/DefaultView.aspx?id=OP_5KX_4608__000002_GL168HF,0,0,
Mike Harbord Opticians,OP_5A3_12504__000001_BS361JX,OPT,3 Whitegates,Flaxpits Lane,,Winterbourne,,BS36 1JX,Tel: 01454 775530, - ,,,2 ratings Rate it yourself - /Services/opticians/LeaveReview/DefaultView.aspx?id=OP_5A3_12504__000001_BS361JX,,,
R J Holmes Opticians ,OP_5KY_1317__000001_GL71QA,OPT,6 Castle Street,,Cirencester,Gloucestershire,,GL7 1QA,Tel: 01285 650136, - ,,,No ratings yet Rate it yourself - /Services/opticians/LeaveReview/DefaultView.aspx?id=OP_5KY_1317__000001_GL71QA,0,0,
Tesco Opticians,OP_BS328EF_85642,OPT,,Bradley Stoke Centre,Bradley Stoke,Bristol,,BS32 8EF,Tel: 01454 847738, - ,,,No ratings yet Rate it yourself - /Services/opticians/LeaveReview/DefaultView.aspx?id=OP_BS328EF_85642,0,0,
Haine & Smith Opticians,OP_5KY_2823__000002_GL71JH,OPT,,6c Cricklade Street,,Cirencester,Gloucestershire,GL7 1JH,Tel: 01285 651161, - ,,,No ratings yet Rate it yourself - /Services/opticians/LeaveReview/DefaultView.aspx?id=OP_5KY_2823__000002_GL71JH,0,0,
Boots-Cirencester,OP_5KY_1665__000001_GL71JH,OPT,42 Cricklade Street,,Cirencester,Gloucestershire,,GL7 1JH,Tel: 01285 654579, - ,,,No ratings yet Rate it yourself - /Services/opticians/LeaveReview/DefaultView.aspx?id=OP_5KY_1665__000001_GL71JH,0,0,
Specsavers Opticians,5KY 20003__000003_GL71JH,OPT,"30, Cricklade Street",,Cirencester,Gloucestershire,,GL7 1JH,Tel: 01285 648610, - ,,,No ratings yet Rate it yourself - /Services/opticians/LeaveReview/DefaultView.aspx?id=5KY 20003__000003_GL71JH,0,0,
Kodak Lens Optician Outlet,TP817,OPT,,Unit 2 Morrison Centre,,Cheltenham,,GL51 3BW,, - ,,,No ratings yet Rate it yourself - /Services/opticians/LeaveReview/DefaultView.aspx?id=TP817,0,0,
Philip Kersey & Partners,OP_5KY_7259__000003_GL72PF,OPT,56 Dyer Street,,Cirencester,Gloucestershire,,GL7 2PF,Tel: 01285 641999, - ,,,1 rating Rate it yourself - /Services/opticians/LeaveReview/DefaultView.aspx?id=OP_5KY_7259__000003_GL72PF,,,
Leightons Opticians & Hearing Care,OP_5KY_11919__000001_GL72PP,OPT,,Merchants House,39-41 Dyer Street,Cirencester,Gloucestershire,GL7 2PP,Tel: 01285 651 344, - ,,,No ratings yet Rate it yourself - /Services/opticians/LeaveReview/DefaultView.aspx?id=OP_5KY_11919__000001_GL72PP,0,0,
"Tesco’s Opticians, Cirencester",OP_GL71NP_30718,OPT,,"Kings Meadow, Cricklade Road",,Cirencester,,GL7 1NP,Tel: 0345 601 3479, - ,,,No ratings yet Rate it yourself - /Services/opticians/LeaveReview/DefaultView.aspx?id=OP_GL71NP_30718,0,0,
Boots-Bristol - Patchway,OP_5A3_10555__000001_BS345PA,OPT,4 Coniston Road,Patchway,,Bristol,,BS34 5PA,Tel: 01179 692727, - ,,,No ratings yet Rate it yourself - /Services/opticians/LeaveReview/DefaultView.aspx?id=OP_5A3_10555__000001_BS345PA,0,0,
Boots-Bristol - Emerson Green,OP_BS167AE_46947,OPT,1a The Village,Emerson Way,,Bristol,Avon,BS16 7AE,Tel: 0117 970 8652, - ,,,3 ratings Rate it yourself - /Services/opticians/LeaveReview/DefaultView.aspx?id=OP_BS167AE_46947,,,
Ashton & Daniels,OP_5KX_8207__000001_GL181AH,OPT,,35 Broad Street,Newent,Gloucestershire,,GL18 1AQ,Tel: 01531 820677, - ,,,No ratings yet Rate it yourself - /Services/opticians/LeaveReview/DefaultView.aspx?id=OP_5KX_8207__000001_GL181AH,0,0,
Scrivens,OP_5KW_10764__000001_GL517RY,OPT,"60, Edinburgh Place",Coronation Square,,Cheltenham,Gloucestershire,GL51 7SA,Tel: 01242 235220, - ,,,No ratings yet Rate it yourself - /Services/opticians/LeaveReview/DefaultView.aspx?id=OP_5KW_10764__000001_GL517RY,0,0,
Independent Eyecare Centre,OP_5KW_12701__000002_GL537NG,OPT,144 Bath Road,,Cheltenham,Gloucestershire,,GL53 7NG,Tel: 01242 222802, - ,,,No ratings yet Rate it yourself - /Services/opticians/LeaveReview/DefaultView.aspx?id=OP_5KW_12701__000002_GL537NG,0,0,
Adrian Dobinson Opticians Ltd,OP_BS166BB_46945,OPT,,23 Badminton Road,,Downend,,BS16 6BB,Tel: 0117 957 3010, - ,,,No ratings yet Rate it yourself - /Services/opticians/LeaveReview/DefaultView.aspx?id=OP_BS166BB_46945,0,0,
Asda Wal-Mart Vision Centre,OP_5A3_12997__000002_BS345TL,OPT,Highwood Lane,Patchway,Bristol,Bristol,,BS34 5TL,Tel: 0117 9798289, - ,,,No ratings yet Rate it yourself - /Services/opticians/LeaveReview/DefaultView.aspx?id=OP_5A3_12997__000002_BS345TL,0,0,
Norville Opticians,OP_5A3_5621__000001_BS165UJ,OPT,16 Downend Road,Downend,,Downed,,BS16 5UJ,Tel: 0117 956 0939, - ,,,No ratings yet Rate it yourself - /Services/opticians/LeaveReview/DefaultView.aspx?id=OP_5A3_5621__000001_BS165UJ,0,0,
Cheltenham General Hospital,OP_5KW_1846__000001_GL537AN,OPT,Department Of Optometry,Sandford Road,Cheltenham,Gloucestershire,,GL53 7AN,Tel: 08454 223 203, - ,,,No ratings yet Rate it yourself - /Services/opticians/LeaveReview/DefaultView.aspx?id=OP_5KW_1846__000001_GL537AN,0,0,
Boots Opticians Ltd,OP_5A3_640__000003_BS345UP,OPT,"116 The Mall, Upper Level",Cribbs Causeway,Patchway,Bristol,,BS34 5UP,Tel: 0117 950 9649, - ,,,1 rating Rate it yourself - /Services/opticians/LeaveReview/DefaultView.aspx?id=OP_5A3_640__000003_BS345UP,,,
Keith Holland & Associates,OP_5KW_3508__000002_GL503DT,OPT,27 St. Georges Road,,,Cheltenham,,GL50 3DT,Tel: 01242 233500, - ,,,No ratings yet Rate it yourself - /Services/opticians/LeaveReview/DefaultView.aspx?id=OP_5KW_3508__000002_GL503DT,0,0,no
Smith & Swepson Opticians,OP_5KW_915__000001_GL501QB,OPT,,2 Imperial Square,,Cheltenham,Gloucestershire,GL50 1QB,Tel: 01242 243800, - ,,,No ratings yet Rate it yourself - /Services/opticians/LeaveReview/DefaultView.aspx?id=OP_5KW_915__000001_GL501QB,0,0,
Vision Express,OP_5A3_682__000001_BS345GF,OPT,"8 The Mall, Lower Level","Cribbs Causeway Regional Shopping Centre, Patchway",Bristol,Bristol,,BS34 5GF,Tel: 0117 9500857, - ,,,No ratings yet Rate it yourself - /Services/opticians/LeaveReview/DefaultView.aspx?id=OP_5A3_682__000001_BS345GF,0,0,
Harper and Cooper Opticians,CO-5293,OPT,,4 Ormond Place,,Cheltenham  ,,GL50 1JD,, - ,,,3 ratings Rate it yourself - /Services/opticians/LeaveReview/DefaultView.aspx?id=CO-5293,,,
Specsavers Opticians,OP_5A3_11418__000001_BS347BT,OPT,5 Church View,Filton,Bristol,,,BS34 7BT,Tel: 0117 969 3513, - ,,,No ratings yet Rate it yourself - /Services/opticians/LeaveReview/DefaultView.aspx?id=OP_5A3_11418__000001_BS347BT,0,0,
Optical Express,5KW20008__000001_GL501DG,OPT,,43-45 Promenade,,Cheltenham,Gloucestershire,GL50 1PY,Tel: 0800 0232020, - ,,,No ratings yet Rate it yourself - /Services/opticians/LeaveReview/DefaultView.aspx?id=5KW20008__000001_GL501DG,0,0,
Boots-Cheltenham - Regent Arcade,OP_5KW_3677__000001_GL501JZ,OPT,"Unit 40, Regent Arcade",Regent Street,Cheltenham,Gloucestershire,,GL50 1JZ,Tel: 01242 577811, - ,,,No ratings yet Rate it yourself - /Services/opticians/LeaveReview/DefaultView.aspx?id=OP_5KW_3677__000001_GL501JZ,0,0,
Ellis and Killpartrick,OP_5KW_12083__000002_GL501JZ,OPT,Regent Arcade,Regent Street,Cheltenham,Gloucestershire,,GL50 1JZ,Tel: 01242 228686, - ,,,No ratings yet Rate it yourself - /Services/opticians/LeaveReview/DefaultView.aspx?id=OP_5KW_12083__000002_GL501JZ,0,0,
Chapman  Opticians,OP_5KW_11399__000003_GL501JZ,OPT,12 Regent Arcade,Regent Street,Cheltenham,Gloucestershire,,GL50 1JZ,Tel: 01242 584358, - ,,,No ratings yet Rate it yourself - /Services/opticians/LeaveReview/DefaultView.aspx?id=OP_5KW_11399__000003_GL501JZ,0,0,
"Tesco’s Opticians, Cheltenham ",OP_GL518JQ_30717,OPT,,Colletts Drive,,Cheltenham,,GL51 8JQ,Tel: 0345 601 3479, - ,,,No ratings yet Rate it yourself - /Services/opticians/LeaveReview/DefaultView.aspx?id=OP_GL518JQ_30717,0,0,
Cheltenham Medical Eye Centre,OP_5KW_1077__000003_GL501HE,OPT,11 Regent Street,,Cheltenham,Gloucestershire,,GL50 1HE,Tel: 01242 221442, - ,,,1 rating Rate it yourself - /Services/opticians/LeaveReview/DefaultView.aspx?id=OP_5KW_1077__000003_GL501HE,,,
Dury and Tippett Ltd,OP_5A3_9431__000001_BS165LR,OPT,2 The Square,Broad Street,,Staple Hill,,BS16 5LR,Tel: 0117 957 3542, - ,,,2 ratings Rate it yourself - /Services/opticians/LeaveReview/DefaultView.aspx?id=OP_5A3_9431__000001_BS165LR,,,
Vision Express ,OP_5KW_12700__000001_GL501DQ,OPT,188 High Street,,Cheltenham,Gloucestershire,,GL50 1EP,Tel: 01242 238777, - ,,,No ratings yet Rate it yourself - /Services/opticians/LeaveReview/DefaultView.aspx?id=OP_5KW_12700__000001_GL501DQ,0,0,
Specsavers Opticians,OP_5KW_128__000002_GL503HF,OPT,206. High Street,,,Cheltenham,,GL50 3HF,Tel: 01242 224314, - ,,,No ratings yet Rate it yourself - /Services/opticians/LeaveReview/DefaultView.aspx?id=OP_5KW_128__000002_GL503HF,0,0,
David Clulow,OP_5KW_11848__000001_GL501EN,OPT,213 High Street,,Cheltenham,Gloucestershire,,GL50 3HH,Tel: 01242 250005, - ,,,No ratings yet Rate it yourself - /Services/opticians/LeaveReview/DefaultView.aspx?id=OP_5KW_11848__000001_GL501EN,0,0,
Boots-Cheltenham - High St,OP_5KW_8341__000002_GL501DB,OPT,197-199 High Street,,,Cheltenham,Gloucestershire,GL50 1DB,Tel: 01242 580730, - ,,,No ratings yet Rate it yourself - /Services/opticians/LeaveReview/DefaultView.aspx?id=OP_5KW_8341__000002_GL501DB,0,0,
Armstrong & North Opticians,OP_5A3_5605__000002_BS165HL,OPT,,94 High Street,Staple Hill,Bristol,,BS16 5HL,Tel: 0117 956 9255, - ,,,1 rating Rate it yourself - /Services/opticians/LeaveReview/DefaultView.aspx?id=OP_5A3_5605__000002_BS165HL,,,
Maddox Eyecare,01-21036,OPT,,St Paul’s Medical Centre,,Cheltenham,,GL50 4DP,Tel: 01242 282059, - ,,,1 rating Rate it yourself - /Services/opticians/LeaveReview/DefaultView.aspx?id=01-21036,,,yes
Specsavers Cheltenham North West,111003012017,OPT,,Sainsburys Superstore,,Cheltenham,,GL51 9RR,, - ,,,No ratings yet Rate it yourself - /Services/opticians/LeaveReview/DefaultView.aspx?id=111003012017,0,0,
Specsavers,OP_5JF_5809__000001_BS56JH,OPT,767 Fishponds Road,,Bristol,,,BS16 3BS,Tel: 0117 965 9241, - ,,,No ratings yet Rate it yourself - /Services/opticians/LeaveReview/DefaultView.aspx?id=OP_5JF_5809__000001_BS56JH,0,0,
Scrivens Opticians & Hearing Care,OP_5JF_4253__000001_BS163UW,OPT,725 Fishponds Road,Fishponds,,Bristol,Avon,BS16 3UW,Tel: 0117 958 3395, - ,,,No ratings yet Rate it yourself - /Services/opticians/LeaveReview/DefaultView.aspx?id=OP_5JF_4253__000001_BS163UW,0,0,
Harold Turner & Son,OP_5JF_14813__000001_BS163UA,OPT,768 Fishponds Road,Fishponds,Bristol,,,BS16 3UA,Tel: 0117 9654434, - ,,,1 rating Rate it yourself - /Services/opticians/LeaveReview/DefaultView.aspx?id=OP_5JF_14813__000001_BS163UA,,,
Christine Townsend Opticians,OP_5JF_370__000001_BS70BE,OPT,384 Filton Avenue,Horfield,,Bristol,,BS7 0BE,Tel: 0117 979 9942, - ,,,No ratings yet Rate it yourself - /Services/opticians/LeaveReview/DefaultView.aspx?id=OP_5JF_370__000001_BS70BE,0,0,
SimplySpecs,SN14 6QA,OPT,,18 Bumpers Enterprise Centre,,Chippenham,,SN14 6QA,, - ,,,No ratings yet Rate it yourself - /Services/opticians/LeaveReview/DefaultView.aspx?id=SN14 6QA,0,0,
Paul White Opticians,OP_5JF_5728__000001_BS70PA,OPT,28 Filton Road,Horfield,,Bristol,,BS7 0PA,Tel: 0117 951 9339, - ,,,No ratings yet Rate it yourself - /Services/opticians/LeaveReview/DefaultView.aspx?id=OP_5JF_5728__000001_BS70PA,0,0,
Mike Cees Opticians,OP_BS154EJ_46948,OPT,Kingswood Health Centre,Alma Road,Kingswood,Bristol,,BS15 4EJ,Tel: 0117 3012091, - ,,,No ratings yet Rate it yourself - /Services/opticians/LeaveReview/DefaultView.aspx?id=OP_BS154EJ_46948,0,0,
Lea (Opticians) Ltd,OP_5JF_9370__000002_BS106AT,OPT,1 Arnside Road,Bristol,,,,BS10 6AT,Tel: 01272 505025, - ,,,No ratings yet Rate it yourself - /Services/opticians/LeaveReview/DefaultView.aspx?id=OP_5JF_9370__000002_BS106AT,0,0,
Scotts Opticians,OP_5CN_9336__000002_HR95AD,OPT,Ross-on-Wye Community Hospital,Alton Street,Ross-on-Wye,,,HR9 5AD,Tel: 01989 567244, - ,,,No ratings yet Rate it yourself - /Services/opticians/LeaveReview/DefaultView.aspx?id=OP_5CN_9336__000002_HR95AD,0,0,
Ashton & Daniels,OP_5CN_11245__000001_HR97AN,OPT,3 Cantilupe Court,Ross-on-Wye,Herefordshire,,,HR9 7AN,Tel: 01989 562173, - ,,,1 rating Rate it yourself - /Services/opticians/LeaveReview/DefaultView.aspx?id=OP_5CN_11245__000001_HR97AN,,,
Specsavers,OP_5CN_13517__000001_HR95BU,OPT,13 Gloucester Road,Ross On Wye,Herefordshire,,,HR9 5BU,Tel: 01989 564460, - ,,,No ratings yet Rate it yourself - /Services/opticians/LeaveReview/DefaultView.aspx?id=OP_5CN_13517__000001_HR95BU,0,0,
Boots-Kingswood,OP_5A3_537__000001_BS158LQ,OPT,10-11 Kingschase Centre,Regent Street,Kingswood,Bristol,,BS15 8LP,Tel: 0117 960 8379, - ,,,2 ratings Rate it yourself - /Services/opticians/LeaveReview/DefaultView.aspx?id=OP_5A3_537__000001_BS158LQ,,,
Specsavers Opticians,OP_5A3_99__000003_BS158LP,OPT,20 Kings Chase Shopping Centre,Regent Street,Kingswood,,,BS15 8LP,Tel: 0117 947 8809, - ,,,No ratings yet Rate it yourself - /Services/opticians/LeaveReview/DefaultView.aspx?id=OP_5A3_99__000003_BS158LP,0,0,
Vision Express,OP_5A3_767__000001_BS158PH,OPT,,2-4 Hanham Road,Kingswood,Bristol,,BS15 8PH,Tel: 0117 967 4513, - ,,,No ratings yet Rate it yourself - /Services/opticians/LeaveReview/DefaultView.aspx?id=OP_5A3_767__000001_BS158PH,0,0,