Organisation Name,NACS Code,Organisation Type,Address1,Address2,Address3,Address4,Address5,PostCode,Telephone Number,Opening time,Value  (Opening time),Banding Classification  (Opening time),NHS.UK users rating,Value  (NHS.UK users rating),Banding Classification  (NHS.UK users rating),Car parking (Is there car parking at this organisation?)
"Wilson, Wilson & Hancock",OP_5FH_2561__000001_TN317AN,OPT,Wall Cottage,63 Cinque Ports Street,,Rye,,TN31 7AN,Tel: 01797 223700, - ,,,1 rating Rate it yourself - /Services/opticians/LeaveReview/DefaultView.aspx?id=OP_5FH_2561__000001_TN317AN,,,
"Wilson, Wilson & Hancock",OP_5LL_1325__000001_TN306BN,OPT,,7 High Street,,Tenterden,,TN30 6BN,Tel: 01580 762069, - ,,,No ratings yet Rate it yourself - /Services/opticians/LeaveReview/DefaultView.aspx?id=OP_5LL_1325__000001_TN306BN,0,0,
Specsavers (Tenterden),T9E3O,OPT,,59 High Street,,Tenterden,,TN30 6BD,Tel: 01589 392393, - ,,,No ratings yet Rate it yourself - /Services/opticians/LeaveReview/DefaultView.aspx?id=T9E3O,0,0,
Jackson & Co Eye Care,K6W2G,OPT,,69 High Street,,New Romney,Kent,TN28 8AZ,Tel: 01797 364050, - ,,,No ratings yet Rate it yourself - /Services/opticians/LeaveReview/DefaultView.aspx?id=K6W2G,0,0,
Robert Jardine Opticians,OP_5LP_2760__000001_TN288AZ,OPT,,69 High Street,,New Romney,Kent,TN28 8AZ,Tel: 07973 64050, - ,,,7 ratings Rate it yourself - /Services/opticians/LeaveReview/DefaultView.aspx?id=OP_5LP_2760__000001_TN288AZ,,,
Vision Express (Tenterden),OP_5LL_10430__000002_TN306AU,OPT,,72 High Street,,Tenterden,Kent,TN30 6AU,Tel: 01580 763 267, - ,,,No ratings yet Rate it yourself - /Services/opticians/LeaveReview/DefaultView.aspx?id=OP_5LL_10430__000002_TN306AU,0,0,
Claire Reed Optician,OP_5FH_9565__000001_TN316LB,OPT,Dixter Road,Northiam,Rye,East Sussex,,TN31 6LB,Tel: 01797 252411, - ,,,No ratings yet Rate it yourself - /Services/opticians/LeaveReview/DefaultView.aspx?id=OP_5FH_9565__000001_TN316LB,0,0,
 LansEyecare Limited,01-19975,OPT,,56 Swaffer way,,Ashford,,TN23 5JE,Tel: 02081338524, - ,,,No ratings yet Rate it yourself - /Services/opticians/LeaveReview/DefaultView.aspx?id=01-19975,0,0,
Brownbills,OP_5LL_13616__000001_TN231DQ,OPT,Cecil House,Norwood Street,Ashford,Kent,,TN23 1QT,Tel: 01233 625360, - ,,,3 ratings Rate it yourself - /Services/opticians/LeaveReview/DefaultView.aspx?id=OP_5LL_13616__000001_TN231DQ,,,
Specsavers (Ashford),OP_5LL_11659__000001_TN231YD,OPT,,36 County Square,,Ashford,,TN23 1YD,Tel: 01233 629999, - ,,,3 ratings Rate it yourself - /Services/opticians/LeaveReview/DefaultView.aspx?id=OP_5LL_11659__000001_TN231YD,,,
Tesco Opticians (Ashford),TN24 0YE,OPT,,"Hythe Road, Wilesborough",,Ashford,Kent,TN24 0YE,Tel: 0345 677 9008, - ,,,No ratings yet Rate it yourself - /Services/opticians/LeaveReview/DefaultView.aspx?id=TN24 0YE,0,0,
I-Zone  Eyewear,OP_5LL_13622__000001_TN231YA,OPT,,18a Bank Street,,Ashford,Kent,TN23 1BZ,Tel: 01233 633030, - ,,,No ratings yet Rate it yourself - /Services/opticians/LeaveReview/DefaultView.aspx?id=OP_5LL_13622__000001_TN231YA,0,0,
Vision Express,Q6M7L,OPT,,58 High Street,,Ashford,Kent,TN24 8TB,Tel: 01233 636030, - ,,,No ratings yet Rate it yourself - /Services/opticians/LeaveReview/DefaultView.aspx?id=Q6M7L,0,0,
Vision Express (Ashford),OP_5LL_13091__000001_TN248TD,OPT,,58 High Street,,Ashford,,TN24 8TB,Tel: 01233 636030, - ,,,No ratings yet Rate it yourself - /Services/opticians/LeaveReview/DefaultView.aspx?id=OP_5LL_13091__000001_TN248TD,0,0,
Boots-Ashford - High St,OP_5LL_12206__000002_TN248TB,OPT,,56 High Street,,Ashford,Kent,TN24 8TB,Tel: 01233 620414, - ,,,No ratings yet Rate it yourself - /Services/opticians/LeaveReview/DefaultView.aspx?id=OP_5LL_12206__000002_TN248TB,0,0,
Cargills (Ashford),OP_5LL_4536__000001_TN248LF,OPT,,7 North Street,,Ashford,,TN24 8LF,Tel: 01233 620597, - ,,,No ratings yet Rate it yourself - /Services/opticians/LeaveReview/DefaultView.aspx?id=OP_5LL_4536__000001_TN248LF,0,0,
Specsavers Opticians (Bybrook),OPT_TN248YN_1,OPT,,Sainsbury's Supermarket,,Ashford,,TN24 8YN,, - ,,,No ratings yet Rate it yourself - /Services/opticians/LeaveReview/DefaultView.aspx?id=OPT_TN248YN_1,0,0,
Specsavers Opticians (Bybrook),OPT_TN248YN_2,OPT,,Sainsbury's Supermarket,Simone Weil Avenue,Ashford,Kent,TN24 8YN,Tel: 01233 622055, - ,,,No ratings yet Rate it yourself - /Services/opticians/LeaveReview/DefaultView.aspx?id=OPT_TN248YN_2,0,0,
Linda Pope Optician,OPT_TN184EY_1,OPT,,"Venture House, Rye Road",,Hawkhurst,Kent,TN18 4EY,Tel: 01580 753744, - ,,,No ratings yet Rate it yourself - /Services/opticians/LeaveReview/DefaultView.aspx?id=OPT_TN184EY_1,0,0,
Peter Jones Opticians,OP_5L2_1737__000001_TN173HE,OPT,25 Stone Street,Cranbrook,Kent,,,TN17 3HE,Tel: 01580 712254, - ,,,1 rating Rate it yourself - /Services/opticians/LeaveReview/DefaultView.aspx?id=OP_5L2_1737__000001_TN173HE,,,
The Hammond Optical Practice,OP_5L2_6686__000001_TN173RB,OPT,,High Street,,Cranbrook,Kent,TN17 3RB,Tel: 01580 715008, - ,,,No ratings yet Rate it yourself - /Services/opticians/LeaveReview/DefaultView.aspx?id=OP_5L2_6686__000001_TN173RB,0,0,
Hastings Sedlescombe Road Specsavers Limited,Y1M6U,OPT,,"Sainsburys Sedlescombe Road, John Macadam Way",,St. Leonards-on-Sea,East Sussex,TN37 7SQ,Tel: 01424 619730, - ,,,No ratings yet Rate it yourself - /Services/opticians/LeaveReview/DefaultView.aspx?id=Y1M6U,0,0,
Archaeoptix,D2I3A,OPT,,"50 High Street, Hythe",,Kent,,CT21 5AT,, - ,,,No ratings yet Rate it yourself - /Services/opticians/LeaveReview/DefaultView.aspx?id=D2I3A,0,0,
David Snow Opticians,OP_5LP_13636__000001_CT215AT,OPT,,12 High Street,Hythe,Kent,,CT21 5AT,Tel: 01303 263770, - ,,,No ratings yet Rate it yourself - /Services/opticians/LeaveReview/DefaultView.aspx?id=OP_5LP_13636__000001_CT215AT,0,0,
Vision Express,OP_5P8_1881__000001_TN341QR,OPT,3 Priory Meadow Shopping Centre,Queens Road,Hastings,East Sussex,,TN34 1PH,Tel: 01424 720957, - ,,,No ratings yet Rate it yourself - /Services/opticians/LeaveReview/DefaultView.aspx?id=OP_5P8_1881__000001_TN341QR,0,0,
Specsavers Opticians,OP_5FJ_4361__000002_TN341PH,OPT,Unit Qr40 Priory Meadow Shopping Centre,Queens Road,Hastings,East Sussex,,TN34 1PH,Tel: 01424 717900, - ,,,No ratings yet Rate it yourself - /Services/opticians/LeaveReview/DefaultView.aspx?id=OP_5FJ_4361__000002_TN341PH,0,0,
Boots-Hastings - Kings Walk,OP_5FJ_6818__000003_TN341PH,OPT,"Kings Walk, Priory Meadows",,,Hastings,East Sussex,TN34 1PH,Tel: 01424 718365, - ,,,1 rating Rate it yourself - /Services/opticians/LeaveReview/DefaultView.aspx?id=OP_5FJ_6818__000003_TN341PH,,,
Headcorn Eye Centre,OPT_TN279NH_1,OPT,,25 High Street,,Headcorn,Kent,TN27 9NH,Tel: 01622 890044, - ,,,1 rating Rate it yourself - /Services/opticians/LeaveReview/DefaultView.aspx?id=OPT_TN279NH_1,,,
Cargills (Hythe),OP_5LP_10148__000001_CT215JL,OPT,,139 High Street,,Hythe,Kent,CT21 5JL,Tel: 01303 266458, - ,,,4 ratings Rate it yourself - /Services/opticians/LeaveReview/DefaultView.aspx?id=OP_5LP_10148__000001_CT215JL,,,
"Wilson, Wilson & Hancock",OP_5FJ_6655__000001_TN341DJ,OPT,12-14 Cambridge Road,,Hastings,East Sussex,,TN34 1DJ,Tel: 01424 421717, - ,,,2 ratings Rate it yourself - /Services/opticians/LeaveReview/DefaultView.aspx?id=OP_5FJ_6655__000001_TN341DJ,,,
Barracloughs the Opticians,9003,OPT,,23 Sedlescombe Road North,,"Silver Hill, St Leonards on Sea",,TN37 7DA,, - ,,,No ratings yet Rate it yourself - /Services/opticians/LeaveReview/DefaultView.aspx?id=9003,0,0,
Tesco Opticians,10006__000002_TN389RB,OPT,Church Wood Drive,,St Leonards-on-Sea,East Sussex,,TN38 9RB,Tel: 01424 789438, - ,,,No ratings yet Rate it yourself - /Services/opticians/LeaveReview/DefaultView.aspx?id=10006__000002_TN389RB,0,0,
Green & Elliott Optometrists,OP_5FH_1292__000001_TN330EG,OPT,,28 Mount Street,,Battle,,TN33 0EG,Tel: 01424 773487, - ,,,No ratings yet Rate it yourself - /Services/opticians/LeaveReview/DefaultView.aspx?id=OP_5FH_1292__000001_TN330EG,0,0,
Barracloughs the Opticians,OP_5FH_3721__000001_TN330AG,OPT,,64A High Street,,Battle,,TN33 0AG,Tel: 01424 772725, - ,,,No ratings yet Rate it yourself - /Services/opticians/LeaveReview/DefaultView.aspx?id=OP_5FH_3721__000001_TN330AG,0,0,
Peter Jones Opticians,OP_5L2_2643__000001_TN120AY,OPT,5 Church Hill,Staplehurst,Tonbridge,,,TN12 0AX,Tel: 01580 892269, - ,,,No ratings yet Rate it yourself - /Services/opticians/LeaveReview/DefaultView.aspx?id=OP_5L2_2643__000001_TN120AY,0,0,
Cargills (Folkestone),OP_5LP_8591__000002_CT202BW,OPT,,122 Sandgate Road,,Folkestone,,CT20 2BW,Tel: 01303 254471, - ,,,No ratings yet Rate it yourself - /Services/opticians/LeaveReview/DefaultView.aspx?id=OP_5LP_8591__000002_CT202BW,0,0,
Specsavers Opticians (West Park Farm),TP992,OPT,,Sainsbury's West Park Farm,Park Farm Road,Folkestone,Kent,CT19 5GA,Tel: 01303 256195, - ,,,No ratings yet Rate it yourself - /Services/opticians/LeaveReview/DefaultView.aspx?id=TP992,0,0,
Chris Adams Opticians,OP_5LP_9658__000001_CT202AY,OPT,,17 Cheriton Place,,Folkestone,,CT20 2AY,Tel: 01303 246105, - ,,,No ratings yet Rate it yourself - /Services/opticians/LeaveReview/DefaultView.aspx?id=OP_5LP_9658__000001_CT202AY,0,0,
Specsavers (Folkestone) ,5QA:OO1856,OPT,,Bouverie Place,,Folkestone,Kent,CT20 1AU,Tel: 01303 212010, - ,,,5 ratings Rate it yourself - /Services/opticians/LeaveReview/DefaultView.aspx?id=5QA:OO1856,,,
Boots-Folkestone - Sandgate Rd (in Boots UK),OP_5LP_7308__000002_CT201DP,OPT,24-26 Sandgate Road,,,Folkestone,Kent,CT20 1DP,Tel: 01303 241 474, - ,,,No ratings yet Rate it yourself - /Services/opticians/LeaveReview/DefaultView.aspx?id=OP_5LP_7308__000002_CT201DP,0,0,
Eye Folk,TP9D8,OPT,,20 Guidhall Street,,Folkestone,Kent,CT20 1DZ,Tel: 01303 252345, - ,,,No ratings yet Rate it yourself - /Services/opticians/LeaveReview/DefaultView.aspx?id=TP9D8,0,0,
Specsavers,OP_5P8_2552__000001_TN401DX,OPT,6 Western Road,,Bexhill On Sea,East Sussex,,TN40 1DX,Tel: 01424 739110, - ,,,No ratings yet Rate it yourself - /Services/opticians/LeaveReview/DefaultView.aspx?id=OP_5P8_2552__000001_TN401DX,0,0,
Vision Express,OP_5FH_9524__000001_TN401BD,OPT,43 Devonshire Road,,Bexhill-on-Sea,,,TN40 1BD,Tel: 01424 219306, - ,,,No ratings yet Rate it yourself - /Services/opticians/LeaveReview/DefaultView.aspx?id=OP_5FH_9524__000001_TN401BD,0,0,
Barracloughs the Opticians,OP_5FH_12491__000001_TN401DT,OPT,,41 Western Road,,Bexhill-on-Sea,,TN40 1DT,Tel: 01424 219543, - ,,,No ratings yet Rate it yourself - /Services/opticians/LeaveReview/DefaultView.aspx?id=OP_5FH_12491__000001_TN401DT,0,0,
Green & Elliott Optometrists,OP_5FH_2952__000001_TN393JE,OPT,,36 Sackville Road,,Bexhill-on-Sea,,TN39 3JE,Tel: 01424 212544, - ,,,No ratings yet Rate it yourself - /Services/opticians/LeaveReview/DefaultView.aspx?id=OP_5FH_2952__000001_TN393JE,0,0,
Simply Vision Opticians,X5N3G,OPT,,26 Cooden Sea Road,,Bexhill-on-Sea,,TN39 4SJ,, - ,,,No ratings yet Rate it yourself - /Services/opticians/LeaveReview/DefaultView.aspx?id=X5N3G,0,0,
Wadhurst Opticians,OP_5LT_12442__000001_TN56AA,OPT,The Old Bakery,High Street,Wadhurst,East Sussex,,TN5 6AA,Tel: 01892 782674, - ,,,No ratings yet Rate it yourself - /Services/opticians/LeaveReview/DefaultView.aspx?id=OP_5LT_12442__000001_TN56AA,0,0,
Patrick Duff,OP_5L2_12575__000001_TN126EN,OPT,3 Commercial Road,Paddock Wood,Tonbridge,,,TN12 6EN,Tel: 01892 838608, - ,,,No ratings yet Rate it yourself - /Services/opticians/LeaveReview/DefaultView.aspx?id=OP_5L2_12575__000001_TN126EN,0,0,
Elaine M Yorwarth,00156__000001_TN126DP,OPT,70 Commercial Road,,Paddock Wood,Kent,,TN12 6DP,Tel: 01892 833017, - ,,,No ratings yet Rate it yourself - /Services/opticians/LeaveReview/DefaultView.aspx?id=00156__000001_TN126DP,0,0,
Optima Opticians,O6Y0N,OPT,,4 Jacob Yard,Preston Street,Faversham,Kent,ME13 8NY,Tel: 01795 531885, - ,,,No ratings yet Rate it yourself - /Services/opticians/LeaveReview/DefaultView.aspx?id=O6Y0N,0,0,
Specsavers (Faversham),OPT_ME138NS_1,OPT,,1 Preston Street,,Faversham,Kent,ME13 8NS,Tel: 01795 538319, - ,,,2 ratings Rate it yourself - /Services/opticians/LeaveReview/DefaultView.aspx?id=OPT_ME138NS_1,,,
Vision Express (Maidstone),OP_5L2_6952__000001_ME156AS,OPT,346-348 Dukes Walk,Chequers Centre,Maidstone,Kent,,ME15 6AS,Tel: 01622 678123, - ,,,No ratings yet Rate it yourself - /Services/opticians/LeaveReview/DefaultView.aspx?id=OP_5L2_6952__000001_ME156AS,0,0,
John High Opticians (Faversham),OP_5LN_3423__000001_ME137AA,OPT,,8 Market Street,,Faversham,,ME13 7AA,Tel: 01795 532803, - ,,,4 ratings Rate it yourself - /Services/opticians/LeaveReview/DefaultView.aspx?id=OP_5LN_3423__000001_ME137AA,,,
Boots-Maidstone - King St,OP_5L2_195__000002_ME141BW,OPT,56-62 King Street,,Kent,Maidstone,,ME14 1BW,Tel: 01622 762337, - ,,,No ratings yet Rate it yourself - /Services/opticians/LeaveReview/DefaultView.aspx?id=OP_5L2_195__000002_ME141BW,0,0,
William J Wilkinson (Maidstone),OP_5L2_2043__000001_ME156JJ,OPT,50 Gabriels Hill,,Kent,Maidstone,,ME15 6JJ,Tel: 01622 677424, - ,,,No ratings yet Rate it yourself - /Services/opticians/LeaveReview/DefaultView.aspx?id=OP_5L2_2043__000001_ME156JJ,0,0,
Tinsons ,OP_5L2_760__000001_ME141TG,OPT,9 Middle Row,,Kent,Maidstone,,ME14 1TG,Tel: 01622 686051, - ,,,No ratings yet Rate it yourself - /Services/opticians/LeaveReview/DefaultView.aspx?id=OP_5L2_760__000001_ME141TG,0,0,
Bayfields Opticians and Audiologists (Maidstone),I9V4Y,OPT,,6 Pudding Lane,,Maidstone,,ME14 1LN,Tel: 01622 758566, - ,,,No ratings yet Rate it yourself - /Services/opticians/LeaveReview/DefaultView.aspx?id=I9V4Y,0,0,
Specsavers (Maidstone),OPT_ME141QS_1,OPT,,21-25 Week Street,,Maidstone,Kent,ME14 1QS,Tel: 01622 663111, - ,,,No ratings yet Rate it yourself - /Services/opticians/LeaveReview/DefaultView.aspx?id=OPT_ME141QS_1,0,0,
Boots-Canterbury,OP_5LM_6036__000001_CT12TJ,OPT,12 Gravel Walk,,Whitefriars,Canterbury,Kent,CT1 2TF,Tel: 01227 462106, - ,,,1 rating Rate it yourself - /Services/opticians/LeaveReview/DefaultView.aspx?id=OP_5LM_6036__000001_CT12TJ,,,
Specsavers (Canterbury),OP_5LM_14069__000001_CT12SP,OPT,7 Rose Lane,Whitefriars,,Canterbury,Kent,CT1 2SJ,Tel: 01227 811580, - ,,,3 ratings Rate it yourself - /Services/opticians/LeaveReview/DefaultView.aspx?id=OP_5LM_14069__000001_CT12SP,,,
Vision Express (Canterbury),TP74K,OPT,,"Unit 39, Whitefriars (Unit 2, 6/8 Rose Lane",,Canterbury,,CT1 2SJ,Tel: 01227 763930, - ,,,No ratings yet Rate it yourself - /Services/opticians/LeaveReview/DefaultView.aspx?id=TP74K,0,0,
M&S Opticians,X2J5U,OPT,,4 St George's Street,,Canterbury,Kent,CT1 2SR,Tel: 01227936464, - ,,,23 ratings Rate it yourself - /Services/opticians/LeaveReview/DefaultView.aspx?id=X2J5U,,,
Cargills (Canterbury),OP_5LM_4537__000001_CT12BE,OPT,,59 St. Peters Street,,Canterbury,,CT1 2BE,Tel: 01227 766670, - ,,,No ratings yet Rate it yourself - /Services/opticians/LeaveReview/DefaultView.aspx?id=OP_5LM_4537__000001_CT12BE,0,0,
David Grimes Opticians,OP_5LM_1373__000001_CT12BG,OPT,,44 St. Peters Street,,Canterbury,,CT1 2BG,Tel: 01227 463341, - ,,,No ratings yet Rate it yourself - /Services/opticians/LeaveReview/DefaultView.aspx?id=OP_5LM_1373__000001_CT12BG,0,0,
W & K Pope ,OP_5L4_9234__000001_ME104DW,OPT,The Oast Business Centre,Office 4C,62 Bell Road,Sittingbourne,Kent,ME10 4HE,Tel: 01795 470507, - ,,,No ratings yet Rate it yourself - /Services/opticians/LeaveReview/DefaultView.aspx?id=OP_5L4_9234__000001_ME104DW,0,0,
Pybus Optometrists,OP_5LM_4443__000001_CT12DY,OPT,,5 Palace Street,,Canterbury,,CT1 2DY,Tel: 01227 760501, - ,,,2 ratings Rate it yourself - /Services/opticians/LeaveReview/DefaultView.aspx?id=OP_5LM_4443__000001_CT12DY,,,
John High Opticians (Sittingbourne),OP_5L4_2920__000001_ME104AW,OPT,,73 High Street,,Sittingbourne,,ME10 4AW,Tel: 01795 472525, - ,,,No ratings yet Rate it yourself - /Services/opticians/LeaveReview/DefaultView.aspx?id=OP_5L4_2920__000001_ME104AW,0,0,
Eye 2 Eye,OP_5L2_11435__000002_ME160PU,OPT,Mid Kent Shopping Centre,Castle Road,Allington,Maidstone,Kent,ME16 0PU,Tel: 01622 672563, - ,,,4 ratings Rate it yourself - /Services/opticians/LeaveReview/DefaultView.aspx?id=OP_5L2_11435__000002_ME160PU,,,yes
Boots Opticians (Sittingbourne),OPT_ME104AJ_1,OPT,,99 High Street,,Sittingbourne,,ME10 4AJ,Tel: 01795 427935, - ,,,No ratings yet Rate it yourself - /Services/opticians/LeaveReview/DefaultView.aspx?id=OPT_ME104AJ_1,0,0,
Vision Express (Sittingbourne),OP_5L4_10433__000002_ME104PB,OPT,,38 High Street,,Sittingbourne,,ME10 4PB,Tel: 01795 424149, - ,,,No ratings yet Rate it yourself - /Services/opticians/LeaveReview/DefaultView.aspx?id=OP_5L4_10433__000002_ME104PB,0,0,
John Frewin Opticians (Sittingbourne),OP_5L4_1462__000002_ME104PL,OPT,,114 High Street,,Sittingbourne,,ME10 4PL,Tel: 01795 472550, - ,,,No ratings yet Rate it yourself - /Services/opticians/LeaveReview/DefaultView.aspx?id=OP_5L4_1462__000002_ME104PL,0,0,
Specsavers (Sittingbourne),OP_5L4_9722__000001_ME103DL,OPT,,7/8 The Forum,,Sittingbourne,Kent,ME10 3DL,Tel: 01795 436100, - ,,,2 ratings Rate it yourself - /Services/opticians/LeaveReview/DefaultView.aspx?id=OP_5L4_9722__000001_ME103DL,,,
Pople & Broad Opticians,OP_5P7_13327__000002_TN218JB,OPT,50 High Street,,Heathfield,East Sussex,,TN21 8JB,Tel: 01435 863232, - ,,,No ratings yet Rate it yourself - /Services/opticians/LeaveReview/DefaultView.aspx?id=OP_5P7_13327__000002_TN218JB,0,0,
Asda Opticians (Canterbury),00291__000001_CT11BU,OPT,Asda Stores,Sturry Road,Canterbury,Kent,,CT1 1DG,Tel: 01227 378995, - ,,,1 rating Rate it yourself - /Services/opticians/LeaveReview/DefaultView.aspx?id=00291__000001_CT11BU,,,
Biggs Optometrists (Dover),OP_5LN_13645__000001_CT161DP,OPT,,7 High Street,,Dover,Kent,CT16 1DP,Tel: 01304 201000, - ,,,No ratings yet Rate it yourself - /Services/opticians/LeaveReview/DefaultView.aspx?id=OP_5LN_13645__000001_CT161DP,0,0,
N J Bailey Opticians,OP_5LN_2935__000002_CT161DR,OPT,20 High Street,20 High Street,Dover,Dover,,CT16 1DR,Tel: 01304 206665, - ,,,3 ratings Rate it yourself - /Services/opticians/LeaveReview/DefaultView.aspx?id=OP_5LN_2935__000002_CT161DR,,,
Specsavers (Dover),OP_5LN_3851__000001_CT161BD,OPT,Unit 2,11-16 Biggin Street,,Dover,,CT16 1BD,Tel: 01304 242020, - ,,,2 ratings Rate it yourself - /Services/opticians/LeaveReview/DefaultView.aspx?id=OP_5LN_3851__000001_CT161BD,,,
Tesco Opticians (Dover),CT16 3EH,OPT,,Tesco White Cliff Park,Whitfield,Dover,Kent,CT16 3PS,Tel: 0345 601 3479, - ,,,1 rating Rate it yourself - /Services/opticians/LeaveReview/DefaultView.aspx?id=CT16 3EH,,,
Specsavers Opticians,OPT_ME207NA_2,OPT,,Sainsburys Supermarket,"Quarry Wood, Mills road",Aylesford,Kent,ME20 7NA,Tel: 01622 797200, - ,,,No ratings yet Rate it yourself - /Services/opticians/LeaveReview/DefaultView.aspx?id=OPT_ME207NA_2,0,0,
Boots-Tunbridge Wells - Calverley Rd,OP_5FF_12824__000001_TN12UU,OPT,49 Calverley Road,,,Tunbridge Wells,Kent,TN1 2TT,Tel: 01892 525 561, - ,,,No ratings yet Rate it yourself - /Services/opticians/LeaveReview/DefaultView.aspx?id=OP_5FF_12824__000001_TN12UU,0,0,
Edney & Edney Ltd,CO-5383,OPT,,35 Monson Road,,"Tunbridge Wells, Kent ",,TN1 1LS,, - ,,,No ratings yet Rate it yourself - /Services/opticians/LeaveReview/DefaultView.aspx?id=CO-5383,0,0,
Edney & Edney,OPT_TN11LS_1,OPT,,35 Monson Road,,Tunbridge Wells,,TN1 1LS,Tel: 01892 517986, - ,,,No ratings yet Rate it yourself - /Services/opticians/LeaveReview/DefaultView.aspx?id=OPT_TN11LS_1,0,0,
Peepers,OP_5FF_9945__000001_TN11XU,OPT,49 High Street,Tunbridge Wells,Kent,,,TN1 1XU,Tel: 01892 534481, - ,,,No ratings yet Rate it yourself - /Services/opticians/LeaveReview/DefaultView.aspx?id=OP_5FF_9945__000001_TN11XU,0,0,
Scrivens Opticians (Tunbridge Wells),OP_5FF_11300__000001_TN11PN,OPT,29 Mount Pleasant,,Kent,Tunbridge Wells,,TN1 1PN,Tel: 01892 527999, - ,,,No ratings yet Rate it yourself - /Services/opticians/LeaveReview/DefaultView.aspx?id=OP_5FF_11300__000001_TN11PN,0,0,
Vision Express (Tunbridge Wells),OP_5FF_1__000001_TN12TH,OPT,23 Calverley Road,,Kent,Tunbridge Wells,,TN1 2TH,Tel: 01892 537585, - ,,,3 ratings Rate it yourself - /Services/opticians/LeaveReview/DefaultView.aspx?id=OP_5FF_1__000001_TN12TH,,,
David Clulow,OPT_TN11NX_1,OPT,,32-34 High Street,,Tunbridge Wells,Kent,TN1 1NX,Tel: 01892 512385, - ,,,No ratings yet Rate it yourself - /Services/opticians/LeaveReview/DefaultView.aspx?id=OPT_TN11NX_1,0,0,
Boots-Tunbridge Wells - Calverley Rd (in Boots UK),OP_5FF_11550__000002_TN12TE,OPT,7-11 Calverley Road,,,Tunbridge Wells,Kent,TN1 2TE,Tel: 01892 546063, - ,,,No ratings yet Rate it yourself - /Services/opticians/LeaveReview/DefaultView.aspx?id=OP_5FF_11550__000002_TN12TE,0,0,
Specsavers (Tunbridge Wells),OP_5FF_2826__000001_TN11QR,OPT,119 Mount Pleasant Road,,Kent,Tunbridge Wells,,TN1 1QR,Tel: 01892 533550, - ,,,1 rating Rate it yourself - /Services/opticians/LeaveReview/DefaultView.aspx?id=OP_5FF_2826__000001_TN11QR,,,
Leightons Opticians and Hearing Care,TP4N9,OPT,,2 Goods Station Road,,Tunbridge Wells,Kent,TN1 2BJ,Tel: 01892 539808, - ,,,No ratings yet Rate it yourself - /Services/opticians/LeaveReview/DefaultView.aspx?id=TP4N9,0,0,
Asda Opticians,OP_5P7_2058__000003_BN236JH,OPT,The Crumbles,Pevensey Bay Road,Eastbourne,East Sussex,,BN23 6JH,Tel: 01323 471873, - ,,,No ratings yet Rate it yourself - /Services/opticians/LeaveReview/DefaultView.aspx?id=OP_5P7_2058__000003_BN236JH,0,0,
Focus Medical Centre,OP_5LR_5090__000001_BN271BJ,OPT,18 High Street,,Hailsham,East Sussex,,BN27 1BJ,Tel: 01323 442062, - ,,,No ratings yet Rate it yourself - /Services/opticians/LeaveReview/DefaultView.aspx?id=OP_5LR_5090__000001_BN271BJ,0,0,
The Spectacle Showroom Ltd,OP_5P7_1234__000001_BN271AF,OPT,1 St Mary's Walk,High Street,Hailsham,East Sussex,,BN27 1AF,Tel: 01323 440394, - ,,,No ratings yet Rate it yourself - /Services/opticians/LeaveReview/DefaultView.aspx?id=OP_5P7_1234__000001_BN271AF,0,0,
Specsavers Opticians,OPT_BN271DP_1,OPT,,16 The Quintins,,Hailsham,East Sussex,BN27 1DP,Tel: 01323 840526, - ,,,No ratings yet Rate it yourself - /Services/opticians/LeaveReview/DefaultView.aspx?id=OPT_BN271DP_1,0,0,
Mark Soper Opticians,OP_5LR_13726__000001_BN271AU,OPT,The Grove,72 High Street,Hailsham,East Sussex,,BN27 1AU,Tel: 01323 841699, - ,,,No ratings yet Rate it yourself - /Services/opticians/LeaveReview/DefaultView.aspx?id=OP_5LR_13726__000001_BN271AU,0,0,
Leightons Opticians & Hearing Care,OP_5L3_154__000001_ME73PD,OPT,,67 Hempstead Valley Shopping Centre,,Gillingham,Kent,ME7 3PD,Tel: 01634 261311, - ,,,No ratings yet Rate it yourself - /Services/opticians/LeaveReview/DefaultView.aspx?id=OP_5L3_154__000001_ME73PD,0,0,
Vision Express (Gillingham),OPT_ME73PD_1,OPT,,Unit 39 Hempstead Valley Shopping Centre,,Gillingham,,ME7 3PD,Tel: 01634 365661, - ,,,No ratings yet Rate it yourself - /Services/opticians/LeaveReview/DefaultView.aspx?id=OPT_ME73PD_1,0,0,
Kings Hill Opticians,00325__000001_ME194AU,OPT,Liberty Square,,West Malling,Kent,,ME19 4AU,Tel: 01732 875544, - ,,,17 ratings Rate it yourself - /Services/opticians/LeaveReview/DefaultView.aspx?id=00325__000001_ME194AU,,,
Eye Concern,DOMICILIARYEYECARE1,OPT,,"134 London Road, Southborough",,Tunbridge Wells,,TN4 0PL,Tel: 01892 517312, - ,,,5 ratings Rate it yourself - /Services/opticians/LeaveReview/DefaultView.aspx?id=DOMICILIARYEYECARE1,,,
Day Lewis Opticians (Southborough),OPT_TN40PN_1,OPT,,100 London Road,,Southborough,,TN4 0PN,Tel: 01892 529626, - ,,,No ratings yet Rate it yourself - /Services/opticians/LeaveReview/DefaultView.aspx?id=OPT_TN40PN_1,0,0,
Kent Eye Care Ltd,NKCCKNCK,OPT,Kent Eye Care Independent Specialist Optometrists & Opticians,786 London Road,,"Larkfield, Aylesford",Kent,ME20 6BE,Tel: 01732 873378, - ,,,1 rating Rate it yourself - /Services/opticians/LeaveReview/DefaultView.aspx?id=NKCCKNCK,,,no
The Spectacle Showroom,TP5AP,OPT,,A3 Ropemaker Park,Diplocks Way,Hailsham,East Sussex,BN27 3GU,Tel: 01323 440394, - ,,,No ratings yet Rate it yourself - /Services/opticians/LeaveReview/DefaultView.aspx?id=TP5AP,0,0,