Organisation Name,NACS Code,Organisation Type,Address1,Address2,Address3,Address4,Address5,PostCode,Telephone Number,Opening time,Value  (Opening time),Banding Classification  (Opening time),NHS.UK users rating,Value  (NHS.UK users rating),Banding Classification  (NHS.UK users rating),Car parking (Is there car parking at this organisation?)
S W & C Jackson,OP_5H4_8467__000001_CW55EW,OPT,43/45 Welsh Row,,Nantwich,Cheshire,,CW5 5EW,Tel: 01270 625889, - ,,,No ratings yet Rate it yourself - /Services/opticians/LeaveReview/DefaultView.aspx?id=OP_5H4_8467__000001_CW55EW,0,0,
Specsavers Opticians,OP_CW55AH_84955,OPT,,19 High Street,,Nantwich,,CW5 5AH,Tel: 01270 621 660, - ,,,2 ratings Rate it yourself - /Services/opticians/LeaveReview/DefaultView.aspx?id=OP_CW55AH_84955,,,
Bayfields Opticians and Audiologists (Nantwich) ,U0A1V,OPT,,33 High Street,,Nantwich,Cheshire,CW5 5AH,Tel: 01270 629171, - ,,,No ratings yet Rate it yourself - /Services/opticians/LeaveReview/DefaultView.aspx?id=U0A1V,0,0,
Boots-Nantwich,OP_5H4_13846__000001_CW55AB,OPT,13 Pepper Street,,Nantwich,Cheshire,,CW5 5AB,Tel: 01270 610904, - ,,,1 rating Rate it yourself - /Services/opticians/LeaveReview/DefaultView.aspx?id=OP_5H4_13846__000001_CW55AB,,,
Cheshire Consulting Centre,CW2 6QP__000002_CW26QP,OPT,499 Crewe Road,Wistaston,Crewe,Cheshire,,CW2 6QP,Tel: 01270 669 098, - ,,,No ratings yet Rate it yourself - /Services/opticians/LeaveReview/DefaultView.aspx?id=CW2 6QP__000002_CW26QP,0,0,
I Wear Opticians Ltd,OL/CO-2071/5NN__000001_CW6OAT,OPT,72 High Street,Tarporley,Nr Chester,Cheshire,,CW6 0AT,Tel: 01829 733661, - ,,,No ratings yet Rate it yourself - /Services/opticians/LeaveReview/DefaultView.aspx?id=OL/CO-2071/5NN__000001_CW6OAT,0,0,
Worden Optometrists,OP_5H3_3936__000001_CW60DX,OPT,42 High Street,,,Tarporley,,CW6 0DX,Tel: 01829 732501, - ,,,3 ratings Rate it yourself - /Services/opticians/LeaveReview/DefaultView.aspx?id=OP_5H3_3936__000001_CW60DX,,,
Asda Stores Limited,OP_5H4_14186__000001_CW12PT,OPT,Victoria Centre,,Crewe,Cheshire,,CW1 2PT,Tel: 01270 614912, - ,,,No ratings yet Rate it yourself - /Services/opticians/LeaveReview/DefaultView.aspx?id=OP_5H4_14186__000001_CW12PT,0,0,
Gillian Sherratt Opticians,OP_5H4_13543__000001_CW26AL,OPT,78 Nantwich Road,,Crewe,Cheshire,,CW2 6AL,Tel: 01270 505504, - ,,,No ratings yet Rate it yourself - /Services/opticians/LeaveReview/DefaultView.aspx?id=OP_5H4_13543__000001_CW26AL,0,0,
Boots-Crewe - Queensway,OP_5H4_1084__000001_CW12HH,OPT,13-15 Queensway,,,Crewe,Cheshire,CW1 2HH,Tel: 01270 257957, - ,,,No ratings yet Rate it yourself - /Services/opticians/LeaveReview/DefaultView.aspx?id=OP_5H4_1084__000001_CW12HH,0,0,
Scrivens Ltd,OP_5H4_13451__000002_CW12PU,OPT,12 Victoria Centre,,,Crewe,Cheshire,CW1 2PU,Tel: 01270 215945, - ,,,No ratings yet Rate it yourself - /Services/opticians/LeaveReview/DefaultView.aspx?id=OP_5H4_13451__000002_CW12PU,0,0,
Crewe Vision Express Ltd,OP_5H4_6398__000001_CW12EL,OPT,52 Market Street,,,Crewe,Cheshire,CW1 2EL,Tel: 01270 501516, - ,,,No ratings yet Rate it yourself - /Services/opticians/LeaveReview/DefaultView.aspx?id=OP_5H4_6398__000001_CW12EL,0,0,
Specsavers Opticians,OP_5H4_13341__000001_CW12NG,OPT,,49 Market Street,,Crewe,Cheshire,CW1 2NG,Tel: 01270 250 707, - ,,,No ratings yet Rate it yourself - /Services/opticians/LeaveReview/DefaultView.aspx?id=OP_5H4_13341__000001_CW12NG,0,0,
Tesco Opticians,CW12DD060716,OPT,,Vernon Way,,Crewe,,CW1 2DD,, - ,,,No ratings yet Rate it yourself - /Services/opticians/LeaveReview/DefaultView.aspx?id=CW12DD060716,0,0,
Francis (Opticians) Ltd,OP_5H3_13391__000001_SY148NP,OPT,1 Dobson Court,,Malpas,Cheshire,,SY14 8NP,Tel: 01948 861259, - ,,,No ratings yet Rate it yourself - /Services/opticians/LeaveReview/DefaultView.aspx?id=OP_5H3_13391__000001_SY148NP,0,0,
Specsavers (Whitchurch),X1P8R,OPT,,Unit 7-8 Brownlow Street Parade,,Whitchurch,Shropshire,SY13 1QW,Tel: 01948 800390, - ,,,No ratings yet Rate it yourself - /Services/opticians/LeaveReview/DefaultView.aspx?id=X1P8R,0,0,
Nusyte Optical (whit) Ltd,OP5M257__000003_SY131AD,OPT,Nusyte Opticians (Whit),33 Green End,,Whitchurch,Shropshire,SY13 1AD,Tel: 01948 662919, - ,,,No ratings yet Rate it yourself - /Services/opticians/LeaveReview/DefaultView.aspx?id=OP5M257__000003_SY131AD,0,0,
Jane Smellie Opticians,OP_5M2_1844__000002_SY131AD,OPT,26 High Street,,,Whitchurch,Shropshire,SY13 1AU,Tel: 01948 666767, - ,,,4 ratings Rate it yourself - /Services/opticians/LeaveReview/DefaultView.aspx?id=OP_5M2_1844__000002_SY131AD,,,
P W Churms,OP_5M2_3217__000002_SY131AF,OPT,PW Churms,11 Bredwood Arcade,,Whitchurch,Shropshire,SY13 1AF,Tel: 01948 665126, - ,,,1 rating Rate it yourself - /Services/opticians/LeaveReview/DefaultView.aspx?id=OP_5M2_3217__000002_SY131AF,,,
Winsford Eye & Foot Care,OPT_CW72LX_1,OPT,,27 Delamere Street,,Winsford,,CW7 2LX,Tel: 01606 599 030, - ,,,No ratings yet Rate it yourself - /Services/opticians/LeaveReview/DefaultView.aspx?id=OPT_CW72LX_1,0,0,
Taylors Optometrists,OPT_CW71BP_1,OPT,,4 Dene Drive,,Winsford,,CW7 1BP,Tel: 01606 551 093, - ,,,No ratings yet Rate it yourself - /Services/opticians/LeaveReview/DefaultView.aspx?id=OPT_CW71BP_1,0,0,
L R & E A Taylor,OP_5H4_10968__000002_CW71AE,OPT,,4 Dene Drive,Winsford,Cheshire,,CW7 1BP,Tel: 01606 551093, - ,,,No ratings yet Rate it yourself - /Services/opticians/LeaveReview/DefaultView.aspx?id=OP_5H4_10968__000002_CW71AE,0,0,yes
ASDA opticians,CW71BD041116,OPT,,The drumber,,Winsford,,CW7 1BD,Tel: 01606 596 412, - ,,,No ratings yet Rate it yourself - /Services/opticians/LeaveReview/DefaultView.aspx?id=CW71BD041116,0,0,
Winsford Visionplus Limited,CW7 1AE__000003_CW71AE,OPT,4 Queens Parade,,Winsford,Cheshire,,CW7 1AE,Tel: 01606 541510, - ,,,No ratings yet Rate it yourself - /Services/opticians/LeaveReview/DefaultView.aspx?id=CW7 1AE__000003_CW71AE,0,0,
Bramwells Opticians,OP_5H4_2399__000001_CW72AD,OPT,62 High Street,,Winsford,Cheshire,,CW7 2AD,Tel: 01606 593270, - ,,,No ratings yet Rate it yourself - /Services/opticians/LeaveReview/DefaultView.aspx?id=OP_5H4_2399__000001_CW72AD,0,0,
CATS (Optometrist & Contact Lens Centre),OP_5H4_1374__000002_CW109AG,OPT,30-32 Wheelock Street,,,Middlewich,Cheshire,CW10 9AG,Tel: 01606 836582, - ,,,1 rating Rate it yourself - /Services/opticians/LeaveReview/DefaultView.aspx?id=OP_5H4_1374__000002_CW109AG,,,
Bramwells Opticians,OP_5H4_2395__000001_CW111AB,OPT,4 Hightown,,Sandbach,Cheshire,,CW11 1AB,Tel: 01270 763641, - ,,,No ratings yet Rate it yourself - /Services/opticians/LeaveReview/DefaultView.aspx?id=OP_5H4_2395__000001_CW111AB,0,0,
Steven D Morris Opticians,OP_5H4_13468__000001_CW111GT,OPT,2 Welles Street,,Sandbach,Cheshire,,CW11 1GT,Tel: 01270 765848, - ,,,No ratings yet Rate it yourself - /Services/opticians/LeaveReview/DefaultView.aspx?id=OP_5H4_13468__000001_CW111GT,0,0,
Paul Rowlands Opticians,OP_5H4_4304__000001_CW111AR,OPT,2 Georges Walk,Off High Street,Sandbach,,,CW11 1AR,Tel: 01270 759916, - ,,,1 rating Rate it yourself - /Services/opticians/LeaveReview/DefaultView.aspx?id=OP_5H4_4304__000001_CW111AR,,,
Boots Opticians,OPT_CW111JH_1,OPT,,Unit 4 10 Congleton Road,,Sandbach,,CW11 1HJ,Tel: 01270 766 870, - ,,,1 rating Rate it yourself - /Services/opticians/LeaveReview/DefaultView.aspx?id=OPT_CW111JH_1,,,
Boots-Sandbach,OP_5H4_4093__000001_CW110DA,OPT,Unit 4,10 Congleton Road,,Sandbach,,CW11 1HJ,Tel: 01270 766870, - ,,,1 rating Rate it yourself - /Services/opticians/LeaveReview/DefaultView.aspx?id=OP_5H4_4093__000001_CW110DA,,,
T J Hopkins,OP_5H4_13430__000001_ST72JA,OPT,122 Crewe Road,,Alsager,Cheshire,,ST7 2JA,Tel: 01270 872523, - ,,,No ratings yet Rate it yourself - /Services/opticians/LeaveReview/DefaultView.aspx?id=OP_5H4_13430__000001_ST72JA,0,0,
Newbold Opticians,OP5M248__000002_TF91PR,OPT,,58 Cheshire Street,,Market Drayton,Shropshire,TF9 1PR,Tel: 01630 652943, - ,,,No ratings yet Rate it yourself - /Services/opticians/LeaveReview/DefaultView.aspx?id=OP5M248__000002_TF91PR,0,0,
Specsavers Opticians,OP_TF91PH_34098,OPT,,37A Cheshire Street,,Market Drayton,,TF9 1PH,, - ,,,No ratings yet Rate it yourself - /Services/opticians/LeaveReview/DefaultView.aspx?id=OP_TF91PH_34098,0,0,
Scrivens Ltd,OP_5H4_13359__000001_ST72AE,OPT,10 Lawton Road,,,Alsager,Cheshire,ST7 2AE,Tel: 01270 873256, - ,,,No ratings yet Rate it yourself - /Services/opticians/LeaveReview/DefaultView.aspx?id=OP_5H4_13359__000001_ST72AE,0,0,
Drayton Eye Centre,OP5M250__000001_TF91QB,OPT,19 High Street,,Market Drayton,Shropshire,,TF9 1QF,Tel: 01630 656956, - ,,,No ratings yet Rate it yourself - /Services/opticians/LeaveReview/DefaultView.aspx?id=OP5M250__000001_TF91QB,0,0,
Mincher Lochett PJ & JE Optometrists,OP_5M2_1783__000001_TF91PD,OPT,18-20 Cheshire Street,,Market Drayton,Shropshire,,TF9 1PD,Tel: 01630 652945, - ,,,No ratings yet Rate it yourself - /Services/opticians/LeaveReview/DefaultView.aspx?id=OP_5M2_1783__000001_TF91PD,0,0,
M Broad Opticians,OP_5H4_1328__000001_ST72AF,OPT,14a Lawton Road,,Alsager,Cheshire,,ST7 2AF,Tel: 01270 882235, - ,,,No ratings yet Rate it yourself - /Services/opticians/LeaveReview/DefaultView.aspx?id=OP_5H4_1328__000001_ST72AF,0,0,
BOS Optical,OPT_CW81HH_1,OPT,,79 Chester Road,,Northwich,Cheshire,CW8 1HH,Tel: 01606 782 330, - ,,,1 rating Rate it yourself - /Services/opticians/LeaveReview/DefaultView.aspx?id=OPT_CW81HH_1,,,
Looking Ahead,OP_5H4_4160__000002_CW83EU,OPT,37 Northwich Road,Weaverham,Nr Northwich,Cheshire,,CW8 3EU,Tel: 01606 853300, - ,,,No ratings yet Rate it yourself - /Services/opticians/LeaveReview/DefaultView.aspx?id=OP_5H4_4160__000002_CW83EU,0,0,
A1 Vision,00082__000003_CH35LB,OPT,64 Green Lane,Vicars Cross,Chester,Cheshire,,CH3 5LB,Tel: 01244 329292, - ,,,No ratings yet Rate it yourself - /Services/opticians/LeaveReview/DefaultView.aspx?id=00082__000003_CH35LB,0,0,
Northwich Visionplus Limited,OP_5H4_13471__000001_CW95DD,OPT,Unit 2,39/47 High Street,Northwich,,,CW9 5DD,Tel: 01606 49779, - ,,,No ratings yet Rate it yourself - /Services/opticians/LeaveReview/DefaultView.aspx?id=OP_5H4_13471__000001_CW95DD,0,0,
Vision Express Ltd,OP_5H4_13485__000001_CW95AU,OPT,70 High Street,,Northwich,Cheshire,,CW9 5AU,Tel: 01606 41155, - ,,,No ratings yet Rate it yourself - /Services/opticians/LeaveReview/DefaultView.aspx?id=OP_5H4_13485__000001_CW95AU,0,0,
Boots-Northwich - Witton St,OP_5H4_13528__000001_CW95DE,OPT,55-55a Witton Street,,Northwich,Cheshire,,CW9 5DE,Tel: 01606 40799, - ,,,No ratings yet Rate it yourself - /Services/opticians/LeaveReview/DefaultView.aspx?id=OP_5H4_13528__000001_CW95DE,0,0,
Toleman Ophthalmic Practice,OP_5H5_8860__000001_CW47BB,OPT,The Health Centre,London Road,,Holmes Chapel,Cheshire,CW4 7BB,Tel: 01477 537587, - ,,,6 ratings Rate it yourself - /Services/opticians/LeaveReview/DefaultView.aspx?id=OP_5H5_8860__000001_CW47BB,,,
Dollond & Aitchison Professional Services Ltd,OP_5H4_5366__000001_CW95AG,OPT,38 Witton Street,,Northwich,Cheshire,,CW9 5AG,Tel: 01606 43087, - ,,,No ratings yet Rate it yourself - /Services/opticians/LeaveReview/DefaultView.aspx?id=OP_5H4_5366__000001_CW95AG,0,0,
Bramwells Opticians,OP_5H5_2400__000001_CW47NF,OPT,8 Macclesfield Road,,Holmes Chapel,Cheshire,,CW4 7NF,Tel: 01477 533169, - ,,,No ratings yet Rate it yourself - /Services/opticians/LeaveReview/DefaultView.aspx?id=OP_5H5_2400__000001_CW47NF,0,0,
Jane Smellie Opticians Ltd,CH4 9DE_11111,OPT,,Wrexham Road,,Chester,,CH4 9DE,, - ,,,No ratings yet Rate it yourself - /Services/opticians/LeaveReview/DefaultView.aspx?id=CH4 9DE_11111,0,0,
Houghton Opticians,OP_5H3_3612__000001_CH23AZ,OPT,14 Charles Street,Hoole,Chester,Cheshire,,CH2 3AZ,Tel: 01244 325969, - ,,,No ratings yet Rate it yourself - /Services/opticians/LeaveReview/DefaultView.aspx?id=OP_5H3_3612__000001_CH23AZ,0,0,
Optical Express,CH11DD_12348,OPT,,"The Exchange, Suite 2, 1st Floor, St John Street",,Chester,,CH1 1DD,Tel: 0800 0232020, - ,,,No ratings yet Rate it yourself - /Services/opticians/LeaveReview/DefaultView.aspx?id=CH11DD_12348,0,0,
Boots-Chester - Foregate St,OP_5H3_500__000002_CH11NA,OPT,47-55 Foregate Street,,,Chester,Cheshire,CH1 1NA,Tel: 01244 312843, - ,,,No ratings yet Rate it yourself - /Services/opticians/LeaveReview/DefaultView.aspx?id=OP_5H3_500__000002_CH11NA,0,0,
"G Uddin Ltd, T/A The Eye Emporium Ltd",OP_5H3_13511__000001_CH11EF,OPT,10 St Michaels Row,,Chester,Cheshire,,CH1 1EF,Tel: 01244 341116, - ,,,No ratings yet Rate it yourself - /Services/opticians/LeaveReview/DefaultView.aspx?id=OP_5H3_13511__000001_CH11EF,0,0,
"H T Churchman, T/A J D Siddall",OP_5H3_13447__000001_CH11XR,OPT,The Cross,4 Bridge Street,Chester,Cheshire,,CH1 1NQ,Tel: 01244 320222, - ,,,No ratings yet Rate it yourself - /Services/opticians/LeaveReview/DefaultView.aspx?id=OP_5H3_13447__000001_CH11XR,0,0,
Boots-Chester - Frodsham St,OP_5H3_2734__000001_CH11HD,OPT,7 Frodsham Street,,Chester,Cheshire,,CH1 3JJ,Tel: 01244 321636, - ,,,No ratings yet Rate it yourself - /Services/opticians/LeaveReview/DefaultView.aspx?id=OP_5H3_2734__000001_CH11HD,0,0,
Jonathan Bryan Opticians,OP_5H3_13193__000002_CH12DY,OPT,St Oswalds Chambers,20-22 St Werburgh Street,Chester,Cheshire,,CH1 2DY,Tel: 01244 321045, - ,,,No ratings yet Rate it yourself - /Services/opticians/LeaveReview/DefaultView.aspx?id=OP_5H3_13193__000002_CH12DY,0,0,
Bayfields Opticians and Audiologists (Chester),O3M3N,OPT,,29 St Werburgh Street,,Chester,Cheshire,CH1 2DY,Tel: 01244 315112, - ,,,No ratings yet Rate it yourself - /Services/opticians/LeaveReview/DefaultView.aspx?id=O3M3N,0,0,
Vision Express UK Ltd,OP_5H3_12941__000003_CH12HA,OPT,42/48 Northgate Street,,Chester,Cheshire,,CH1 2HA,Tel: 01244 409138, - ,,,No ratings yet Rate it yourself - /Services/opticians/LeaveReview/DefaultView.aspx?id=OP_5H3_12941__000003_CH12HA,0,0,
Chester Visionplus Limited,OP_5H3_3003__000004_CH12HA,OPT,40 Northgate Street,Chester,Cheshire,,,CH1 2HA,Tel: 01244 310 832, - ,,,No ratings yet Rate it yourself - /Services/opticians/LeaveReview/DefaultView.aspx?id=OP_5H3_3003__000004_CH12HA,0,0,
Thompson Opticians,OP_5HR_1864__000001_ST71EA,OPT,65 Liverpool Road,Kidsgrove,Stoke-on-Trent,,,ST7 1EA,Tel: 01782 786998, - ,,,No ratings yet Rate it yourself - /Services/opticians/LeaveReview/DefaultView.aspx?id=OP_5HR_1864__000001_ST71EA,0,0,
S W Cotton Optometrist,OP_5HR_7856__000001_ST74EH,OPT,92 Liverpool Road,Kidsgrove,Stoke-on-Trent,,,ST7 4EH,Tel: 01782 782385, - ,,,No ratings yet Rate it yourself - /Services/opticians/LeaveReview/DefaultView.aspx?id=OP_5HR_7856__000001_ST74EH,0,0,
Asda Opticians,OPT_CH1 4QQ,OPT,,"UNIT 33, GREYHOUND RETAIL PARK",CHASER COURT,CHESTER,,CH1 4QQ,Tel: 01244 360 816, - ,,,1 rating Rate it yourself - /Services/opticians/LeaveReview/DefaultView.aspx?id=OPT_CH1 4QQ,,,
Nusyte Optical (wem) Ltd ,OP_5M2_11139__000002_SY45DG,OPT,Nusyte Opticians (Wem),10 High street,,Wem,Shropshire,SY4 5AA,Tel: 01939 232016, - ,,,No ratings yet Rate it yourself - /Services/opticians/LeaveReview/DefaultView.aspx?id=OP_5M2_11139__000002_SY45DG,0,0,
Taylor's Opticians,OP_5H3_13914__000001_WA66QS,OPT,4 Eddisbury Square,,Frodsham,Cheshire,Cheshire,WA6 6QS,Tel: 01928 732255, - ,,,No ratings yet Rate it yourself - /Services/opticians/LeaveReview/DefaultView.aspx?id=OP_5H3_13914__000001_WA66QS,0,0,
Boots-Frodsham,OP_5H3_10421__000001_WA66QW,OPT,32 Church Street,,Frodsham,Cheshire,,WA6 6QW,Tel: 01928 735341, - ,,,No ratings yet Rate it yourself - /Services/opticians/LeaveReview/DefaultView.aspx?id=OP_5H3_10421__000001_WA66QW,0,0,
M E Cook,OP_5H3_13362__000001_WA66PN,OPT,33 Church Street,,Frodsham,Cheshire,,WA6 6PN,Tel: 01928 733609, - ,,,No ratings yet Rate it yourself - /Services/opticians/LeaveReview/DefaultView.aspx?id=OP_5H3_13362__000001_WA66PN,0,0,
Dollond & Aitchison,OP_5HW_13142__000001_ST51SW,OPT,Unit 11 Roebuck Centre,High Street,Newcastle-under-Lyme,,,ST5 1SW,Tel: 01782 630 478, - ,,,No ratings yet Rate it yourself - /Services/opticians/LeaveReview/DefaultView.aspx?id=OP_5HW_13142__000001_ST51SW,0,0,
Boots-Newcastle under Lyme - High St,OP_5HW_5841__000002_ST51QL,OPT,60-62 High Street,,,Newcastle Under Lyme,Staffordshire,ST5 1QL,Tel: 01782 711739, - ,,,1 rating Rate it yourself - /Services/opticians/LeaveReview/DefaultView.aspx?id=OP_5HW_5841__000002_ST51QL,,,
Browns Opticians,OP_5PH_0003__000002_ST52AE,OPT,33 Merrial Street,,Newcastle-under-Lyme,Staffordshire,,ST5 2AE,Tel: 01782 715113, - ,,,No ratings yet Rate it yourself - /Services/opticians/LeaveReview/DefaultView.aspx?id=OP_5PH_0003__000002_ST52AE,0,0,
Lancaster & Thorpe,OP_5HW_10835__000001_ST52AE,OPT,57 Merrial Street,,Newcastle,,,ST5 2AE,Tel: 01782 617400, - ,,,No ratings yet Rate it yourself - /Services/opticians/LeaveReview/DefaultView.aspx?id=OP_5HW_10835__000001_ST52AE,0,0,
"McKellen, Ashton & Tavernor",OP_5PH_0001__000001_ST52DZ,OPT,6 Friar Street,,Newcaslte-under-Lyme,Staffordshire,,ST5 2DZ,Tel: 01782 619175, - ,,,No ratings yet Rate it yourself - /Services/opticians/LeaveReview/DefaultView.aspx?id=OP_5PH_0001__000001_ST52DZ,0,0,
Nusyte Opticians (Wol),OP_5HW_2210__000004_ST50EP,OPT,Nusyte Opticians (Wol),107 High Street,Wolstanton,Newcastle-u-Lyme,,ST5 0EP,Tel: 01782 617072, - ,,,No ratings yet Rate it yourself - /Services/opticians/LeaveReview/DefaultView.aspx?id=OP_5HW_2210__000004_ST50EP,0,0,
B Newbold (Newcastle) Ltd,OP_5HW_9731__000001_ST51RP,OPT,34 Ironmarket,,Newcastle,,,ST5 1RP,Tel: 01782 617044, - ,,,No ratings yet Rate it yourself - /Services/opticians/LeaveReview/DefaultView.aspx?id=OP_5HW_9731__000001_ST51RP,0,0,
Specsavers Opticians,OP_5HW_3465__000001_ST51QZ,OPT,Unit 9 Castle Walk,,Staffordshire,Newcastle-under-Lyme,Staffordshire,ST5 1AN,Tel: 01782 714 444, - ,,,3 ratings Rate it yourself - /Services/opticians/LeaveReview/DefaultView.aspx?id=OP_5HW_3465__000001_ST51QZ,,,
Burgess Opticians,OP_5PJ_0002__000001_ST65AW,OPT,97 Roundwell Street,Tunstall,Stoke-on-Trent,Staffordshire,,ST6 5AW,Tel: 01782 837881, - ,,,No ratings yet Rate it yourself - /Services/opticians/LeaveReview/DefaultView.aspx?id=OP_5PJ_0002__000001_ST65AW,0,0,
Ernest G Hanwell Ltd,OP_5ME_10839__000001_ST65AA,OPT,8 Tower Square,Tunstall,Stoke-on-Trent,,,ST6 5AA,Tel: 01782 838710, - ,,,No ratings yet Rate it yourself - /Services/opticians/LeaveReview/DefaultView.aspx?id=OP_5ME_10839__000001_ST65AA,0,0,
James Herd Opticians,OP_5ME_4308__000001_ST65TA,OPT,59 High Street,Tunstall,Stoke-on-Trent,,,ST6 5TA,Tel: 01782 837961, - ,,,No ratings yet Rate it yourself - /Services/opticians/LeaveReview/DefaultView.aspx?id=OP_5ME_4308__000001_ST65TA,0,0,
Nusyte Opticians (tunstall),OP_5ME_4057__000001_ST65AN,OPT,Nusyte Opticians (Tunstall),115 High street,Tunstall,Stoke-on-Trent,Staffordshire,ST6 5TA,Tel: 01782 837858, - ,,,1 rating Rate it yourself - /Services/opticians/LeaveReview/DefaultView.aspx?id=OP_5ME_4057__000001_ST65AN,,,
Nuvision Opticians,CO-5045,OPT,Nuvision,84 High Street Stoke on Trent,,Stoke on Trent,Staffordshire,ST6 5TJ,Tel: 01782 499600, - ,,,No ratings yet Rate it yourself - /Services/opticians/LeaveReview/DefaultView.aspx?id=CO-5045,0,0,
S R Drinnan,OP_5M2_5707__000001_SY120AN,OPT,12 Market Street,,Ellesmere,Shropshire,,SY12 0AN,Tel: 01691 623300, - ,,,No ratings yet Rate it yourself - /Services/opticians/LeaveReview/DefaultView.aspx?id=OP_5M2_5707__000001_SY120AN,0,0,
Asda Opticians,OP_5PH_0002__000001_ST50AP,OPT,Wolstanton Retail Park,Wolstanton,Newcastle-under-Lyme,Staffordshire,,ST5 0AP,Tel: 01782 349112, - ,,,158 ratings Rate it yourself - /Services/opticians/LeaveReview/DefaultView.aspx?id=OP_5PH_0002__000001_ST50AP,,,
Scrivens Ltd,OP_5ME_6427__000001_ST63AG,OPT,37 Market Place,Burslem,,Stoke on Trent,Staffordshire,ST6 3AG,Tel: 01782 837530, - ,,,1 rating Rate it yourself - /Services/opticians/LeaveReview/DefaultView.aspx?id=OP_5ME_6427__000001_ST63AG,,,
Nusyte Opticians (burslem),OP_5PJ_0007__000002_ST63EH,OPT,Nusyte Opticians (Burslem),45 Queen Street,Burslem,Stoke-on-Trent,Staffordshire,ST6 3EH,Tel: 01782 834936, - ,,,No ratings yet Rate it yourself - /Services/opticians/LeaveReview/DefaultView.aspx?id=OP_5PJ_0007__000002_ST63EH,0,0,
Kenneth Wright,OP_5ME_1551__000001_ST47NX,OPT,340 Hartshill Road,,Stoke-on-Trent,Stoke-on-Trent,,ST4 7NX,Tel: 01782 617217, - ,,,2 ratings Rate it yourself - /Services/opticians/LeaveReview/DefaultView.aspx?id=OP_5ME_1551__000001_ST47NX,,,
L Thompson Optometrist,OP_5H5_13453__000002_CW121JN,OPT,5 West Street,,Congleton,Cheshire,,CW12 1JN,Tel: 01260 270941, - ,,,1 rating Rate it yourself - /Services/opticians/LeaveReview/DefaultView.aspx?id=OP_5H5_13453__000002_CW121JN,,,
Vision Express (UK) Ltd,OP_5H5_2269__000001_CW121AN,OPT,17a Bridge Street,,Congleton,Cheshire,,CW12 1AS,Tel: 01260 299300, - ,,,No ratings yet Rate it yourself - /Services/opticians/LeaveReview/DefaultView.aspx?id=OP_5H5_2269__000001_CW121AN,0,0,
Boots Opticians - Congleton,5NP001,OPT,,9-11 Bridge Street,,Congleton,,CW12 1AY,, - ,,,7 ratings Rate it yourself - /Services/opticians/LeaveReview/DefaultView.aspx?id=5NP001,,,
Congleton Visionplus Limited,OP_5H5_13407__000001_CW121BD,OPT,3a Bridestone Centre,Victoria Street,Congleton,Cheshire,,CW12 1XD,Tel: 01260 299 395, - ,,,No ratings yet Rate it yourself - /Services/opticians/LeaveReview/DefaultView.aspx?id=OP_5H5_13407__000001_CW121BD,0,0,
Mullens Opticians,OP_5J1_9152__000002_WA72BX,OPT,98 River Walk,Halton Lea,Runcorn,Cheshire,,WA7 2BX,Tel: 01928 790083, - ,,,No ratings yet Rate it yourself - /Services/opticians/LeaveReview/DefaultView.aspx?id=OP_5J1_9152__000002_WA72BX,0,0,
Specsavers Opticians,OP_5J1_4930__000001_WA72BY,OPT,104 Bridge Walk,Halton Lea,Runcorn,Cheshire,,WA7 2BY,Tel: 01928 716200, - ,,,No ratings yet Rate it yourself - /Services/opticians/LeaveReview/DefaultView.aspx?id=OP_5J1_4930__000001_WA72BY,0,0,
Costco Wholesale UK Ltd,OP_CH16LT_84858,OPT,,Dunkirk Trading Estate,Chester Gates,Chester,,CH1 6LT,Tel: 01244 852 085, - ,,,No ratings yet Rate it yourself - /Services/opticians/LeaveReview/DefaultView.aspx?id=OP_CH16LT_84858,0,0,
Glyn Jones (Hanley) Ltd,OP_5ME_12317__000001_ST15LA,OPT,36 Trinity Street,,Stoke-on-Trent,Hanley,Staffordshire,ST1 5LA,Tel: 01782 212666, - ,,,7 ratings Rate it yourself - /Services/opticians/LeaveReview/DefaultView.aspx?id=OP_5ME_12317__000001_ST15LA,,,
Nusyte Opticians (biddulph),01-17051,OPT,,49 High Street,,Stoke-on-Trent,,ST8 6AD,, - ,,,No ratings yet Rate it yourself - /Services/opticians/LeaveReview/DefaultView.aspx?id=01-17051,0,0,
Nusyte Opticians (stoke),01-22440,OPT,,80-82 Church Street,,Stoke-on-Trent,,ST4 1BS,Tel: 01782 845592, - ,,,No ratings yet Rate it yourself - /Services/opticians/LeaveReview/DefaultView.aspx?id=01-22440,0,0,
Edwards RG,5MF-014__000002_ST44AA,OPT,80-82 Church Street,Stoke,Stoke On Trent,Staffordshire,,ST4 1BS,Tel: 01782 848070, - ,,,No ratings yet Rate it yourself - /Services/opticians/LeaveReview/DefaultView.aspx?id=5MF-014__000002_ST44AA,0,0,
Dolland & Aitchison,OP_5PH_0004__000004_ST11PS,OPT,Unit 221 Potteries Shopping Centre,Hanley,Stoke-on-Trent,Staffordshire,,ST1 1PS,Tel: 01782 219754, - ,,,No ratings yet Rate it yourself - /Services/opticians/LeaveReview/DefaultView.aspx?id=OP_5PH_0004__000004_ST11PS,0,0,
Vision Express (UK) Ltd,OP_5ME_12350__000002_ST11PS,OPT,The Potteries Shopping Centre,Hanley,Stoke-on-Trent,,,ST1 1PS,Tel: 01782 283400, - ,,,No ratings yet Rate it yourself - /Services/opticians/LeaveReview/DefaultView.aspx?id=OP_5ME_12350__000002_ST11PS,0,0,
Optical Express,ST1 1QH_27836,OPT,Suite 10 The Forecourt,12 Albion St,,Stoke-on-trent,Staffordshire,ST1 1QH,Tel: 0800 023 2020, - ,,,No ratings yet Rate it yourself - /Services/opticians/LeaveReview/DefaultView.aspx?id=ST1 1QH_27836,0,0,
Specsavers Opticians,OP_5ME_13105__000001_ST11NP,OPT,2/4 Piccadilly,Hanley,Stoke-on-Trent,,,ST1 1DF,Tel: 01782 206662, - ,,,No ratings yet Rate it yourself - /Services/opticians/LeaveReview/DefaultView.aspx?id=OP_5ME_13105__000001_ST11NP,0,0,