Organisation Name,NACS Code,Organisation Type,Address1,Address2,Address3,Address4,Address5,PostCode,Telephone Number,Opening time,Value  (Opening time),Banding Classification  (Opening time),NHS.UK users rating,Value  (NHS.UK users rating),Banding Classification  (NHS.UK users rating),Car parking (Is there car parking at this organisation?)
Vision Express,OP_RG147HB_85778,OPT,,"Tesco Express, Pinchington Lane",,Newbury,,RG14 7HB,, - ,,,No ratings yet Rate it yourself - /Services/opticians/LeaveReview/DefaultView.aspx?id=OP_RG147HB_85778,0,0,
Tesco Opticians,OP_SP101UZ_29725,OPT,,River Way,,Andover,Hampshire,SP10 1UZ,Tel: 0345 601 3479, - ,,,No ratings yet Rate it yourself - /Services/opticians/LeaveReview/DefaultView.aspx?id=OP_SP101UZ_29725,0,0,
Vision Express,OP_5DK_11298__000002_RG170DL,OPT,,21 High Street,,Hungerford,Berkshire,RG17 0NF,Tel: 01488 682458, - ,,,No ratings yet Rate it yourself - /Services/opticians/LeaveReview/DefaultView.aspx?id=OP_5DK_11298__000002_RG170DL,0,0,yes
Specsavers - Hectors Way Newbury,,OPT,,Sainsbury's Hectors Way,,Newbury,Berkshire,RG14 5AB,Tel: 01635 881 657, - ,,,N/A - Data not available,,,
Scott Waters Opticians,OP_5DK_5322__000002_RG141AA,OPT,,98 Northbrook Street,,Newbury,Berkshire,RG14 1AA,Tel: 01635 31113, - ,,,No ratings yet Rate it yourself - /Services/opticians/LeaveReview/DefaultView.aspx?id=OP_5DK_5322__000002_RG141AA,0,0,
Vision Express,OP_5DK_3370__000001_RG141AA,OPT,92 Northbrook Street,,Newbury,,,RG14 1AA,Tel: 01635 230294, - ,,,No ratings yet Rate it yourself - /Services/opticians/LeaveReview/DefaultView.aspx?id=OP_5DK_3370__000001_RG141AA,0,0,
West Country Eyecare,OL/5FT__000004_SP101NG,OPT,76 High Street,,andover,Hants,,SP10 1NG,Tel: 01264 366165, - ,,,No ratings yet Rate it yourself - /Services/opticians/LeaveReview/DefaultView.aspx?id=OL/5FT__000004_SP101NG,0,0,
Specsavers,OP_5E9_5988__000001_SP101NG,OPT,,72 High Street,,Andover,Hampshire,SP10 1NG,Tel: 01264 339 369, - ,,,2 ratings Rate it yourself - /Services/opticians/LeaveReview/DefaultView.aspx?id=OP_5E9_5988__000001_SP101NG,,,
Boots-Newbury - Northbrook St (in Boots UK),OP_RG141DJ_85768,OPT,4-5 Northbrook Street,,,Newbury,Berkshire,RG14 1DJ,Tel: 01635 40397, - ,,,2 ratings Rate it yourself - /Services/opticians/LeaveReview/DefaultView.aspx?id=OP_RG141DJ_85768,,,
Boots-Andover - High St,OP_5E9_6071__000001_SP101LP,OPT,63 High Street,,,Andover,Hampshire,SP10 1LP,Tel: 01264 352887, - ,,,2 ratings Rate it yourself - /Services/opticians/LeaveReview/DefaultView.aspx?id=OP_5E9_6071__000001_SP101LP,,,
Leightons Opticians & Hearing Care,OP_5E9_433__000001_SP101RW,OPT,,68 The Chantry Centre,,Andover,Hampshire,SP10 1RW,Tel: 01264 365695, - ,,,No ratings yet Rate it yourself - /Services/opticians/LeaveReview/DefaultView.aspx?id=OP_5E9_433__000001_SP101RW,0,0,
Ottica UK Ltd,OP_RG141AY_85774,OPT,,38 Parkway,,Newbury,,RG14 1AY,, - ,,,No ratings yet Rate it yourself - /Services/opticians/LeaveReview/DefaultView.aspx?id=OP_RG141AY_85774,0,0,
Specsavers Opticians,OP_5DK_1746__000001_RG141DT,OPT,42-42a Northbrook Street,Newbury,Berkshire,,,RG14 1DT,Tel: 01635 46105, - ,,,No ratings yet Rate it yourself - /Services/opticians/LeaveReview/DefaultView.aspx?id=OP_5DK_1746__000001_RG141DT,0,0,
Carol Underwood,PCTCAROLUNDERWOOD1__000001_SP103DG,OPT,King George Road,,andover,Hants,,SP10 3DG,Tel: 0845 602 3842, - ,,,No ratings yet Rate it yourself - /Services/opticians/LeaveReview/DefaultView.aspx?id=PCTCAROLUNDERWOOD1__000001_SP103DG,0,0,
Vision Express,OP_5E9_1549__000001_SP101LU,OPT,45 Chantry Way,The Chantry Centre,andover,Hampshire,,SP10 1LQ,Tel: 01264 324801, - ,,,No ratings yet Rate it yourself - /Services/opticians/LeaveReview/DefaultView.aspx?id=OP_5E9_1549__000001_SP101LU,0,0,
Leightons Opticians & Hearing Care,OP_5DK_3647__000001_RG193JD,OPT,,12 Kingsland Centre,,Thatcham,Berkshire,RG19 3HN,Tel: 01635 863290, - ,,,1 rating Rate it yourself - /Services/opticians/LeaveReview/DefaultView.aspx?id=OP_5DK_3647__000001_RG193JD,,,
Buyspecs Direct,TP0ML,OPT,,"Unit 9, Pipers Court",Berkshire Drive,Thatcham,Berkshire,RG19 4ER,Tel: 01635 293578, - ,,,No ratings yet Rate it yourself - /Services/opticians/LeaveReview/DefaultView.aspx?id=TP0ML,0,0,
Memory Opticians,OP_5K4_619__000001_SP97NN,OPT,Station Road,,Tidworth,,,SP9 7NN,Tel: 01980 843440, - ,,,No ratings yet Rate it yourself - /Services/opticians/LeaveReview/DefaultView.aspx?id=OP_5K4_619__000001_SP97NN,0,0,
Leightons Opticians & Hearing Care,OP_5DF_7434__000001_RG264HN,OPT,,Dental Surgery,Newchurch Road,Tadley,Hampshire,RG26 4HN,Tel: 0118 981 2250, - ,,,No ratings yet Rate it yourself - /Services/opticians/LeaveReview/DefaultView.aspx?id=OP_5DF_7434__000001_RG264HN,0,0,
Optimum Vision Clinic,01-26429,OPT,,"The Falcon Garage, Burghfield Road",,Tadley,Hampshire,RG26 4QY,Tel: 0118 9810267, - ,,,161 ratings Rate it yourself - /Services/opticians/LeaveReview/DefaultView.aspx?id=01-26429,,,yes
S J Hussey Opticians,OP_5K4_12376__000002_SN95AQ,OPT,2 Old Ford Court,,Pewsey,Wiltshire,,SN9 5AQ,Tel: 01672 564617, - ,,,No ratings yet Rate it yourself - /Services/opticians/LeaveReview/DefaultView.aspx?id=OP_5K4_12376__000002_SN95AQ,0,0,
Haine & Smith Opticians,OP_5K4_11275__000002_SN81LT,OPT,,23-24  High Street,,Marlborough,Wiltshire,SN8 1LW,Tel: 01672 513432, - ,,,No ratings yet Rate it yourself - /Services/opticians/LeaveReview/DefaultView.aspx?id=OP_5K4_11275__000002_SN81LT,0,0,
Specavers Opticians,SN8 1HN,OPT,,131 High Street,,Marlborough,,SN8 1HN,Tel: 01672 517900, - ,,,No ratings yet Rate it yourself - /Services/opticians/LeaveReview/DefaultView.aspx?id=SN8 1HN,0,0,
Jacqueline Burns Opticians,OP_SN81HN_33975,OPT,,140 High Street,,Marlborough,,SN8 1HN,, - ,,,2 ratings Rate it yourself - /Services/opticians/LeaveReview/DefaultView.aspx?id=OP_SN81HN_33975,,,
Boots-Basingstoke - Old Basing Mall,OP_5DF_6102__000002_RG217LW,OPT,15 Old Basing Mall,,,Basingstoke,Hampshire,RG21 7LW,Tel: 01256 364943, - ,,,1 rating Rate it yourself - /Services/opticians/LeaveReview/DefaultView.aspx?id=OP_5DF_6102__000002_RG217LW,,,
Prime Opticians,F6T5F,OPT,,"Unit 3a, Old Basing Mall",,Basingstoke,Hampshire,RG21 7AW,Tel: 01256 278 278, - ,,,No ratings yet Rate it yourself - /Services/opticians/LeaveReview/DefaultView.aspx?id=F6T5F,0,0,
Vision Express,OP_5DF_12805__000001_RG217LD,OPT,"Unit 4, Chiswick House","Unit 4, Chiswick House",,Basingstoke,,RG21 7LD,Tel: 01256 814824, - ,,,No ratings yet Rate it yourself - /Services/opticians/LeaveReview/DefaultView.aspx?id=OP_5DF_12805__000001_RG217LD,0,0,
Specsavers,OP_5DF_1542__000001_RG217JR,OPT,5 Chiswick House,Festival Place,,Basingstoke,,RG21 7LD,Tel: 01256 479429, - ,,,98 ratings Rate it yourself - /Services/opticians/LeaveReview/DefaultView.aspx?id=OP_5DF_1542__000001_RG217JR,,,
David Clulow Opticians,OP_5DF_8373__000001_RG217JY,OPT,25 Mayfair House,25 Mayfair House,,Basingstoke,Hampshire,RG21 7JY,Tel: 01256 332113, - ,,,No ratings yet Rate it yourself - /Services/opticians/LeaveReview/DefaultView.aspx?id=OP_5DF_8373__000001_RG217JY,0,0,
Batemans Opticians,OP_5DF_270__000001_RG217LN,OPT,13 Kensington House,Festival Centre,,Basingstoke,Hampshire,RG21 7LN,Tel: 01256 321327, - ,,,No ratings yet Rate it yourself - /Services/opticians/LeaveReview/DefaultView.aspx?id=OP_5DF_270__000001_RG217LN,0,0,
Leightons Opticians & Hearing Care,OP_5DF_9286__000001_RG217DE,OPT,,9-11 Church Street,,Basingstoke,Hampshire,RG21 7QG,Tel: 01256 321068, - ,,,No ratings yet Rate it yourself - /Services/opticians/LeaveReview/DefaultView.aspx?id=OP_5DF_9286__000001_RG217DE,0,0,
Buyspecs Direct,OPT_RG211NX_1,OPT,,"Yard House, May Place",,Basingstoke,,RG21 1NX,, - ,,,No ratings yet Rate it yourself - /Services/opticians/LeaveReview/DefaultView.aspx?id=OPT_RG211NX_1,0,0,
Chineham Centre Opticians,OP_5DF_11440__000002_RG248BQ,OPT,17 Chineham Shopping Centre,Chineham,,Basingstoke,,RG24 8BQ,Tel: 01256 327564, - ,,,1 rating Rate it yourself - /Services/opticians/LeaveReview/DefaultView.aspx?id=OP_5DF_11440__000002_RG248BQ,,,
Tesco Opticians,654321__000001_RG248BE,OPT,District Shopping Centre,Chineham,,Basingstoke,,RG24 8BE,Tel: 0345 601 3479, - ,,,1 rating Rate it yourself - /Services/opticians/LeaveReview/DefaultView.aspx?id=654321__000001_RG248BE,,,
Haine & Smith Opticians,SP4 7HD,OPT,,20 Salisbury Street,,Amesbury,Wiltshire,SP4 7HD,Tel: 01980 626551, - ,,,No ratings yet Rate it yourself - /Services/opticians/LeaveReview/DefaultView.aspx?id=SP4 7HD,0,0,
Memory Opticians,OP_5DJ_14124__000005_SP47HD,OPT,44b Salisbury Street,,Amesbury,,,SP4 7HD,Tel: 01980 624065, - ,,,1 rating Rate it yourself - /Services/opticians/LeaveReview/DefaultView.aspx?id=OP_5DJ_14124__000005_SP47HD,,,
Batemans (Opticians) Ltd,OP_5DJ_10456__000004_SP47HD,OPT,12 Salisbury Street,,,Amesbury,Wiltshire,SP4 7HD,Tel: 01980 623228, - ,,,No ratings yet Rate it yourself - /Services/opticians/LeaveReview/DefaultView.aspx?id=OP_5DJ_10456__000004_SP47HD,0,0,
Tesco Opticians,OP_SO237RS_29727,OPT,,Easton Lane,,Winchester,Hampshire,SO23 7RS,Tel: 0845 601 3479, - ,,,No ratings yet Rate it yourself - /Services/opticians/LeaveReview/DefaultView.aspx?id=OP_SO237RS_29727,0,0,
Rawlings Opticians,OP_5E9_615__000003_SO239BX,OPT,60-61 High Street,,Winchester,Hampshire,,SO23 9BX,Tel: 01962 853082, - ,,,1 rating Rate it yourself - /Services/opticians/LeaveReview/DefaultView.aspx?id=OP_5E9_615__000003_SO239BX,,,
Eyesite Opticians,OP_5E9_12451__000001_SO239BX,OPT,Southgate Corner,65 High Street,,Winchester,Hampshire,SO23 9BX,Tel: 01962 864446, - ,,,No ratings yet Rate it yourself - /Services/opticians/LeaveReview/DefaultView.aspx?id=OP_5E9_12451__000001_SO239BX,0,0,
Specsavers Opticians,OPT_SO239AH_1,OPT,,106a High Street,,Winchester,,SO23 9AH,, - ,,,No ratings yet Rate it yourself - /Services/opticians/LeaveReview/DefaultView.aspx?id=OPT_SO239AH_1,0,0,
Leightons Opticians & Hearing Care,OP_5E9_158__000001_SO238AH,OPT,,67 St. Georges Street,,Winchester,Hampshire,SO23 8AH,Tel: 01962 852961, - ,,,No ratings yet Rate it yourself - /Services/opticians/LeaveReview/DefaultView.aspx?id=OP_5E9_158__000001_SO238AH,0,0,
Specsavers Opticians,TP9F3,OPT,Sainsbury's,Bath Road,Calcot,Reading,Berkshire,RG31 7SA,Tel: 0118 956 9770, - ,,,No ratings yet Rate it yourself - /Services/opticians/LeaveReview/DefaultView.aspx?id=TP9F3,0,0,
Specsavers,OP_5E9_643__000001_SO238AF,OPT,The Brooks Centre,,Winchester,Hampshire,,SO23 8QY,Tel: 01962 844833, - ,,,1 rating Rate it yourself - /Services/opticians/LeaveReview/DefaultView.aspx?id=OP_5E9_643__000001_SO238AF,,,
Vision Express,OP_5E9_2258__000002_SO239BL,OPT,,40 High Street,,Winchester,Hampshire,SO23 9BL,Tel: 01962 856850, - ,,,No ratings yet Rate it yourself - /Services/opticians/LeaveReview/DefaultView.aspx?id=OP_5E9_2258__000002_SO239BL,0,0,
Boots-Winchester - High St,OP_5E9_1446__000001_SO239AY,OPT,144 High Street,,Winchester,Winchester,Hampshire,SO23 9AY,Tel: 01962 854553, - ,,,No ratings yet Rate it yourself - /Services/opticians/LeaveReview/DefaultView.aspx?id=OP_5E9_1446__000001_SO239AY,0,0,
M J Anthony,OP_5K4_12375__000001_SN68PX,OPT,Foxwood House,West End,Bishopstone,,,SN6 8PX,Tel: 01793 791352, - ,,,No ratings yet Rate it yourself - /Services/opticians/LeaveReview/DefaultView.aspx?id=OP_5K4_12375__000001_SN68PX,0,0,
Campbells Opticians,OP_5DY_2985__000002_OX128BU,OPT,,34 Market Place,,Wantage,Oxfordshire,OX12 8AH,Tel: 01235 763312, - ,,,No ratings yet Rate it yourself - /Services/opticians/LeaveReview/DefaultView.aspx?id=OP_5DY_2985__000002_OX128BU,0,0,
Specsavers Opticians,TP2HJ,OPT,,1A Grove Street,,Wantage,Oxfordshire,OX12 7AB,Tel: 01235 773980, - ,,,No ratings yet Rate it yourself - /Services/opticians/LeaveReview/DefaultView.aspx?id=TP2HJ,0,0,
Boots-Wantage,BOOTSOPTICIANSWANTAGE1,OPT,Unit 3A Kings Walk,,,Wantage,Oxfordshire,OX12 9AJ,Tel: 01235 768177, - ,,,No ratings yet Rate it yourself - /Services/opticians/LeaveReview/DefaultView.aspx?id=BOOTSOPTICIANSWANTAGE1,0,0,
Vision Express (UK) Ltd,OP_5DL_2989__000001_RG87LR,OPT,,12 Whitchurch Road,Reading,Pangbourne,Berkshire,RG8 7BP,Tel: 0118 984 2428, - ,,,No ratings yet Rate it yourself - /Services/opticians/LeaveReview/DefaultView.aspx?id=OP_5DL_2989__000001_RG87LR,0,0,
Rawlings Opticians,OP_5E9_6187__000001_SO249AT,OPT,Bay Tree House,26 West Street,Alresford,Hampshire,,SO24 9AT,Tel: 01962 733269, - ,,,2 ratings Rate it yourself - /Services/opticians/LeaveReview/DefaultView.aspx?id=OP_5E9_6187__000001_SO249AT,,,
Matheson Optometrists,OP_5E9_572__000001_SO249AG,OPT,1-3 West Street,,,Alresford,,SO24 9AG,Tel: 01962 732336, - ,,,2 ratings Rate it yourself - /Services/opticians/LeaveReview/DefaultView.aspx?id=OP_5E9_572__000001_SO249AG,,,
Scrivens Opticians,OP_5DL_10795__000002_RG315AR,OPT,11 School Road,Tilehurst,Reading,Berkshire,,RG31 5AR,Tel: 0118 9412911, - ,,,1 rating Rate it yourself - /Services/opticians/LeaveReview/DefaultView.aspx?id=OP_5DL_10795__000002_RG315AR,,,
Bourneside Optometry Limited - Mrs S Downie,OPT_SP46HL_1,OPT,,Bourneside House,,Salisbury,,SP4 6HL,Tel: 01980 611433, - ,,,No ratings yet Rate it yourself - /Services/opticians/LeaveReview/DefaultView.aspx?id=OPT_SP46HL_1,0,0,
Brown & White (Opticians) Ltd,OP_5G6_7713__000001_RG279DJ,OPT,Bourne House,London Road,,Hook,Hampshire,RG27 9DJ,Tel: 01256 763016, - ,,,No ratings yet Rate it yourself - /Services/opticians/LeaveReview/DefaultView.aspx?id=OP_5G6_7713__000001_RG279DJ,0,0,
Haine & Smith Opticians,OP_5K3_2478__000002_SN49LN,OPT,8 Ellendune,Wroughton,,Wiltshire,,SN4 9LN,Tel: 01793 813054, - ,,,No ratings yet Rate it yourself - /Services/opticians/LeaveReview/DefaultView.aspx?id=OP_5K3_2478__000002_SN49LN,0,0,
Costco,OP_RG26UE_85770,OPT,,"100 South Oak Way, Green Park",,Reading,,RG2 6UE,, - ,,,No ratings yet Rate it yourself - /Services/opticians/LeaveReview/DefaultView.aspx?id=OP_RG26UE_85770,0,0,
Vision Visit,SN3 1JU,OPT,,51 Windsor Road,,Swindon,,SN3 1JU,Tel: 01793 232588, - ,,,No ratings yet Rate it yourself - /Services/opticians/LeaveReview/DefaultView.aspx?id=SN3 1JU,0,0,
Vision Express,OP_RG301AH_85777,OPT,,"Tesco Express, Portman Road",,Reading,,RG30 1AH,, - ,,,No ratings yet Rate it yourself - /Services/opticians/LeaveReview/DefaultView.aspx?id=OP_RG301AH_85777,0,0,
Scrivens,OP_5DY_11103__000001_OX118RN,OPT,,182 The Broadway,,Didcot,Oxfordshire,OX11 8RN,Tel: 01235 813305, - ,,,No ratings yet Rate it yourself - /Services/opticians/LeaveReview/DefaultView.aspx?id=OP_5DY_11103__000001_OX118RN,0,0,
The Outside Clinic,OP_5CC_14872__000024_SN14AN,OPT,Old Town Court,10-14 High Street,Old Town,Swindon,Wiltshire,SN1 3EP,Tel: 0800 60 50 40, - ,,,243 ratings Rate it yourself - /Services/opticians/LeaveReview/DefaultView.aspx?id=OP_5CC_14872__000024_SN14AN,,,
The Outside Clinic,OP_5CK_14996__000007_SN14AN,OPT,7 Wood Street,Old Town,Swindon,,,SN1 4AN,Tel: 0800 85 44 77, - ,,,3 ratings Rate it yourself - /Services/opticians/LeaveReview/DefaultView.aspx?id=OP_5CK_14996__000007_SN14AN,,,
Leightons Opticians & Hearing Care,OP_5K3_4081__000004_SN14AN,OPT,,33 Wood Street,,Swindon,Wiltshire,SN1 4AN,Tel: 01793 522 586, - ,,,No ratings yet Rate it yourself - /Services/opticians/LeaveReview/DefaultView.aspx?id=OP_5K3_4081__000004_SN14AN,0,0,
Specsavers,SPECSAVERSDIDCOT1,OPT,,17 Orchard Street,,Didcot,,OX11 7LG,Tel: 01235 517100, - ,,,No ratings yet Rate it yourself - /Services/opticians/LeaveReview/DefaultView.aspx?id=SPECSAVERSDIDCOT1,0,0,
Boots-Didcot,OP_5DY_11588__000001_OX118RJ,OPT,,48 Orchard Street,,Didcot,Oxfordshire,OX11 7LG,Tel: 01235 812241, - ,,,No ratings yet Rate it yourself - /Services/opticians/LeaveReview/DefaultView.aspx?id=OP_5DY_11588__000001_OX118RJ,0,0,
The Opticians,OP_5G6_9543__000001_RG291LA,OPT,,113a High Street,,Odiham,Hampshire,RG29 1LA,Tel: 01256 703707, - ,,,No ratings yet Rate it yourself - /Services/opticians/LeaveReview/DefaultView.aspx?id=OP_5G6_9543__000001_RG291LA,0,0,
Watchfield Opticians,TP44Y,OPT,,2 Majors Road,,Swindon,,SN6 8TQ,, - ,,,2 ratings Rate it yourself - /Services/opticians/LeaveReview/DefaultView.aspx?id=TP44Y,,,
Matheson Optometrists,OP_5DF_14849__000001_GU345HG,OPT,47 Winchester Road,Four Marks,Alton,,,GU34 5HG,Tel: 01420 560082, - ,,,No ratings yet Rate it yourself - /Services/opticians/LeaveReview/DefaultView.aspx?id=OP_5DF_14849__000001_GU345HG,0,0,
Specsavers Opticians,OP_RG12AA_85781,OPT,,45 Broad Street,,Reading,,RG1 2AA,, - ,,,No ratings yet Rate it yourself - /Services/opticians/LeaveReview/DefaultView.aspx?id=OP_RG12AA_85781,0,0,
Specsavers Opticians,OP_5K3_12126__000001_SN11SD,OPT,62/63 Regent Street,,Swindon,,,SN1 1JS,Tel: 01793 617858, - ,,,No ratings yet Rate it yourself - /Services/opticians/LeaveReview/DefaultView.aspx?id=OP_5K3_12126__000001_SN11SD,0,0,
Haine & Smith Opticians,OP_5K3_2612__000003_SN11JS,OPT,,45c Regent Street,Swindon,Wiltshire,,SN1 1JS,Tel: 01793 487888, - ,,,1 rating Rate it yourself - /Services/opticians/LeaveReview/DefaultView.aspx?id=OP_5K3_2612__000003_SN11JS,,,
D & R Kirk Opticians,OP_RG20EG_85771,OPT,D & R Kirk Opticians,47 Whitley Street,,READING,Berkshire,RG2 0EG,Tel: 0118 9871020, - ,,,4 ratings Rate it yourself - /Services/opticians/LeaveReview/DefaultView.aspx?id=OP_RG20EG_85771,,,
Vision Express (UK) Ltd,OP_5DL_2333__000003_RG12AH,OPT,"5a, Town Mall Walk, Upper Ground Level",The Oracle Centre,Reading,,,RG1 2AH,Tel: 0118 950 4504, - ,,,No ratings yet Rate it yourself - /Services/opticians/LeaveReview/DefaultView.aspx?id=OP_5DL_2333__000003_RG12AH,0,0,
Boots-Reading - Oracle Centre (in Boots UK),OP_5DL_1822__000002_RG12AH,OPT,Unit 5 Upper Ground Level,The Oracle Centre,,Reading,Berkshire,RG1 2AH,Tel: 0118 958 9783, - ,,,5 ratings Rate it yourself - /Services/opticians/LeaveReview/DefaultView.aspx?id=OP_5DL_1822__000002_RG12AH,,,
Eyesite Opticians,OP_5DL_297__000001_RG11EP,OPT,142 Friar Street,,,Reading,Berkshire,RG1 1EX,Tel: 0118 950 9098, - ,,,1 rating Rate it yourself - /Services/opticians/LeaveReview/DefaultView.aspx?id=OP_5DL_297__000001_RG11EP,,,
G D Monk,OP_5K3_14301__000004_SN11SD,OPT,35 Havelock Street,,Swindon,Wiltshire,,SN1 1SD,Tel: 01793 523743, - ,,,No ratings yet Rate it yourself - /Services/opticians/LeaveReview/DefaultView.aspx?id=OP_5K3_14301__000004_SN11SD,0,0,
Leightons Opticians & Hearing Care,OP_5DL_8141__000001_RG17UJ,OPT,,12-14 Queen Victoria Street,,Reading,Berkshire,RG1 1TG,Tel: 0118 959 0055, - ,,,No ratings yet Rate it yourself - /Services/opticians/LeaveReview/DefaultView.aspx?id=OP_5DL_8141__000001_RG17UJ,0,0,
Vision Express (UK) Ltd,OP_5K3_11424__000001_SN11JY,OPT,83 Regent Street,,Swindon,,,SN1 1JY,Tel: 01793 491194, - ,,,No ratings yet Rate it yourself - /Services/opticians/LeaveReview/DefaultView.aspx?id=OP_5K3_11424__000001_SN11JY,0,0,
Boots-Swindon - Brunel Plaza (in Boots UK),OP_5K3_11563__000002_SN11LF,OPT,3 Brunel Plaza,,,Swindon,Wiltshire,SN1 1LF,Tel: 01793 433060, - ,,,6 ratings Rate it yourself - /Services/opticians/LeaveReview/DefaultView.aspx?id=OP_5K3_11563__000002_SN11LF,,,
The White Horse Optical Practice,OP_5K3_5315__000006_SN11LF,OPT,,7 Brunel Plaza,,Swindon,,SN1 1LF,Tel: 01793 432751, - ,,,No ratings yet Rate it yourself - /Services/opticians/LeaveReview/DefaultView.aspx?id=OP_5K3_5315__000006_SN11LF,0,0,
Tesco Opticians,TP41K,OPT,,Ocotal Way,,Swindon,,SN1 2EH,, - ,,,No ratings yet Rate it yourself - /Services/opticians/LeaveReview/DefaultView.aspx?id=TP41K,0,0,
Opticial Express,OP_12345_RG1 4BP,OPT,"Lower Ground, Havell House",62-66 Queens Road,,Reading,Berkshire,RG1 4BP,Tel: 0800 023 2020, - ,,,No ratings yet Rate it yourself - /Services/opticians/LeaveReview/DefaultView.aspx?id=OP_12345_RG1 4BP,0,0,
Optical Express,,OPT,,Havell House,,Reading,,RG1 4BP,, - ,,,N/A - Data not available,,,
Robin James Opticians Ltd,OP_5DL_844__000002_RG48AU,OPT,44 Church Street,Caversham,Reading,,,RG4 8AU,Tel: 0118 947 2099, - ,,,No ratings yet Rate it yourself - /Services/opticians/LeaveReview/DefaultView.aspx?id=OP_5DL_844__000002_RG48AU,0,0,
Optical Express,SN1 1DA_83473,OPT,,"1st Floor (suite 4), Minton Place, Station Road",,Swindon,,SN1 1DA,Tel: 08000232020, - ,,,No ratings yet Rate it yourself - /Services/opticians/LeaveReview/DefaultView.aspx?id=SN1 1DA_83473,0,0,
Specsavers Opticians,OP_RG28HA_85773,OPT,,"203 - 205 Shinfield Road,",,"Earley, Reading",,RG2 8HA,, - ,,,No ratings yet Rate it yourself - /Services/opticians/LeaveReview/DefaultView.aspx?id=OP_RG28HA_85773,0,0,
Ashleigh Sight Care,OP_5LY_14850__000001_SO518BU,OPT,,8 Church Street,,Romsey,Hampshire,SO51 8BU,Tel: 01794 512480, - ,,,1 rating Rate it yourself - /Services/opticians/LeaveReview/DefaultView.aspx?id=OP_5LY_14850__000001_SO518BU,,,
Haine & Smith Opticians,OP_5K3_1303__000002_SN26AN,OPT,,105 Cricklade Road,,Swindon,Wiltshire,SN2 1AB,Tel: 01793 522572, - ,,,No ratings yet Rate it yourself - /Services/opticians/LeaveReview/DefaultView.aspx?id=OP_5K3_1303__000002_SN26AN,0,0,
Romsey Eyecare,OPT_SO51 8DE,OPT,,"1 Victoria Place, Love Lane",,Romsey,Hampshire,SO51 8DE,Tel: 01794 522747, - ,,,3 ratings Rate it yourself - /Services/opticians/LeaveReview/DefaultView.aspx?id=OPT_SO51 8DE,,,
D N White Opticians,OP_5LY_14855__000001_SO518NA,OPT,23 Market Place,,Romsey,Hampshire,,SO51 8NA,Tel: 01794 517311, - ,,,No ratings yet Rate it yourself - /Services/opticians/LeaveReview/DefaultView.aspx?id=OP_5LY_14855__000001_SO518NA,0,0,
Mark Freeman Opticians,SO51 8NB__000003_SO518NB,OPT,3 Market Place,,Romsey,Hants,,SO51 8NB,Tel: 01794 513953, - ,,,No ratings yet Rate it yourself - /Services/opticians/LeaveReview/DefaultView.aspx?id=SO51 8NB__000003_SO518NB,0,0,
Boots Opticians,G7K1V,OPT,,3-5 The Hundred,,Romsey,Hampshire,SO51 8GD,Tel: 01794 513258, - ,,,No ratings yet Rate it yourself - /Services/opticians/LeaveReview/DefaultView.aspx?id=G7K1V,0,0,
Rawlings Opticians,OP_5LY_14074__000001_SO533DB,OPT,,"14 Fryern Arcade, Winchester Road",Chandlers Ford,Chandlers Ford,,SO53 2DQ,Tel: 023 8025 2428, - ,,,No ratings yet Rate it yourself - /Services/opticians/LeaveReview/DefaultView.aspx?id=OP_5LY_14074__000001_SO533DB,0,0,
Leightons Opticians & Hearing Care,OP_5LY_14073__000001_SO532QD,OPT,,"4-5 The Mall, Winchester Road",Chandlers Ford,Southampton,Hampshire,SO53 2QD,Tel: 02380 266 181, - ,,,No ratings yet Rate it yourself - /Services/opticians/LeaveReview/DefaultView.aspx?id=OP_5LY_14073__000001_SO532QD,0,0,
Boots-Salisbury - Catherine St,OP_5DJ_10591__000001_SP12DF,OPT,17 Catherine Street,,,Salisbury,Wiltshire,SP1 2DF,Tel: 01722 322 522, - ,,,No ratings yet Rate it yourself - /Services/opticians/LeaveReview/DefaultView.aspx?id=OP_5DJ_10591__000001_SP12DF,0,0,
Memory Opticians,OP_5DJ_8550__000002_SP12DF,OPT,13 Catherine Street,,Salisbury,,,SP1 2DF,Tel: 01722 410959, - ,,,No ratings yet Rate it yourself - /Services/opticians/LeaveReview/DefaultView.aspx?id=OP_5DJ_8550__000002_SP12DF,0,0,
Specsavers Opticians,OP_5DJ_9766__000001_SP12DG,OPT,1 Catherine Street,,Salisbury,,,SP1 2DF,Tel: 01722 412255, - ,,,No ratings yet Rate it yourself - /Services/opticians/LeaveReview/DefaultView.aspx?id=OP_5DJ_9766__000001_SP12DG,0,0,
Vision Express,OP_RG18DF_85776,OPT,,"Tesco Express, Napier Road",,Reading,,RG1 8DF,, - ,,,No ratings yet Rate it yourself - /Services/opticians/LeaveReview/DefaultView.aspx?id=OP_RG18DF_85776,0,0,
Vision Express (UK) Ltd,OP_5DJ_1147__000002_SP11EP,OPT,25-27 Butcher Row,,Salisbury,,,SP1 1EP,Tel: 01722 330056, - ,,,No ratings yet Rate it yourself - /Services/opticians/LeaveReview/DefaultView.aspx?id=OP_5DJ_1147__000002_SP11EP,0,0,
ASDA Stores Ltd,OP_RG65TT_85766,OPT,,Lower Earley District Centre,,READING,,RG6 5TT,Tel: 01189 870 320, - ,,,No ratings yet Rate it yourself - /Services/opticians/LeaveReview/DefaultView.aspx?id=OP_RG65TT_85766,0,0,
Silverthornes Opticians,OP_5DJ_14126__000001_SP12DD,OPT,50 Catherine Street,,Salisbury,Wiltshire,,SP1 2DD,Tel: 01722 322880, - ,,,No ratings yet Rate it yourself - /Services/opticians/LeaveReview/DefaultView.aspx?id=OP_5DJ_14126__000001_SP12DD,0,0,