Organisation Name,NACS Code,Organisation Type,Address1,Address2,Address3,Address4,Address5,PostCode,Telephone Number,Opening time,Value  (Opening time),Banding Classification  (Opening time),NHS.UK users rating,Value  (NHS.UK users rating),Banding Classification  (NHS.UK users rating),Car parking (Is there car parking at this organisation?)
Rogers Optical (trading as Boots Opticians),01-26179,OPT,,66 High Street,,Somerset,,BA5 2AJ,, - ,,,1 rating Rate it yourself - /Services/opticians/LeaveReview/DefaultView.aspx?id=01-26179,,,
David & Sandra Millican Opticians,OP_5FX_8575__000001_BA52AQ,OPT,75 High Street,Wells,Somerset,,,BA5 2AQ,Tel: 01749 673991, - ,,,No ratings yet Rate it yourself - /Services/opticians/LeaveReview/DefaultView.aspx?id=OP_5FX_8575__000001_BA52AQ,0,0,
R A Mansfield Opticians,OP_5FX_4104__000001_BA52AG,OPT,65 High Street,Wells,Somerset,,,BA5 2AG,Tel: 01749 672229, - ,,,No ratings yet Rate it yourself - /Services/opticians/LeaveReview/DefaultView.aspx?id=OP_5FX_4104__000001_BA52AG,0,0,
Specsavers,OP_5FX_9046__000001_BA52SN,OPT,60a High Street,Wells,Somerset,,,BA5 2SN,Tel: 01749 673 694, - ,,,1 rating Rate it yourself - /Services/opticians/LeaveReview/DefaultView.aspx?id=OP_5FX_9046__000001_BA52SN,,,
Vision Express (UK) Ltd,OPL 1405QL__000001_BA52AE,OPT,43 High Street,,,Wells,,BA5 2AE,Tel: 01749 674111, - ,,,No ratings yet Rate it yourself - /Services/opticians/LeaveReview/DefaultView.aspx?id=OPL 1405QL__000001_BA52AE,0,0,
N K Opticians,CO - 3455__000002_BS273NA,OPT,Myrtle House,Bath Street,Cheddar,Somerset,,BS27 3AA,Tel: 01934 743723, - ,,,1 rating Rate it yourself - /Services/opticians/LeaveReview/DefaultView.aspx?id=CO - 3455__000002_BS273NA,,,
Robert Frith Optometrists ,OP_5FX_6962__000002_BA69DZ,OPT,74 High Street,Glastonbury,Somerset,,,BA6 9DZ,Tel: 01458 832212, - ,,,No ratings yet Rate it yourself - /Services/opticians/LeaveReview/DefaultView.aspx?id=OP_5FX_6962__000002_BA69DZ,0,0,
Eye Tech Opticians,OP_5FX_11123__000001_BA160EG,OPT,100 High Street,Street,,Somerset,,BA16 0EG,Tel: 01458 442178, - ,,,No ratings yet Rate it yourself - /Services/opticians/LeaveReview/DefaultView.aspx?id=OP_5FX_11123__000001_BA160EG,0,0,
Christopher Young Optometrists,OP_5FX_2045__000001_BA45AS,OPT,46 High Street,Shepton Mallet,Somerset,,,BA4 5AS,Tel: 01749 345259, - ,,,1 rating Rate it yourself - /Services/opticians/LeaveReview/DefaultView.aspx?id=OP_5FX_2045__000001_BA45AS,,,
Specsavers Opticians,OP_5QL_999__000002_BA160EZ,OPT,93 High Street,,,Street,,BA16 0EZ,Tel: 01458 449400, - ,,,No ratings yet Rate it yourself - /Services/opticians/LeaveReview/DefaultView.aspx?id=OP_5QL_999__000002_BA160EZ,0,0,
Boots-Street,OP_5FX_14659__000001_BA160EX,OPT,141A High Street,,,Street,Somerset,BA16 0EX,Tel: 01458 442434, - ,,,No ratings yet Rate it yourself - /Services/opticians/LeaveReview/DefaultView.aspx?id=OP_5FX_14659__000001_BA160EX,0,0,
Brock & Houlford,TP7M0,OPT,Westway Farm,Wick Road,Bishop Sutton,Bristol,,BS39 5XP,Tel: 01275 332882, - ,,,No ratings yet Rate it yourself - /Services/opticians/LeaveReview/DefaultView.aspx?id=TP7M0,0,0,
Orriss & Low,OP_5M8_6588__000001_BS251AQ,OPT,2-4 Corner House,Corner House,Woodborough Road,Winscombe,Somerset,BS25 1AQ,Tel: 01934 843713, - ,,,No ratings yet Rate it yourself - /Services/opticians/LeaveReview/DefaultView.aspx?id=OP_5M8_6588__000001_BS251AQ,0,0,yes
Marian Donovan Optometrist,OP_5M8_14820__000001_BS405LD,OPT,Broad Street,,Wrington,North Somerset,,BS40 5LD,Tel: 01934 862933, - ,,,No ratings yet Rate it yourself - /Services/opticians/LeaveReview/DefaultView.aspx?id=OP_5M8_14820__000001_BS405LD,0,0,yes
Brock & Houlford,OP_5FL_10314__000001_BS408PR,OPT,33 High Street,Chew Magna,Bristol,,,BS40 8PR,Tel: 01275 332882, - ,,,No ratings yet Rate it yourself - /Services/opticians/LeaveReview/DefaultView.aspx?id=OP_5FL_10314__000001_BS408PR,0,0,
Eye Tech Opticians,OP_5FL_8611__000001_BA32HQ,OPT,6 The Island,Midsomer Norton,Bath,,,BA3 2HQ,Tel: 01761 414136, - ,,,No ratings yet Rate it yourself - /Services/opticians/LeaveReview/DefaultView.aspx?id=OP_5FL_8611__000001_BA32HQ,0,0,
Edwards Opticians Ltd,OP_5FL_14818__000001_BA32HW,OPT,2 Mansbrook House,15 High Street,,Midsomer Norton,,BA3 2HW,Tel: 01761 413212, - ,,,No ratings yet Rate it yourself - /Services/opticians/LeaveReview/DefaultView.aspx?id=OP_5FL_14818__000001_BA32HW,0,0,
Scrivens Opticians ,OP_5FL_575__000001_BA32DW,OPT,,26 High Street,Bath,Midsomer Norton,,BA3 2DW,Tel: 01761 414774, - ,,,No ratings yet Rate it yourself - /Services/opticians/LeaveReview/DefaultView.aspx?id=OP_5FL_575__000001_BA32DW,0,0,
Lovat Short Optometrists,OP_5FL_14817__000002_BA33PL,OPT,2 The Street,Radstock,,Bath,,BA3 3PL,Tel: 01761 432169, - ,,,No ratings yet Rate it yourself - /Services/opticians/LeaveReview/DefaultView.aspx?id=OP_5FL_14817__000002_BA33PL,0,0,
Bell & Stenton Ltd,OP_5M8_11852__000001_BS494HJ,OPT,52 High Street,Yatton,North Somerset,,,BS49 4HJ,Tel: 01934 838818, - ,,,No ratings yet Rate it yourself - /Services/opticians/LeaveReview/DefaultView.aspx?id=OP_5M8_11852__000001_BS494HJ,0,0,
Robert Frith Optometrists,OP_5K1_1670__000002_BA77BG,OPT,Fore Street,Castle Cary,Somerset,Somerset,,BA7 7BG,Tel: 01963 351948, - ,,,No ratings yet Rate it yourself - /Services/opticians/LeaveReview/DefaultView.aspx?id=OP_5K1_1670__000002_BA77BG,0,0,
Specsavers,OP_5QL_71__000001_TA81NX,OPT,3 High Street,,Burnham On Sea,Somerset,,TA8 1NX,Tel: 01278 765460, - ,,,No ratings yet Rate it yourself - /Services/opticians/LeaveReview/DefaultView.aspx?id=OP_5QL_71__000001_TA81NX,0,0,
A H Meyrick Ltd,OP_5FW_7499__000001_TA81PA,OPT,31 High Street,Burnham-on-Sea,,Somerset,,TA8 1PA,Tel: 01278 782034, - ,,,No ratings yet Rate it yourself - /Services/opticians/LeaveReview/DefaultView.aspx?id=OP_5FW_7499__000001_TA81PA,0,0,
D J Bull,OP_5FW_13584__000002_TA81PB,OPT,41 High Street,Burnham On Sea,Somerset,,,TA8 1PB,Tel: 01278 785743, - ,,,No ratings yet Rate it yourself - /Services/opticians/LeaveReview/DefaultView.aspx?id=OP_5FW_13584__000002_TA81PB,0,0,
Stephen Bryson Opticians,OP_5M8_13183__000001_BS226JD,OPT,184a High Street,Worle,North Somerset,,,BS22 6JD,Tel: 01934 512838, - ,,,No ratings yet Rate it yourself - /Services/opticians/LeaveReview/DefaultView.aspx?id=OP_5M8_13183__000001_BS226JD,0,0,
Bowen Opticians,OP_5M8_8094__000001_BS226HQ,OPT,135 High Street,Worle,North Somerset,,,BS22 6HQ,Tel: 01934 520520, - ,,,No ratings yet Rate it yourself - /Services/opticians/LeaveReview/DefaultView.aspx?id=OP_5M8_8094__000001_BS226HQ,0,0,
Bowen Opticians,OP_5M8_13133__000002_BS233SS,OPT,,135 High Street,Worle,Weston-super-Mare,Avon,BS22 6HQ,Tel: 01934 520520, - ,,,No ratings yet Rate it yourself - /Services/opticians/LeaveReview/DefaultView.aspx?id=OP_5M8_13133__000002_BS233SS,0,0,
Iris Eye Care Optometrists ,GOC CO-3924,OPT,,"Birdwell Clinic, 33 Weston Road",,"Birdwell Clinic, 33 Weston Road",,BS41 9AA,Tel: 01275 393149 (ext. 0789154552), - ,,,No ratings yet Rate it yourself - /Services/opticians/LeaveReview/DefaultView.aspx?id=GOC CO-3924,0,0,yes
Vision Call (Bristol) Ltd,CO- 2321/5FL__000001_BS419LB,OPT,Yanley Court,Long Ashton Business Park,Long Ashton,North Somerset,,BS41 9LB,Tel: 01275 393 507, - ,,,No ratings yet Rate it yourself - /Services/opticians/LeaveReview/DefaultView.aspx?id=CO- 2321/5FL__000001_BS419LB,0,0,
Dury & Shaw Ltd,OP_5JG_9432__000002_BS140SX,OPT,5 Asda Centre,Oatlands Avenue,Bristol,,,BS14 0SX,Tel: 01275 839331, - ,,,No ratings yet Rate it yourself - /Services/opticians/LeaveReview/DefaultView.aspx?id=OP_5JG_9432__000002_BS140SX,0,0,
Earlam & Christopher,OP_5K1_3350__000001_TA109RH,OPT,38 North Street,Langport,Somerset,Langport,,TA10 9RH,Tel: 01458 250793, - ,,,No ratings yet Rate it yourself - /Services/opticians/LeaveReview/DefaultView.aspx?id=OP_5K1_3350__000001_TA109RH,0,0,
Sight Centres Ltd,OP_5M8_7558__000001_BS481RG,OPT,14 Colliers Walk,Nailsea,Bristol,,,BS48 1RG,Tel: 01275 810301, - ,,,No ratings yet Rate it yourself - /Services/opticians/LeaveReview/DefaultView.aspx?id=OP_5M8_7558__000001_BS481RG,0,0,
Boots-Nailsea,OP_5M8_12555__000002_BS481RQ,OPT,1-2 Colliers Walk,Crown Glass Shopping Centre,,Nailsea,Somerset,BS48 1RH,Tel: 01275 856074, - ,,,No ratings yet Rate it yourself - /Services/opticians/LeaveReview/DefaultView.aspx?id=OP_5M8_12555__000002_BS481RQ,0,0,
Specsavers,OP_5M8_14822__000002_BS481RP,OPT,2 Somerset Square,Nailsea,North Somerset,,,BS48 1RP,Tel: 01275 850950, - ,,,No ratings yet Rate it yourself - /Services/opticians/LeaveReview/DefaultView.aspx?id=OP_5M8_14822__000002_BS481RP,0,0,
Lynne Fernandes Optometrists,OP_5M8_14821__000001_BS481AW,OPT,124a High Street,Nailsea,,North Somerset,,BS48 1AH,Tel: 01275 854946, - ,,,2 ratings Rate it yourself - /Services/opticians/LeaveReview/DefaultView.aspx?id=OP_5M8_14821__000001_BS481AW,,,
Simon Goldsmith,OP_5JG_9484__000002_BS148PG,OPT,70 Hollway Road,Stockwood,Bristol,,,BS14 8PG,Tel: 01275 838532, - ,,,No ratings yet Rate it yourself - /Services/opticians/LeaveReview/DefaultView.aspx?id=OP_5JG_9484__000002_BS148PG,0,0,
Armstrong & North ,OP_5M8_148__000001_BS231TR,OPT,,55c Oxford Street,,Weston Super Mare,,BS23 1TR,Tel: 01934 626579, - ,,,No ratings yet Rate it yourself - /Services/opticians/LeaveReview/DefaultView.aspx?id=OP_5M8_148__000001_BS231TR,0,0,
East Quay Vision Ltd,00144__000003_TA64GP,OPT,East Quay Medical Centre,East Quay,,Bridgwater,,TA6 4GP,Tel: 01278 440440, - ,,,2 ratings Rate it yourself - /Services/opticians/LeaveReview/DefaultView.aspx?id=00144__000003_TA64GP,,,yes
NK Opticians,OP_5M8_6391__000001_BS231QH,OPT,40 Meadow Street,Weston-Super-Mare,North Somerset,,,BS23 1QH,Tel: 01934 628820, - ,,,No ratings yet Rate it yourself - /Services/opticians/LeaveReview/DefaultView.aspx?id=OP_5M8_6391__000001_BS231QH,0,0,
Darlingtons,OP_5M8_14816__000002_BS231QH,OPT,44 Meadow Street,Weston-Super-Mare,North Somerset,,,BS23 1QH,Tel: 01934 631539, - ,,,No ratings yet Rate it yourself - /Services/opticians/LeaveReview/DefaultView.aspx?id=OP_5M8_14816__000002_BS231QH,0,0,
Greenslade Opticians,OP_5M8_12325__000001_BS231HD,OPT,51 High Street,Weston-Super-Mare,North Somerset,,,BS23 1HD,Tel: 01934 629755, - ,,,No ratings yet Rate it yourself - /Services/opticians/LeaveReview/DefaultView.aspx?id=OP_5M8_12325__000001_BS231HD,0,0,
Boots-Weston-Super-Mare,OP_5M8_5109__000002_BS231HD,OPT,37 High Street,,,Weston Super Mare,,BS23 1HD,Tel: 01934 629 852, - ,,,2 ratings Rate it yourself - /Services/opticians/LeaveReview/DefaultView.aspx?id=OP_5M8_5109__000002_BS231HD,,,
Specsavers Opticians,OP_5M8_8224__000001_BS231HE,OPT,75 High Street,Weston-Super-Mare,North Somerset,,,BS23 1HE,Tel: 01934 642140, - ,,,No ratings yet Rate it yourself - /Services/opticians/LeaveReview/DefaultView.aspx?id=OP_5M8_8224__000001_BS231HE,0,0,
Optika,OP_5M8_518__000001_BS231HL,OPT,81 The High Street,,,"Weston-Super-Mare, North Somerset",,BS23 1HE,Tel: 01934 642909, - ,,,No ratings yet Rate it yourself - /Services/opticians/LeaveReview/DefaultView.aspx?id=OP_5M8_518__000001_BS231HL,0,0,
Boots-Bridgewater,OP_5FW_5633__000002_TA63NG,OPT,34-38 Fore Street,,,Bridgwater,Somerset,TA6 3NG,Tel: 01278 423210, - ,,,No ratings yet Rate it yourself - /Services/opticians/LeaveReview/DefaultView.aspx?id=OP_5FW_5633__000002_TA63NG,0,0,
Specsavers,OP_5FW_11799__000001_TA63BH,OPT,Unit 3 Royal Clarence House,High Street,Bridgwater,Somerset,,TA6 3BH,Tel: 01278 452245, - ,,,1 rating Rate it yourself - /Services/opticians/LeaveReview/DefaultView.aspx?id=OP_5FW_11799__000001_TA63BH,,,
Paul White Opticians,OP_5FW_14658__000001_TA63LY,OPT,50 St Mary Street,Bridgwater,Somerset,Somerset,,TA6 3LY,Tel: 01278 421225, - ,,,1 rating Rate it yourself - /Services/opticians/LeaveReview/DefaultView.aspx?id=OP_5FW_14658__000001_TA63LY,,,
David Phillips Opticians,OP_5JG_7618__000002_BS31JD,OPT,230 North Street,Bedminster,Bristol,,,BS3 1JD,Tel: 0117 963 5477, - ,,,No ratings yet Rate it yourself - /Services/opticians/LeaveReview/DefaultView.aspx?id=OP_5JG_7618__000002_BS31JD,0,0,
David Phillips Opticians,OP_5JG_11857__000001_BS31JJ,OPT,230 North Street,Bedminister,Bristol,,,BS3 1JB,Tel: 0117 966 3417, - ,,,1 rating Rate it yourself - /Services/opticians/LeaveReview/DefaultView.aspx?id=OP_5JG_11857__000001_BS31JJ,,,
Sight Centres,OP_5JG_5944__000001_BS42RA,OPT,17 Broad Walk,,Bristol,,,BS4 2RA,Tel: 0117 977 2579, - ,,,No ratings yet Rate it yourself - /Services/opticians/LeaveReview/DefaultView.aspx?id=OP_5JG_5944__000001_BS42RA,0,0,
Turners Optometrists,OP_5FW_386__000001_TA67DR,OPT,Aspen House,67 Wembdon Road,Bridgwater,Somerset,,TA6 7DR,Tel: 01278 422978, - ,,,No ratings yet Rate it yourself - /Services/opticians/LeaveReview/DefaultView.aspx?id=OP_5FW_386__000001_TA67DR,0,0,
Scrivens,OP_5JG_10172__000002_BS34EY,OPT,100 East Street,Bedminster,,Bristol,Avon,BS3 4EY,Tel: 0117 963 7105, - ,,,No ratings yet Rate it yourself - /Services/opticians/LeaveReview/DefaultView.aspx?id=OP_5JG_10172__000002_BS34EY,0,0,
Specsavers Opticians,OP_5JG_12494__000001_BS34HH,OPT,9 Imperial Parade,East Street,Bristol,,,BS3 4HH,Tel: 0117 966 4000, - ,,,No ratings yet Rate it yourself - /Services/opticians/LeaveReview/DefaultView.aspx?id=OP_5JG_12494__000001_BS34HH,0,0,
Brignall & Partners,OP_5FL_8625__000001_BS312UA,OPT,36 West View Road,Keynsham,Bristol,,,BS31 2UA,Tel: 0117 986 2147, - ,,,No ratings yet Rate it yourself - /Services/opticians/LeaveReview/DefaultView.aspx?id=OP_5FL_8625__000001_BS312UA,0,0,
Specs Savers,OP_5JG_9205__000001_BS34JY,OPT,East Street,Bedminster,Bristol,,,BS3 4JY,Tel: 0117 9231839, - ,,,No ratings yet Rate it yourself - /Services/opticians/LeaveReview/DefaultView.aspx?id=OP_5JG_9205__000001_BS34JY,0,0,
Specsavers Opticians,OP_5FL_8988__000001_BS311EG,OPT,12 Temple Street,Keynsham,Bristol,,,BS31 1EG,Tel: 0117 986 6226, - ,,,4 ratings Rate it yourself - /Services/opticians/LeaveReview/DefaultView.aspx?id=OP_5FL_8988__000001_BS311EG,,,
Lynne Fernandes Optometrists,OP_5JG_6422__000002_BS42AL,OPT,182a Wells Road,Knowle,,Bristol,,BS4 2AL,Tel: 0117 977 6330, - ,,,2 ratings Rate it yourself - /Services/opticians/LeaveReview/DefaultView.aspx?id=OP_5JG_6422__000002_BS42AL,,,
Norville Opticians,OP_5FL_39__000001_BS311EB,OPT,69 High Street,Keynsham,,Bristol,Avon,BS31 1DS,Tel: 0117 9865066, - ,,,No ratings yet Rate it yourself - /Services/opticians/LeaveReview/DefaultView.aspx?id=OP_5FL_39__000001_BS311EB,0,0,
Lee Opticians Limited,OP_5FL_14819__000002_BS311DS,OPT,41 High Street,Keynsham,Bristol,,,BS31 1DS,, - ,,,No ratings yet Rate it yourself - /Services/opticians/LeaveReview/DefaultView.aspx?id=OP_5FL_14819__000002_BS311DS,0,0,
Boots-Keynsham,OP_5FL_1599__000001_BS311DP,OPT,17 High Street,,,Keynsham,Avon,BS31 1DP,Tel: 0117 986 2278 (ext. 2), - ,,,1 rating Rate it yourself - /Services/opticians/LeaveReview/DefaultView.aspx?id=OP_5FL_1599__000001_BS311DP,,,
Boots-Clevedon,OP_5M8_4612__000001_BS216LZ,OPT,9 Old Church Road,,,Clevedon,Avon,BS21 6LZ,Tel: 01275 877 877, - ,,,No ratings yet Rate it yourself - /Services/opticians/LeaveReview/DefaultView.aspx?id=OP_5M8_4612__000001_BS216LZ,0,0,
Spex Appeal Ltd,OP_5M8_8712__000001_BS216NN,OPT,29 Old Church Road,Clevedon,North Somerset,,,BS21 6NN,Tel: 01275 873559, - ,,,No ratings yet Rate it yourself - /Services/opticians/LeaveReview/DefaultView.aspx?id=OP_5M8_8712__000001_BS216NN,0,0,
C M Lea (Opticians) Ltd,OP_5JG_4375__000001_BS43PF,OPT,38 Sandy Park Road,Brislington,Bristol,,,BS4 3PF,Tel: 0117 9776202, - ,,,No ratings yet Rate it yourself - /Services/opticians/LeaveReview/DefaultView.aspx?id=OP_5JG_4375__000001_BS43PF,0,0,
Scrivens Opticians,OP_5JG_11126__000001_BS84BX,OPT,15 Princess Victoria Street,Clifton,Bristol,Bristol,,BS8 4BX,Tel: 01272 737764, - ,,,No ratings yet Rate it yourself - /Services/opticians/LeaveReview/DefaultView.aspx?id=OP_5JG_11126__000001_BS84BX,0,0,
B A Vousden Ltd,OP_5JG_9372__000001_BS84HU,OPT,44 Regent Street,Clifton,Bristol,Bristol,,BS8 4HU,Tel: 0117 974 4944, - ,,,No ratings yet Rate it yourself - /Services/opticians/LeaveReview/DefaultView.aspx?id=OP_5JG_9372__000001_BS84HU,0,0,
M W Dunscombe Ltd,OP_5JG_12001__000001_BS14XH,OPT,7 St. Augustines Parade,,Bristol,,,BS1 4XH,Tel: 0117 927 2155, - ,,,No ratings yet Rate it yourself - /Services/opticians/LeaveReview/DefaultView.aspx?id=OP_5JG_12001__000001_BS14XH,0,0,
Vision Express Opticians,OP_5M8_12104__000001_BS217NZ,OPT,20 Hill Road,,North Somerset,Clevedon,,BS21 7NZ,Tel: 01275 873536, - ,,,No ratings yet Rate it yourself - /Services/opticians/LeaveReview/DefaultView.aspx?id=OP_5M8_12104__000001_BS217NZ,0,0,
Bramley Pope,OP_5JG_14825__000001_BS11JX,OPT,35 St. Stephens Street,,Bristol,,,BS1 1JX,Tel: 0117 9300035, - ,,,No ratings yet Rate it yourself - /Services/opticians/LeaveReview/DefaultView.aspx?id=OP_5JG_14825__000001_BS11JX,0,0,
Goatman and Batham,OP_5JG_3296__000001_BS81EY,OPT,77 Queens Road,Clifton,Bristol,,,BS8 1QP,Tel: 0117 9262380, - ,,,1 rating Rate it yourself - /Services/opticians/LeaveReview/DefaultView.aspx?id=OP_5JG_3296__000001_BS81EY,,,
Tudball (Opticians) Ltd,OP_5M8_2234__000001_BS206AH,OPT,,Tudball Opticians,95 Hill Road,CLEVEDON,,BS21 7PN,Tel: 01275 343 353, - ,,,No ratings yet Rate it yourself - /Services/opticians/LeaveReview/DefaultView.aspx?id=OP_5M8_2234__000001_BS206AH,0,0,
Tudball (Opticians) Ltd,OP_5M8_8889__000001_BS217PN,OPT,95 Hill Road,Clevedon,North Somerset,,,BS21 7PN,Tel: 01275 343353, - ,,,No ratings yet Rate it yourself - /Services/opticians/LeaveReview/DefaultView.aspx?id=OP_5M8_8889__000001_BS217PN,0,0,
Specsavers Opticians,OP_5JG_5923__000001_BS12DD,OPT,1 and 7 Union Street,,Bristol,,,BS1 2DD,Tel: 0117 927 2931, - ,,,2 ratings Rate it yourself - /Services/opticians/LeaveReview/DefaultView.aspx?id=OP_5JG_5923__000001_BS12DD,,,
Everybody,OP_5JG_138__000002_BS13ED,OPT,2 Castle Gallery,Broadmead,Bristol,,,BS1 3XE,Tel: 0117 929 7677, - ,,,No ratings yet Rate it yourself - /Services/opticians/LeaveReview/DefaultView.aspx?id=OP_5JG_138__000002_BS13ED,0,0,
David Clulow Opticians,OP_5JG_4665__000002_BS13XB,OPT,13 Broadmead Gallery,Broadmead,Bristol,,,BS1 3XB,Tel: 0117 925 4954, - ,,,No ratings yet Rate it yourself - /Services/opticians/LeaveReview/DefaultView.aspx?id=OP_5JG_4665__000002_BS13XB,0,0,
Boots-Bristol - Broadmead (in Boots UK),OP_5JG_704__000003_BS13ED,OPT,59 Broadmead,,Bristol,Bristol,,BS1 3EA,Tel: 0117 927 2418, - ,,,No ratings yet Rate it yourself - /Services/opticians/LeaveReview/DefaultView.aspx?id=OP_5JG_704__000003_BS13ED,0,0,
Specsavers Bristol City Centre,TP15R,OPT,,30-32 Merchant Street,,Bristol,,BS1 3EP,Tel: 0117 922 5288, - ,,,No ratings yet Rate it yourself - /Services/opticians/LeaveReview/DefaultView.aspx?id=TP15R,0,0,
Eye-Tech Opticians,OP_5FX_13589__000001_BA111AH,OPT,25 Market Place,Frome,,Somerset,,BA11 1AH,Tel: 01373 462573, - ,,,No ratings yet Rate it yourself - /Services/opticians/LeaveReview/DefaultView.aspx?id=OP_5FX_13589__000001_BA111AH,0,0,
Specsavers Opticians,OP_5FX_7746__000002_BA111BS,OPT,19 Westway Centre,Frome,,Somerset,,BA11 1BS,Tel: 01373 451180, - ,,,No ratings yet Rate it yourself - /Services/opticians/LeaveReview/DefaultView.aspx?id=OP_5FX_7746__000002_BA111BS,0,0,
Boots-Frome,OP_5FX_12891__000001_BA111BN,OPT,3 Cheap Street,,,Frome,Somerset,BA11 1BN,Tel: 01373 462031, - ,,,No ratings yet Rate it yourself - /Services/opticians/LeaveReview/DefaultView.aspx?id=OP_5FX_12891__000001_BA111BN,0,0,
Vision Express,OP_5JG_12626__000001_BS13HF,OPT,9 Broadmead,,Bristol,,,BS1 3HF,Tel: 0117 929 2206, - ,,,No ratings yet Rate it yourself - /Services/opticians/LeaveReview/DefaultView.aspx?id=OP_5JG_12626__000001_BS13HF,0,0,
O'toid Opticians,01-19886,OPT,,5 The Bridge,,Frome,,BA11 1AR,Tel: 01373 467467, - ,,,No ratings yet Rate it yourself - /Services/opticians/LeaveReview/DefaultView.aspx?id=01-19886,0,0,
Healthcall Optical Services Ltd,OP_5JF_11771__000002_BS20BH,OPT,6-7 Hide Market,West Street,St. Philips,,,BS2 0BH,Tel: 0117 954 3700, - ,,,No ratings yet Rate it yourself - /Services/opticians/LeaveReview/DefaultView.aspx?id=OP_5JF_11771__000002_BS20BH,0,0,
Dollond & Aitchison,OP_5JG_3031__000001_BS13HH,OPT,8 Broadmead,,Bristol,,,BS1 3HH,Tel: 0117 926 2859, - ,,,No ratings yet Rate it yourself - /Services/opticians/LeaveReview/DefaultView.aspx?id=OP_5JG_3031__000001_BS13HH,0,0,
Juul & Payne,OP_5JG_4755__000001_BS82DJ,OPT,Juul & Payne,70 Alma Rd,Clifton,Bristol,Avon,BS8 2DJ,Tel: 0117 9735929, - ,,,6 ratings Rate it yourself - /Services/opticians/LeaveReview/DefaultView.aspx?id=OP_5JG_4755__000001_BS82DJ,,,yes
Boots-Bristol - Clifton Down,BS8 2NN_94821,OPT,,"Unit 8a, Clifton Down Shopping Centre",Clifton,Bristol,,BS8 2NN,Tel: 01179 237319, - ,,,1 rating Rate it yourself - /Services/opticians/LeaveReview/DefaultView.aspx?id=BS8 2NN_94821,,,
Specsavers,OP_5JG_51__000003_BS82NN,OPT,15 Clifton Down Shopping Centre,Whiteladies Road,Bristol,,,BS8 2NN,Tel: 0117 946 6994, - ,,,No ratings yet Rate it yourself - /Services/opticians/LeaveReview/DefaultView.aspx?id=OP_5JG_51__000003_BS82NN,0,0,
Amar Shah Optometrist,OP_5JG_12627__000001_BS66JX,OPT,52 Cotham Hill,,Bristol,,,BS6 6JX,Tel: 0117 9730335, - ,,,No ratings yet Rate it yourself - /Services/opticians/LeaveReview/DefaultView.aspx?id=OP_5JG_12627__000001_BS66JX,0,0,
C M Lea (Opticians) Ltd,OP_5JF_1481__000002_BS50RB,OPT,62 Stapleton Road,,Bristol,,,BS5 0RB,Tel: 0117 9557625, - ,,,No ratings yet Rate it yourself - /Services/opticians/LeaveReview/DefaultView.aspx?id=OP_5JF_1481__000002_BS50RB,0,0,
Dyer & Scott,OP_5JG_7065__000002_BS82RP,OPT,120 Whiteladies Road,Clifton,Bristol,,,BS8 2RP,Tel: 0117 973 7667, - ,,,1 rating Rate it yourself - /Services/opticians/LeaveReview/DefaultView.aspx?id=OP_5JG_7065__000002_BS82RP,,,
MikeCees Opticians,OP_5JF_8838__000001_BS59HH,OPT,122 Church Road,Redfield,Bristol,Bristol,,BS5 9HH,Tel: 0117 9556253, - ,,,No ratings yet Rate it yourself - /Services/opticians/LeaveReview/DefaultView.aspx?id=OP_5JF_8838__000001_BS59HH,0,0,
Four Eyes Dispensing Optician,TP0MT,OPT,,63 High Street,Hanham,Bristol,,BS15 3DG,Tel: 0117 9611100, - ,,,No ratings yet Rate it yourself - /Services/opticians/LeaveReview/DefaultView.aspx?id=TP0MT,0,0,
Bath Opticians,OP_5FL_4068__000002_BA23PN,OPT,Bath Opticians,57 Moorland Road,Oldfield Park,Bath,,BA2 3PJ,Tel: 01225 427353, - ,,,1 rating Rate it yourself - /Services/opticians/LeaveReview/DefaultView.aspx?id=OP_5FL_4068__000002_BA23PN,,,yes
Armstrong and North Opticians,OP_5FL_2841__000001_BA14BX,OPT,,13 Chelsea Road,Lower Weston,Bath,Avon,BA1 3DU,Tel: 01225 466110, - ,,,1 rating Rate it yourself - /Services/opticians/LeaveReview/DefaultView.aspx?id=OP_5FL_2841__000001_BA14BX,,,
Sarah Gibson Optometrist ,OP_5K1_6438__000001_BA99LP,OPT,Commerce House,Market Place,,Wincanton,Somerset,BA9 9LP,Tel: 01963 34333, - ,,,1 rating Rate it yourself - /Services/opticians/LeaveReview/DefaultView.aspx?id=OP_5K1_6438__000001_BA99LP,,,
L & M Wincanton Limited,OPT_BA99LA_2,OPT,,16 Market Place,,Wincanton,,BA9 9LA,, - ,,,No ratings yet Rate it yourself - /Services/opticians/LeaveReview/DefaultView.aspx?id=OPT_BA99LA_2,0,0,
L & M Wincanton Limited,OPT_BA99LA_1,OPT,,16 Market Place,,Wincanton,,BA9 9LA,, - ,,,No ratings yet Rate it yourself - /Services/opticians/LeaveReview/DefaultView.aspx?id=OPT_BA99LA_1,0,0,
Lynne Fernandes Optometrists,OP_5JF_6000__000001_BS78AS,OPT,75 Gloucester Road,Bishopston,,Bristol,,BS7 8AS,Tel: 0117 942 6843, - ,,,2 ratings Rate it yourself - /Services/opticians/LeaveReview/DefaultView.aspx?id=OP_5JF_6000__000001_BS78AS,,,
Goldsmith & Harvey Opticians,OP_5A3_8324__000002_BS307DY,OPT,Asda Store,Craven Way,Longwell Green,Bristol,,BS30 7DY,Tel: 0117 9605809, - ,,,3 ratings Rate it yourself - /Services/opticians/LeaveReview/DefaultView.aspx?id=OP_5A3_8324__000002_BS307DY,,,
Royal United Hospital,OP_5FL_9076__000001_BA13NG,OPT,Eye Clinic,Combe Park,Bath,,,BA1 3NG,Tel: 01225 428331, - ,,,No ratings yet Rate it yourself - /Services/opticians/LeaveReview/DefaultView.aspx?id=OP_5FL_9076__000001_BA13NG,0,0,