Organisation Name,NACS Code,Organisation Type,Address1,Address2,Address3,Address4,Address5,PostCode,Telephone Number,Opening time,Value  (Opening time),Banding Classification  (Opening time),NHS.UK users rating,Value  (NHS.UK users rating),Banding Classification  (NHS.UK users rating),Car parking (Is there car parking at this organisation?)
DomEyeCare Ltd,1609141104,OPT,,70 Lowlands Road,,Pinner,,HA5 1TU,Tel: 0208 868 8475, - ,,,No ratings yet Rate it yourself - /Services/opticians/LeaveReview/DefaultView.aspx?id=1609141104,0,0,
First Contact Opticians,OP_5AT_3927__000001_HA51RJ,OPT,126 Field End Road,Eastcote,Pinner,Middlesex,,HA5 1RJ,Tel: 020 8866 4911, - ,,,1 rating Rate it yourself - /Services/opticians/LeaveReview/DefaultView.aspx?id=OP_5AT_3927__000001_HA51RJ,,,
Leith Opticians,OP_5AT_4339__000002_HA51QR,OPT,175 Field End Road,Eastcote,Pinner,Middlesex,,HA5 1QR,Tel: 020 8868 2277, - ,,,No ratings yet Rate it yourself - /Services/opticians/LeaveReview/DefaultView.aspx?id=OP_5AT_4339__000002_HA51QR,0,0,
Crispe Opticians,OP_5AT_12413__000002_HA51QZ,OPT,207 Field End Road,Eastcote,Pinner,Middlesex,,HA5 1QZ,Tel: 020 8866 3998, - ,,,No ratings yet Rate it yourself - /Services/opticians/LeaveReview/DefaultView.aspx?id=OP_5AT_12413__000002_HA51QZ,0,0,
Icare Opticians,TP8VL,OPT,,6 Barters Walk,,Pinner,,HA5 5LU,, - ,,,No ratings yet Rate it yourself - /Services/opticians/LeaveReview/DefaultView.aspx?id=TP8VL,0,0,
Insight Opticians (Seemera Ltd t/a),OP_5K6_2521__000001_HA53JE,OPT,6 Bridge Street,Pinner,Middlesex,,,HA5 3JE,Tel: 020 8866 5399, - ,,,No ratings yet Rate it yourself - /Services/opticians/LeaveReview/DefaultView.aspx?id=OP_5K6_2521__000001_HA53JE,0,0,
G&G Pinner Optometrists,OP_5K6_14929__000001_HA53JD,OPT,3 Red Lion Parade,Bridge Street,Pinner,Pinner,Middlesex,HA5 3JD,Tel: 020 8866 2620, - ,,,No ratings yet Rate it yourself - /Services/opticians/LeaveReview/DefaultView.aspx?id=OP_5K6_14929__000001_HA53JD,0,0,yes
Specsavers Opticians,TP9FY,OPT,,36 Bridge Street,,Pinner,,HA5 3JF,, - ,,,No ratings yet Rate it yourself - /Services/opticians/LeaveReview/DefaultView.aspx?id=TP9FY,0,0,
Boots-Pinner,OP_5K6_12949__000002_HA53JF,OPT,28 Bridge Stree,,,Pinner,Middlesex,HA5 3JF,Tel: 020 8866 5106, - ,,,No ratings yet Rate it yourself - /Services/opticians/LeaveReview/DefaultView.aspx?id=OP_5K6_12949__000002_HA53JF,0,0,
Eyesey Eyecare,5K6- 3034__000006_HA53JF,OPT,,50 Bridge Street,,Pinner,Middlesex,HA5 3JF,Tel: 020 8429 0101, - ,,,No ratings yet Rate it yourself - /Services/opticians/LeaveReview/DefaultView.aspx?id=5K6- 3034__000006_HA53JF,0,0,
Barnett Opticians,OP_5K6_14961__000001_HA55EN,OPT,367 Rayners Lane,,,Pinner,Middlesex,HA5 5EN,Tel: 020 8868 3003, - ,,,No ratings yet Rate it yourself - /Services/opticians/LeaveReview/DefaultView.aspx?id=OP_5K6_14961__000001_HA55EN,0,0,
New Vision,OP_5K6_4098__000001_HA29SE,OPT,431 Alexandra Avenue,,Harrow,,,HA2 9SE,Tel: 0208 429 3641, - ,,,6 ratings Rate it yourself - /Services/opticians/LeaveReview/DefaultView.aspx?id=OP_5K6_4098__000001_HA29SE,,,
Specsavers Opticians,OP_5AT_14107__000001_HA48LL,OPT,134 High Street,,Ruislip,Middlesex,,HA4 8LL,Tel: 01895 679750, - ,,,No ratings yet Rate it yourself - /Services/opticians/LeaveReview/DefaultView.aspx?id=OP_5AT_14107__000001_HA48LL,0,0,
Eye Design Opticians,OP_5AT_8112__000001_HA48LJ,OPT,170 High Street,Ruislip,Middlesex,,,HA4 8LJ,Tel: 01895 621135, - ,,,No ratings yet Rate it yourself - /Services/opticians/LeaveReview/DefaultView.aspx?id=OP_5AT_8112__000001_HA48LJ,0,0,
Vision Express (UK) Ltd,OP_5AT_6219__000002_HA48LS,OPT,112 High Street,Ruislip,Middlesex,,,HA4 8LS,Tel: 01895 677461, - ,,,No ratings yet Rate it yourself - /Services/opticians/LeaveReview/DefaultView.aspx?id=OP_5AT_6219__000002_HA48LS,0,0,
Boots-Ruislip,OP_5AT_676__000001_HA47AU,OPT,33 High Street,,,Ruislip,Middlesex,HA4 7AU,Tel: 01895 634 234, - ,,,1 rating Rate it yourself - /Services/opticians/LeaveReview/DefaultView.aspx?id=OP_5AT_676__000001_HA47AU,,,
S H Harrold,OP_5AT_6308__000001_HA61LU,OPT,85 Joel Street,Ryefield Parade,Northwood Hills,Middlesex,,HA6 1LU,Tel: 01923 823027, - ,,,1 rating Rate it yourself - /Services/opticians/LeaveReview/DefaultView.aspx?id=OP_5AT_6308__000001_HA61LU,,,
Hillier Opticians ,OP_5K6_7317__000001_HA26ED,OPT,19 Broadwalk,Pinner Road,Harrow,,,HA2 6ED,Tel: 020 8863 1541, - ,,,No ratings yet Rate it yourself - /Services/opticians/LeaveReview/DefaultView.aspx?id=OP_5K6_7317__000001_HA26ED,0,0,
Rai Optometrists Ltd,OP_5K6_6218__000002_HA27SY,OPT,8 Broadway Parade,Pinner Road,Harrow,,,HA2 7SY,Tel: 020 8427 9202, - ,,,No ratings yet Rate it yourself - /Services/opticians/LeaveReview/DefaultView.aspx?id=OP_5K6_6218__000002_HA27SY,0,0,
Mr R K Shah,01-13945,OPT,,58 Southfield Park,,Harrow,,HA2 6HE,Tel: 07956172861, - ,,,No ratings yet Rate it yourself - /Services/opticians/LeaveReview/DefaultView.aspx?id=01-13945,0,0,
Opticiancall (Home Visiting Opticians),OP_HA61HJ_85747,OPT,,24 Knoll Crescent,,Northwood,Middlesex,HA6 1HJ,Tel: 0800 999 3937, - ,,,No ratings yet Rate it yourself - /Services/opticians/LeaveReview/DefaultView.aspx?id=OP_HA61HJ_85747,0,0,
Hatch End Eyecare,01-22088,OPT,Hatch End Eyecare,394 Uxbridge Road,,Pinner,,HA5 4HP,Tel: 020 8428 0025, - ,,,2 ratings Rate it yourself - /Services/opticians/LeaveReview/DefaultView.aspx?id=01-22088,,,yes
Day Lewis Opticians ,OP_5K6_2305__000002_HA55LU,OPT,6 Barters Walk,,Pinner,,,HA5 4LU,Tel: 0208 868 2597, - ,,,No ratings yet Rate it yourself - /Services/opticians/LeaveReview/DefaultView.aspx?id=OP_5K6_2305__000002_HA55LU,0,0,
The Eyecare Studio (Lucrative Business Ltd T/A),OP_5K6_9376__000001_HA54JR,OPT,439 Uxbridge Road,Pinner,Middlesex,,,HA5 4JR,Tel: 020 8421 2277, - ,,,No ratings yet Rate it yourself - /Services/opticians/LeaveReview/DefaultView.aspx?id=OP_5K6_9376__000001_HA54JR,0,0,
Specsavers (South Harrow Visionplus Ltd),OP5K6__000002_HA28EE,OPT,308 Northolt Road,South Harrow,Harrow,Middlesex,,HA2 8EE,Tel: 020 8869 0301, - ,,,3 ratings Rate it yourself - /Services/opticians/LeaveReview/DefaultView.aspx?id=OP5K6__000002_HA28EE,,,
Parker & Hammond Opticians ,OP_5K6_9349__000001_HA28EE,OPT,302 Northolt Road,,South Harrow,,,HA2 8EE,Tel: 020 8422 1269, - ,,,No ratings yet Rate it yourself - /Services/opticians/LeaveReview/DefaultView.aspx?id=OP_5K6_9349__000001_HA28EE,0,0,
Family Eyecare Ltd,OP_5K6_627__000002_HA28DU,OPT,246 Northolt Road,,Harrow,,,HA2 8DU,Tel: 020 8423 5818, - ,,,1 rating Rate it yourself - /Services/opticians/LeaveReview/DefaultView.aspx?id=OP_5K6_627__000002_HA28DU,,,
Home Health Clinic,HOMEHEALTHCLINIC1,OPT,,"2 Thorndyke Court, Westfield Park",,Pinner,Middlesex,HA5 4JG,Tel: 020 8428 4068, - ,,,No ratings yet Rate it yourself - /Services/opticians/LeaveReview/DefaultView.aspx?id=HOMEHEALTHCLINIC1,0,0,
Lamertons,OP_5AT_12378__000001_HA63AD,OPT,65 Green Lane,Northwood,Middlesex,,,HA6 3AD,Tel: 01923 822066, - ,,,No ratings yet Rate it yourself - /Services/opticians/LeaveReview/DefaultView.aspx?id=OP_5AT_12378__000001_HA63AD,0,0,
AVK I-Care,D-13231,OPT,,15a Swakeleys Road,,Ickenham,,UB10 8DF,Tel: 01895347121, - ,,,No ratings yet Rate it yourself - /Services/opticians/LeaveReview/DefaultView.aspx?id=D-13231,0,0,
Vision Express (Harrrow),OP_5K6_11425__000003_HA11HS,OPT,Unit 6 St.George's Shopping Centre,St Anns Road,Harrow,,,HA1 1HS,Tel: 020 8427 3311, - ,,,1 rating Rate it yourself - /Services/opticians/LeaveReview/DefaultView.aspx?id=OP_5K6_11425__000003_HA11HS,,,
St Ann's Optical Centre,OP_5K6_10180__000001_HA11LE,OPT,58 Greenhill Way,Harrow,Middlesex,,,HA1 1LE,Tel: 020 8863 5575, - ,,,1 rating Rate it yourself - /Services/opticians/LeaveReview/DefaultView.aspx?id=OP_5K6_10180__000001_HA11LE,,,
Boots Opticians,OP_5K6_12060__000002_HA11HS,OPT,30 St. Anns Road,,,Harrow,,HA1 1LA,Tel: 0208 427 4113, - ,,,98 ratings Rate it yourself - /Services/opticians/LeaveReview/DefaultView.aspx?id=OP_5K6_12060__000002_HA11HS,,,
Boots-Harrow - St Anns Rd,OP_5K6_1130__000001_HA11LA,OPT,30 St Anns Road,,,Harrow,Middlesex,HA1 1LA,Tel: 0208 427 4113, - ,,,2 ratings Rate it yourself - /Services/opticians/LeaveReview/DefaultView.aspx?id=OP_5K6_1130__000001_HA11LA,,,
Specsavers Opticians (Harrow Visionplus Ltd),OP_5K6_13138__000002_HA12TA,OPT,289 Station Road,,Harrow,,,HA1 2TA,Tel: 020 8424 0244, - ,,,5 ratings Rate it yourself - /Services/opticians/LeaveReview/DefaultView.aspx?id=OP_5K6_13138__000002_HA12TA,,,
Mandeville Opticians,140920161008,OPT,,6 Mandeville Road,,Northolt,Middlesex,UB5 5BJ,Tel: 020 8841 2626, - ,,,No ratings yet Rate it yourself - /Services/opticians/LeaveReview/DefaultView.aspx?id=140920161008,0,0,
Visionsavers Opticians,OP_5K6_14943__000001_HA35DQ,OPT,53 High Street,Wealdstone,Harrow,,,HA3 5DQ,Tel: 020 8861 6006, - ,,,No ratings yet Rate it yourself - /Services/opticians/LeaveReview/DefaultView.aspx?id=OP_5K6_14943__000001_HA35DQ,0,0,
Visioncare Eye -Clinic ,OP_5K6_543__000002_HA37AF,OPT,Visioncare Medical Eye Centre,62-64 High Street,Wealdstone,Harrow,Middlesex,HA3 7AF,Tel: 020 8863 5333, - ,,,No ratings yet Rate it yourself - /Services/opticians/LeaveReview/DefaultView.aspx?id=OP_5K6_543__000002_HA37AF,0,0,
Brush & Fowler Opticians,OP_5K6_3376__000001_HA12JN,OPT,3 Manor Parade,Sheepcote Road,Harrow,,,HA1 2JN,Tel: 0208 427 0279, - ,,,No ratings yet Rate it yourself - /Services/opticians/LeaveReview/DefaultView.aspx?id=OP_5K6_3376__000001_HA12JN,0,0,
OLDFIELDS OPTICIANS,01-20756_UB54RR_0714,OPT,OLDFIELDS OPTICIANS,27A OLDFIELDS CIRCUS,,NORTHOLT,,UB5 4RR,Tel: 02084224466, - ,,,No ratings yet Rate it yourself - /Services/opticians/LeaveReview/DefaultView.aspx?id=01-20756_UB54RR_0714,0,0,yes
Adams Opticians (Harrow Weald),OP_5K6_9378__000002_HA36EL,OPT,411 High Road,Harrow Weald,Harrow,,,HA3 6EL,Tel: 0208 427 3201, - ,,,No ratings yet Rate it yourself - /Services/opticians/LeaveReview/DefaultView.aspx?id=OP_5K6_9378__000002_HA36EL,0,0,
Eyewise Opticians,OP_5AT_10924__000003_UB109PG,OPT,374 Long Lane,Hillingdon,Uxbridge,,,UB10 9PG,Tel: 01895 234563, - ,,,No ratings yet Rate it yourself - /Services/opticians/LeaveReview/DefaultView.aspx?id=OP_5AT_10924__000003_UB109PG,0,0,
Adams Opticians,OP_5GV_12388__000001_WD197AD,OPT,1 St andrews Road,,Watford,,,WD19 7AD,Tel: 020 8428 5152, - ,,,No ratings yet Rate it yourself - /Services/opticians/LeaveReview/DefaultView.aspx?id=OP_5GV_12388__000001_WD197AD,0,0,
Cravitz Opticians,OP_5K5_11249__000001_HA30AZ,OPT,119 Kenton Road,Kenton,Harrow,,,HA3 0AZ,Tel: 020 8907 7860, - ,,,2 ratings Rate it yourself - /Services/opticians/LeaveReview/DefaultView.aspx?id=OP_5K5_11249__000001_HA30AZ,,,
Eye 2 Eye Opticians Harrow,HARR5K6__000002_HA38SA,OPT,6 Warwick Parade,"Belmont Ciircle , Kenton Lane",Harrow,Middlesex,,HA3 8SA,Tel: 020 8907 8128, - ,,,30 ratings Rate it yourself - /Services/opticians/LeaveReview/DefaultView.aspx?id=HARR5K6__000002_HA38SA,,,
InView Opticians,OP_5K6_13916__000001_HA38RF,OPT,15 Belmont Circle,Harrow,Middlesex,HARROW,Middlesex,HA3 8RF,Tel: 020 8907 3454, - ,,,15 ratings Rate it yourself - /Services/opticians/LeaveReview/DefaultView.aspx?id=OP_5K6_13916__000001_HA38RF,,,
Boots-Greenford,UB6 0UW_19217,OPT,,1000 Greenford Road,,Greenford,Middlesex,UB6 0UW,Tel: 0208 575 2152, - ,,,No ratings yet Rate it yourself - /Services/opticians/LeaveReview/DefaultView.aspx?id=UB6 0UW_19217,0,0,
Mansons Eyecare,OP_5AT_11107__000001_UB49NS,OPT,"14 Jollys Lane, Willow District Centre",Yeading,Hayes,Middlesex,,UB4 9NS,Tel: 0208 845 5757, - ,,,1 rating Rate it yourself - /Services/opticians/LeaveReview/DefaultView.aspx?id=OP_5AT_11107__000001_UB49NS,,,
Harefield Opticians,OP_5AT_12107__000001_UB96BX,OPT,33 High Street,Harefield,Middlesex,UXBRIDGE,Middlesex,UB9 6BX,Tel: 01895 823 237, - ,,,54 ratings Rate it yourself - /Services/opticians/LeaveReview/DefaultView.aspx?id=OP_5AT_12107__000001_UB96BX,,,
The Vision Clinic,R9J0E,OPT,,327 Kenton Road,,"Kenton, Harrow",,HA3 0XS,Tel: 020 8907 5270, - ,,,No ratings yet Rate it yourself - /Services/opticians/LeaveReview/DefaultView.aspx?id=R9J0E,0,0,
Medical Eye Centre,OP_5HX_2081__000001_UB69QD,OPT,9 Ruislip Road,Greenford,Middlesex,,,UB6 9QD,Tel: 020 8578 3721, - ,,,No ratings yet Rate it yourself - /Services/opticians/LeaveReview/DefaultView.aspx?id=OP_5HX_2081__000001_UB69QD,0,0,
Optomlink Limited,OP_5GD_2767__000001_HA72LZ,OPT,97 St andrews Drive,,,Stanmore,Middlesex,HA7 2LZ,Tel: 020 8357 7925, - ,,,No ratings yet Rate it yourself - /Services/opticians/LeaveReview/DefaultView.aspx?id=OP_5GD_2767__000001_HA72LZ,0,0,
Boots-Greenford,OP_5HX_665__000002_UB69PN,OPT,35 The Broadway,,,Greenford,Middlesex,UB6 9PN,Tel: 0208 578 1234, - ,,,No ratings yet Rate it yourself - /Services/opticians/LeaveReview/DefaultView.aspx?id=OP_5HX_665__000002_UB69PN,0,0,
Specsavers Opticians,OP_5HX_14720__000001_UB69PU,OPT,20 The Broadway,Greenford,Middlesex,,,UB6 9PU,Tel: 020 8832 8940, - ,,,No ratings yet Rate it yourself - /Services/opticians/LeaveReview/DefaultView.aspx?id=OP_5HX_14720__000001_UB69PU,0,0,
Kaleyes Opticians,OP_5AT_8491__000001_UB100LR,OPT,7 Marlborough Parade,Uxbridge Road,Hillingdon,Middlesex,,UB10 0LR,Tel: 01895 232113, - ,,,No ratings yet Rate it yourself - /Services/opticians/LeaveReview/DefaultView.aspx?id=OP_5AT_8491__000001_UB100LR,0,0,
Boots-Uxbridge   - Chimes Centre,OP_5AT_14006__000002_UB81GA,OPT,Unit 3,The Chimes Shopping Centre,,Uxbridge,,UB8 1GA,Tel: 01895 814557, - ,,,1 rating Rate it yourself - /Services/opticians/LeaveReview/DefaultView.aspx?id=OP_5AT_14006__000002_UB81GA,,,
icare optician T/a myicare,OP_5LC_610__000001_HA30RN,OPT,23 Trevelyan Cresent,Kenton,,Harrow,Middlesex,HA3 0RN,Tel: 0208 907 7787, - ,,,No ratings yet Rate it yourself - /Services/opticians/LeaveReview/DefaultView.aspx?id=OP_5LC_610__000001_HA30RN,0,0,
Hayes Eye Clinic,OP_5AT_9391__000002_UB40RS,OPT,814a Uxbridge Road,,Middlesex,Hayes,,UB4 0RS,Tel: 020 8561 1625, - ,,,13 ratings Rate it yourself - /Services/opticians/LeaveReview/DefaultView.aspx?id=OP_5AT_9391__000002_UB40RS,,,
S H Harrold (1937) Ltd,OP_5AT_8013__000001_UB81JX,OPT,130-131 High Street,Uxbridge,Middlesex,,,UB8 1JX,Tel: 01895 234017, - ,,,No ratings yet Rate it yourself - /Services/opticians/LeaveReview/DefaultView.aspx?id=OP_5AT_8013__000001_UB81JX,0,0,
Opticial Express,OP_12345_UB8 1JN,OPT,The Market House,High St,,Uxbridge,Middlesex,UB8 1JN,Tel: 0800 023 2020, - ,,,No ratings yet Rate it yourself - /Services/opticians/LeaveReview/DefaultView.aspx?id=OP_12345_UB8 1JN,0,0,
C R Turner,OP_5AT_9290__000002_UB81JN,OPT,11 High Street,Uxbridge,Middlesex,,,UB8 1JN,Tel: 01895 259110, - ,,,No ratings yet Rate it yourself - /Services/opticians/LeaveReview/DefaultView.aspx?id=OP_5AT_9290__000002_UB81JN,0,0,
Specsavers Opticians,OP_5AT_1913__000002_UB81LN,OPT,,56 High Street,Uxbridge,Middlesex,,UB8 1JP,Tel: 01895 256010, - ,,,No ratings yet Rate it yourself - /Services/opticians/LeaveReview/DefaultView.aspx?id=OP_5AT_1913__000002_UB81LN,0,0,
Eye 2 Eye Opticians Bushey,OPT_WD231GE_1,OPT,,84 High Road Bushey,,Heath Bushey,,WD23 1GE,Tel: 020 3925 3925, - ,,,18 ratings Rate it yourself - /Services/opticians/LeaveReview/DefaultView.aspx?id=OPT_WD231GE_1,,,
Eye 2 Eye Opticians Bushey,CO-3211,OPT,,84 High Road Bushey,,Heath Bushey ,,WD23 1GE,, - ,,,No ratings yet Rate it yourself - /Services/opticians/LeaveReview/DefaultView.aspx?id=CO-3211,0,0,
Eye Professionals Ltd,OP_HA72SA_85045,OPT,,40 Lansdowne Road,Stanmore,London,,HA7 2SA,Tel: 0800 8815207, - ,,,No ratings yet Rate it yourself - /Services/opticians/LeaveReview/DefaultView.aspx?id=OP_HA72SA_85045,0,0,
Boots-Uxbridge - Market Sq,OP_5AT_6660__000001_UB81LH,OPT,30 Market Square,,,Uxbridge,Middlesex,UB8 1LH,Tel: 01895 254 885, - ,,,1 rating Rate it yourself - /Services/opticians/LeaveReview/DefaultView.aspx?id=OP_5AT_6660__000001_UB81LH,,,
Vision Express (UK) Ltd,OP_5AT_6652__000001_UB81LN,OPT,58 High Street,Uxbridge,Middlesex,,,UB8 1LN,Tel: 01895 231261, - ,,,No ratings yet Rate it yourself - /Services/opticians/LeaveReview/DefaultView.aspx?id=OP_5AT_6652__000001_UB81LN,0,0,
John Horwitz,01-73135K6__000001_HA73DY,OPT,4 Halsbury Close,,Stanmore Hill,Middlesex,,HA7 3DY,Tel: 020 8954 4499, - ,,,No ratings yet Rate it yourself - /Services/opticians/LeaveReview/DefaultView.aspx?id=01-73135K6__000001_HA73DY,0,0,
Adams Opticians (Stanmore),OP_5K6_74__000001_HA73DP,OPT,3 Church Road,.,Stanmore,Middx,,HA7 4AR,Tel: 020 8954 2133, - ,,,1 rating Rate it yourself - /Services/opticians/LeaveReview/DefaultView.aspx?id=OP_5K6_74__000001_HA73DP,,,
Denham Opticians,OLCO34465QD__000001_UB95HB,OPT,4 The Broadway East,North Orbital Road,Denham Green,Buckinghamshire,,UB9 5HB,Tel: 01895 832122, - ,,,No ratings yet Rate it yourself - /Services/opticians/LeaveReview/DefaultView.aspx?id=OLCO34465QD__000001_UB95HB,0,0,
Mills Optometrists,OP_5AT_2743__000001_UB81AB,OPT,16 Windsor Street,Uxbridge,Middlesex,,,UB8 1AB,Tel: 01895 231694, - ,,,1 rating Rate it yourself - /Services/opticians/LeaveReview/DefaultView.aspx?id=OP_5AT_2743__000001_UB81AB,,,
Dave Opticians,OP_5K6_22__000001_HA74AW,OPT,2 Church Road,,Stanmore,,,HA7 4AW,Tel: 020 8954 7707, - ,,,4 ratings Rate it yourself - /Services/opticians/LeaveReview/DefaultView.aspx?id=OP_5K6_22__000001_HA74AW,,,
Opticalise Ophthalmic Opticians,00001__000003_HA30PS,OPT,241 - 243 Preston Road,Harrow,Middlesex,,,HA3 0PS,Tel: 020 8908 4888, - ,,,No ratings yet Rate it yourself - /Services/opticians/LeaveReview/DefaultView.aspx?id=00001__000003_HA30PS,0,0,
Boots-Stanmore,-805K6__000001_HA74DJ,OPT,47 The Broadway,,,Stanmore,Middlesex,HA7 4DJ,Tel: 0208 954 4513, - ,,,No ratings yet Rate it yourself - /Services/opticians/LeaveReview/DefaultView.aspx?id=-805K6__000001_HA74DJ,0,0,
Specsavers Opticians,A9U5G,OPT,,Sainsbury's Lombardy Retail Park,Coldharbour Lane,Hayes,,UB3 3EX,Tel: 02087564989, - ,,,No ratings yet Rate it yourself - /Services/opticians/LeaveReview/DefaultView.aspx?id=A9U5G,0,0,
Specsavers - Hayes Sainsburys,A9U5G,OPT,Sainsburys,Lombardy Retail Park,Coldharbour Lane,Hayes,,UB3 3EX,Tel: 0208 756 4989, - ,,,1 rating Rate it yourself - /Services/opticians/LeaveReview/DefaultView.aspx?id=A9U5G,,,
Optical Express,OP_5AT_3746__000001_UB81AQ,OPT,Market House,29 High Street,Uxbridge,,,UB8 1AQ,Tel: 01895 253 779, - ,,,No ratings yet Rate it yourself - /Services/opticians/LeaveReview/DefaultView.aspx?id=OP_5AT_3746__000001_UB81AQ,0,0,
Blink Eye Care,OP_5P2_3373__000001_HA63AT,OPT,4 Wigton Gardens,Stanmore,,Middlesex,Middlesex,HA7 1BG,Tel: 0208 816 8549, - ,,,No ratings yet Rate it yourself - /Services/opticians/LeaveReview/DefaultView.aspx?id=OP_5P2_3373__000001_HA63AT,0,0,
Vision Eyecare,OP_5HX_14390__000002_UB67BN,OPT,94 Bilton Road,Perivale,Greenford,,,UB6 7BN,Tel: 020 8998 2121, - ,,,4 ratings Rate it yourself - /Services/opticians/LeaveReview/DefaultView.aspx?id=OP_5HX_14390__000002_UB67BN,,,
VISION ONE 2 ONE OPTICIANS,OL01160915K6__000002_HA86RW,OPT,19 Station Parade,Whitchurch Lane,Edgware,Middx,,HA8 6RW,, - ,,,No ratings yet Rate it yourself - /Services/opticians/LeaveReview/DefaultView.aspx?id=OL01160915K6__000002_HA86RW,0,0,
Eyecraft Optometrist Ltd,OP_5K5_213__000001_HA04TL,OPT,26 Ealing Road,,Wembley,,,HA0 4TL,Tel: 020 8902 9908, - ,,,No ratings yet Rate it yourself - /Services/opticians/LeaveReview/DefaultView.aspx?id=OP_5K5_213__000001_HA04TL,0,0,
Realeyes The Eye Clinic,01-1853,OPT,,"Unit 7, Wembley Central Square",,Wembley,,HA9 7AJ,Tel: 020 3909 9181, - ,,,No ratings yet Rate it yourself - /Services/opticians/LeaveReview/DefaultView.aspx?id=01-1853,0,0,
Boots-Wembley,OP_5K5_3809__000001_HA97AG,OPT,449 High Road,,,Wembley,Middlesex,HA9 7AF,Tel: 0208 9022721, - ,,,1 rating Rate it yourself - /Services/opticians/LeaveReview/DefaultView.aspx?id=OP_5K5_3809__000001_HA97AG,,,
Specsavers Opticians (Wembley Visionplus Ltd T/A),OP_5K5_1786__000002_HA97BH,OPT,476 High Road,Wembley,Middlesex,,,HA9 7AS,Tel: 020 8900 1433, - ,,,2 ratings Rate it yourself - /Services/opticians/LeaveReview/DefaultView.aspx?id=OP_5K5_1786__000002_HA97BH,,,
Tesco Opticians,OP_5GV_5834__000001_WD12BD,OPT,,239-241 High Street,,Watford,,WD17 2BD,Tel: 0845 601 3479, - ,,,No ratings yet Rate it yourself - /Services/opticians/LeaveReview/DefaultView.aspx?id=OP_5GV_5834__000001_WD12BD,0,0,
J B Richards,OP_5GV_155__000001_WD18EH,OPT,20 Vicarage Road,,,Watford,Hertfordshire,WD18 0EH,Tel: 01923 227858, - ,,,No ratings yet Rate it yourself - /Services/opticians/LeaveReview/DefaultView.aspx?id=OP_5GV_155__000001_WD18EH,0,0,
Betterspecs Wembley Ltd,OP_5K5_14718__000001_HA97AY,OPT,475 - 477 High Road,Wembley,Middlesex,,,HA9 7AY,Tel: 020 8900 0677, - ,,,No ratings yet Rate it yourself - /Services/opticians/LeaveReview/DefaultView.aspx?id=OP_5K5_14718__000001_HA97AY,0,0,
Paul Simon Opticians,OP_5K5_5997__000001_HA96AA,OPT,383 High Road,,Wembley,,,HA9 6AA,Tel: 020 8902 0271, - ,,,No ratings yet Rate it yourself - /Services/opticians/LeaveReview/DefaultView.aspx?id=OP_5K5_5997__000001_HA96AA,0,0,
Ultimate Eye Care,OP_5HX_1706__000002_UB11JY,OPT,,49 The Broadway,,Southall,,UB1 1JY,Tel: 020 8574 4158, - ,,,No ratings yet Rate it yourself - /Services/opticians/LeaveReview/DefaultView.aspx?id=OP_5HX_1706__000002_UB11JY,0,0,
Windsor House,OP_5GV_8379__000001_WD31BX,OPT,13 Church Street,,Rickmansworth,,,WD3 1BX,Tel: 01923 771404, - ,,,No ratings yet Rate it yourself - /Services/opticians/LeaveReview/DefaultView.aspx?id=OP_5GV_8379__000001_WD31BX,0,0,
Optical World,OP_5HX_11991__000001_UB11JR,OPT,11 The Broadway,Southall,Middlesex,,,UB1 1JR,Tel: 020 8893 5759, - ,,,No ratings yet Rate it yourself - /Services/opticians/LeaveReview/DefaultView.aspx?id=OP_5HX_11991__000001_UB11JR,0,0,
Boots-Watford - Harlequin Centre,OP_5GV_1923__000001_WD172TR,OPT,55 The Harlequin,,Hertfordshire,Watford,,WD17 2TR,Tel: 01923 225420, - ,,,1 rating Rate it yourself - /Services/opticians/LeaveReview/DefaultView.aspx?id=OP_5GV_1923__000001_WD172TR,,,
David Clulow (Opticians) Ltd,OP_5GV_7325__000001_WD12TQ,OPT,172 The Harlequin,,Watford,,,WD17 2TQ,Tel: 01923 222395, - ,,,No ratings yet Rate it yourself - /Services/opticians/LeaveReview/DefaultView.aspx?id=OP_5GV_7325__000001_WD12TQ,0,0,
Wiseman and Ashley Optical Centre,OP_5K5_14712__000001_NW99EL,OPT,561 Kingsbury Road,561 Kingsbury High Road,London,Kingsbury,,NW9 9EL,Tel: 020 8204 4348, - ,,,5 ratings Rate it yourself - /Services/opticians/LeaveReview/DefaultView.aspx?id=OP_5K5_14712__000001_NW99EL,,,
Vision Express,OP_5GV_5872__000001_WD12RS,OPT,Unit B12,Harlequinn Shopping Centre,Watford,,,WD17 2TH,Tel: 01923 210233, - ,,,No ratings yet Rate it yourself - /Services/opticians/LeaveReview/DefaultView.aspx?id=OP_5GV_5872__000001_WD12RS,0,0,
Boots-Rickmansworth,WD3 1AN_39472,OPT,,103 High Street,,Rickmansworth,Hertfordshire,WD3 1AN,Tel: 01923 777603, - ,,,No ratings yet Rate it yourself - /Services/opticians/LeaveReview/DefaultView.aspx?id=WD3 1AN_39472,0,0,
Specsaversn Opticians,OP_5GV_1247__000002_WD12RS,OPT,86-88 High Street,Watford,Hertfordshire,,,WD17 2GP,Tel: 01923 228888, - ,,,No ratings yet Rate it yourself - /Services/opticians/LeaveReview/DefaultView.aspx?id=OP_5GV_1247__000002_WD12RS,0,0,
Weston Opticians Ltd,OP_5GV_8021__000001_WD12BP,OPT,82a High Street,,Watford,,,WD17 2BP,Tel: 01923 241100, - ,,,4 ratings Rate it yourself - /Services/opticians/LeaveReview/DefaultView.aspx?id=OP_5GV_8021__000001_WD12BP,,,
Boots-Watford - High St,OP_5GV_9374__000001_WD12BS,OPT,78 High Street,,,Watford,Hertfordshire,WD17 2BP,Tel: 01923 229867, - ,,,No ratings yet Rate it yourself - /Services/opticians/LeaveReview/DefaultView.aspx?id=OP_5GV_9374__000001_WD12BS,0,0,
Stanfields Opticians,OP_5K5_7296__000001_NW99HJ,OPT,572 Kingsbury Road,Kingsbury,London,,,NW9 9HJ,Tel: 020 8204 7124, - ,,,No ratings yet Rate it yourself - /Services/opticians/LeaveReview/DefaultView.aspx?id=OP_5K5_7296__000001_NW99HJ,0,0,